You are viewing a plain text version of this content. The canonical link for it is here.
Posted to commits@taverna.apache.org by Apache Jenkins Server <je...@builds.apache.org> on 2017/05/17 23:30:41 UTC
Build failed in Jenkins: incubator-taverna-common-activities #268
See <https://builds.apache.org/job/incubator-taverna-common-activities/268/display/redirect>
------------------------------------------
[...truncated 716.61 KB...]
Generating <https://builds.apache.org/job/incubator-taverna-common-activities/ws/taverna-rest-activity/target/apidocs/overview-tree.html...>
Generating <https://builds.apache.org/job/incubator-taverna-common-activities/ws/taverna-rest-activity/target/apidocs/index-all.html...>
Generating <https://builds.apache.org/job/incubator-taverna-common-activities/ws/taverna-rest-activity/target/apidocs/deprecated-list.html...>
Building index for all classes...
Generating <https://builds.apache.org/job/incubator-taverna-common-activities/ws/taverna-rest-activity/target/apidocs/allclasses-frame.html...>
Generating <https://builds.apache.org/job/incubator-taverna-common-activities/ws/taverna-rest-activity/target/apidocs/allclasses-noframe.html...>
Generating <https://builds.apache.org/job/incubator-taverna-common-activities/ws/taverna-rest-activity/target/apidocs/index.html...>
Generating <https://builds.apache.org/job/incubator-taverna-common-activities/ws/taverna-rest-activity/target/apidocs/help-doc.html...>
5 warnings
[WARNING] Javadoc Warnings
[WARNING] <https://builds.apache.org/job/incubator-taverna-common-activities/ws/taverna-rest-activity/src/main/java/org/apache/taverna/activities/rest/HTTPRequestHandler.java>:112: warning - @return tag has no arguments.
[WARNING] <https://builds.apache.org/job/incubator-taverna-common-activities/ws/taverna-rest-activity/src/main/java/org/apache/taverna/activities/rest/HTTPRequestHandler.java>:410: warning - @return tag has no arguments.
[WARNING] <https://builds.apache.org/job/incubator-taverna-common-activities/ws/taverna-rest-activity/src/main/java/org/apache/taverna/activities/rest/HTTPRequestHandler.java>:514: warning - @param argument "redirection" is not a parameter name.
[WARNING] <https://builds.apache.org/job/incubator-taverna-common-activities/ws/taverna-rest-activity/src/main/java/org/apache/taverna/activities/rest/RESTActivity.java>:220: warning - Tag @link: can't find initiateHTTPRequest(String, RESTActivityConfigurationBean, String) in org.apache.taverna.activities.rest.HTTPRequestHandler
[WARNING] <https://builds.apache.org/job/incubator-taverna-common-activities/ws/taverna-rest-activity/src/main/java/org/apache/taverna/activities/rest/URISignatureHandler.java>:276: warning - @param argument "parameters" is not a parameter name.
[INFO] Building jar: <https://builds.apache.org/job/incubator-taverna-common-activities/ws/taverna-rest-activity/target/taverna-rest-activity-2.1.1-incubating-SNAPSHOT-javadoc.jar>
[WARNING] Failed to getClass for org.apache.felix.bundleplugin.BundlePlugin
[INFO]
[INFO] <<< maven-bundle-plugin:2.5.4:bundle (default-bundle) < package @ taverna-rest-activity <<<
[INFO]
[INFO] --- maven-bundle-plugin:2.5.4:bundle (default-bundle) @ taverna-rest-activity ---
[INFO]
[INFO] >>> maven-source-plugin:2.4:jar (default) > generate-sources @ taverna-rest-activity >>>
[WARNING] Failed to getClass for org.apache.maven.plugin.source.SourceJarMojo
[INFO]
[INFO] <<< maven-source-plugin:2.4:jar (default) < generate-sources @ taverna-rest-activity <<<
[INFO]
[INFO] --- maven-source-plugin:2.4:jar (default) @ taverna-rest-activity ---
[INFO] Building jar: <https://builds.apache.org/job/incubator-taverna-common-activities/ws/taverna-rest-activity/target/taverna-rest-activity-2.1.1-incubating-SNAPSHOT-sources.jar>
[INFO]
[INFO] >>> maven-source-plugin:2.4:test-jar (default) > generate-sources @ taverna-rest-activity >>>
[WARNING] Failed to getClass for org.apache.maven.plugin.source.TestSourceJarMojo
[INFO]
[INFO] <<< maven-source-plugin:2.4:test-jar (default) < generate-sources @ taverna-rest-activity <<<
[INFO]
[INFO] --- maven-source-plugin:2.4:test-jar (default) @ taverna-rest-activity ---
[INFO] Building jar: <https://builds.apache.org/job/incubator-taverna-common-activities/ws/taverna-rest-activity/target/taverna-rest-activity-2.1.1-incubating-SNAPSHOT-test-sources.jar>
[INFO]
[INFO] --- maven-jar-plugin:2.5:test-jar (default) @ taverna-rest-activity ---
[INFO]
[INFO] --- maven-site-plugin:3.4:attach-descriptor (attach-descriptor) @ taverna-rest-activity ---
[INFO]
[INFO] --- maven-javadoc-plugin:2.9.1:jar (attach-javadocs) @ taverna-rest-activity ---
[INFO]
Loading source files for package org.apache.taverna.activities.rest...
Constructing Javadoc information...
Standard Doclet version 1.8.0_121
Building tree for all the packages and classes...
Generating <https://builds.apache.org/job/incubator-taverna-common-activities/ws/taverna-rest-activity/target/apidocs/org/apache/taverna/activities/rest/HTTPRequest.html...>
Generating <https://builds.apache.org/job/incubator-taverna-common-activities/ws/taverna-rest-activity/target/apidocs/org/apache/taverna/activities/rest/HTTPRequestHandler.html...>
Generating <https://builds.apache.org/job/incubator-taverna-common-activities/ws/taverna-rest-activity/target/apidocs/org/apache/taverna/activities/rest/HTTPRequestHandler.HTTPRequestResponse.html...>
Generating <https://builds.apache.org/job/incubator-taverna-common-activities/ws/taverna-rest-activity/target/apidocs/org/apache/taverna/activities/rest/HTTPRequestHeader.html...>
Generating <https://builds.apache.org/job/incubator-taverna-common-activities/ws/taverna-rest-activity/target/apidocs/org/apache/taverna/activities/rest/RESTActivity.html...>
Generating <https://builds.apache.org/job/incubator-taverna-common-activities/ws/taverna-rest-activity/target/apidocs/org/apache/taverna/activities/rest/RESTActivity.DATA_FORMAT.html...>
Generating <https://builds.apache.org/job/incubator-taverna-common-activities/ws/taverna-rest-activity/target/apidocs/org/apache/taverna/activities/rest/RESTActivity.HTTP_METHOD.html...>
Generating <https://builds.apache.org/job/incubator-taverna-common-activities/ws/taverna-rest-activity/target/apidocs/org/apache/taverna/activities/rest/RESTActivityConfigurationBean.html...>
Generating <https://builds.apache.org/job/incubator-taverna-common-activities/ws/taverna-rest-activity/target/apidocs/org/apache/taverna/activities/rest/RESTActivityCredentialsProvider.html...>
Generating <https://builds.apache.org/job/incubator-taverna-common-activities/ws/taverna-rest-activity/target/apidocs/org/apache/taverna/activities/rest/RESTActivityCredentialsProvider.RESTActivityCredentials.html...>
Generating <https://builds.apache.org/job/incubator-taverna-common-activities/ws/taverna-rest-activity/target/apidocs/org/apache/taverna/activities/rest/RESTActivityFactory.html...>
Generating <https://builds.apache.org/job/incubator-taverna-common-activities/ws/taverna-rest-activity/target/apidocs/org/apache/taverna/activities/rest/RESTActivityHealthCheck.html...>
Generating <https://builds.apache.org/job/incubator-taverna-common-activities/ws/taverna-rest-activity/target/apidocs/org/apache/taverna/activities/rest/RESTActivityHealthChecker.html...>
Generating <https://builds.apache.org/job/incubator-taverna-common-activities/ws/taverna-rest-activity/target/apidocs/org/apache/taverna/activities/rest/URISignatureHandler.html...>
Generating <https://builds.apache.org/job/incubator-taverna-common-activities/ws/taverna-rest-activity/target/apidocs/org/apache/taverna/activities/rest/URISignatureHandler.URIGenerationFromSignatureException.html...>
Generating <https://builds.apache.org/job/incubator-taverna-common-activities/ws/taverna-rest-activity/target/apidocs/org/apache/taverna/activities/rest/URISignatureHandler.URISignatureParsingException.html...>
Generating <https://builds.apache.org/job/incubator-taverna-common-activities/ws/taverna-rest-activity/target/apidocs/org/apache/taverna/activities/rest/package-frame.html...>
Generating <https://builds.apache.org/job/incubator-taverna-common-activities/ws/taverna-rest-activity/target/apidocs/org/apache/taverna/activities/rest/package-summary.html...>
Generating <https://builds.apache.org/job/incubator-taverna-common-activities/ws/taverna-rest-activity/target/apidocs/org/apache/taverna/activities/rest/package-tree.html...>
Generating <https://builds.apache.org/job/incubator-taverna-common-activities/ws/taverna-rest-activity/target/apidocs/constant-values.html...>
Generating <https://builds.apache.org/job/incubator-taverna-common-activities/ws/taverna-rest-activity/target/apidocs/serialized-form.html...>
Generating <https://builds.apache.org/job/incubator-taverna-common-activities/ws/taverna-rest-activity/target/apidocs/org/apache/taverna/activities/rest/class-use/HTTPRequestHeader.html...>
Generating <https://builds.apache.org/job/incubator-taverna-common-activities/ws/taverna-rest-activity/target/apidocs/org/apache/taverna/activities/rest/class-use/HTTPRequest.html...>
Generating <https://builds.apache.org/job/incubator-taverna-common-activities/ws/taverna-rest-activity/target/apidocs/org/apache/taverna/activities/rest/class-use/RESTActivity.html...>
Generating <https://builds.apache.org/job/incubator-taverna-common-activities/ws/taverna-rest-activity/target/apidocs/org/apache/taverna/activities/rest/class-use/RESTActivity.HTTP_METHOD.html...>
Generating <https://builds.apache.org/job/incubator-taverna-common-activities/ws/taverna-rest-activity/target/apidocs/org/apache/taverna/activities/rest/class-use/RESTActivity.DATA_FORMAT.html...>
Generating <https://builds.apache.org/job/incubator-taverna-common-activities/ws/taverna-rest-activity/target/apidocs/org/apache/taverna/activities/rest/class-use/URISignatureHandler.html...>
Generating <https://builds.apache.org/job/incubator-taverna-common-activities/ws/taverna-rest-activity/target/apidocs/org/apache/taverna/activities/rest/class-use/URISignatureHandler.URISignatureParsingException.html...>
Generating <https://builds.apache.org/job/incubator-taverna-common-activities/ws/taverna-rest-activity/target/apidocs/org/apache/taverna/activities/rest/class-use/URISignatureHandler.URIGenerationFromSignatureException.html...>
Generating <https://builds.apache.org/job/incubator-taverna-common-activities/ws/taverna-rest-activity/target/apidocs/org/apache/taverna/activities/rest/class-use/RESTActivityCredentialsProvider.html...>
Generating <https://builds.apache.org/job/incubator-taverna-common-activities/ws/taverna-rest-activity/target/apidocs/org/apache/taverna/activities/rest/class-use/RESTActivityCredentialsProvider.RESTActivityCredentials.html...>
Generating <https://builds.apache.org/job/incubator-taverna-common-activities/ws/taverna-rest-activity/target/apidocs/org/apache/taverna/activities/rest/class-use/RESTActivityConfigurationBean.html...>
Generating <https://builds.apache.org/job/incubator-taverna-common-activities/ws/taverna-rest-activity/target/apidocs/org/apache/taverna/activities/rest/class-use/HTTPRequestHandler.html...>
Generating <https://builds.apache.org/job/incubator-taverna-common-activities/ws/taverna-rest-activity/target/apidocs/org/apache/taverna/activities/rest/class-use/HTTPRequestHandler.HTTPRequestResponse.html...>
Generating <https://builds.apache.org/job/incubator-taverna-common-activities/ws/taverna-rest-activity/target/apidocs/org/apache/taverna/activities/rest/class-use/RESTActivityHealthCheck.html...>
Generating <https://builds.apache.org/job/incubator-taverna-common-activities/ws/taverna-rest-activity/target/apidocs/org/apache/taverna/activities/rest/class-use/RESTActivityFactory.html...>
Generating <https://builds.apache.org/job/incubator-taverna-common-activities/ws/taverna-rest-activity/target/apidocs/org/apache/taverna/activities/rest/class-use/RESTActivityHealthChecker.html...>
Generating <https://builds.apache.org/job/incubator-taverna-common-activities/ws/taverna-rest-activity/target/apidocs/org/apache/taverna/activities/rest/package-use.html...>
Building index for all the packages and classes...
Generating <https://builds.apache.org/job/incubator-taverna-common-activities/ws/taverna-rest-activity/target/apidocs/overview-tree.html...>
Generating <https://builds.apache.org/job/incubator-taverna-common-activities/ws/taverna-rest-activity/target/apidocs/index-all.html...>
Generating <https://builds.apache.org/job/incubator-taverna-common-activities/ws/taverna-rest-activity/target/apidocs/deprecated-list.html...>
Building index for all classes...
Generating <https://builds.apache.org/job/incubator-taverna-common-activities/ws/taverna-rest-activity/target/apidocs/allclasses-frame.html...>
Generating <https://builds.apache.org/job/incubator-taverna-common-activities/ws/taverna-rest-activity/target/apidocs/allclasses-noframe.html...>
Generating <https://builds.apache.org/job/incubator-taverna-common-activities/ws/taverna-rest-activity/target/apidocs/index.html...>
Generating <https://builds.apache.org/job/incubator-taverna-common-activities/ws/taverna-rest-activity/target/apidocs/help-doc.html...>
5 warnings
[WARNING] Javadoc Warnings
[WARNING] <https://builds.apache.org/job/incubator-taverna-common-activities/ws/taverna-rest-activity/src/main/java/org/apache/taverna/activities/rest/HTTPRequestHandler.java>:112: warning - @return tag has no arguments.
[WARNING] <https://builds.apache.org/job/incubator-taverna-common-activities/ws/taverna-rest-activity/src/main/java/org/apache/taverna/activities/rest/HTTPRequestHandler.java>:410: warning - @return tag has no arguments.
[WARNING] <https://builds.apache.org/job/incubator-taverna-common-activities/ws/taverna-rest-activity/src/main/java/org/apache/taverna/activities/rest/HTTPRequestHandler.java>:514: warning - @param argument "redirection" is not a parameter name.
[WARNING] <https://builds.apache.org/job/incubator-taverna-common-activities/ws/taverna-rest-activity/src/main/java/org/apache/taverna/activities/rest/RESTActivity.java>:220: warning - Tag @link: can't find initiateHTTPRequest(String, RESTActivityConfigurationBean, String) in org.apache.taverna.activities.rest.HTTPRequestHandler
[WARNING] <https://builds.apache.org/job/incubator-taverna-common-activities/ws/taverna-rest-activity/src/main/java/org/apache/taverna/activities/rest/URISignatureHandler.java>:276: warning - @param argument "parameters" is not a parameter name.
[INFO] Building jar: <https://builds.apache.org/job/incubator-taverna-common-activities/ws/taverna-rest-activity/target/taverna-rest-activity-2.1.1-incubating-SNAPSHOT-javadoc.jar>
[INFO]
[INFO] --- maven-install-plugin:2.5.2:install (default-install) @ taverna-rest-activity ---
[INFO] Installing <https://builds.apache.org/job/incubator-taverna-common-activities/ws/taverna-rest-activity/target/taverna-rest-activity-2.1.1-incubating-SNAPSHOT.jar> to <https://builds.apache.org/job/incubator-taverna-common-activities/ws/.repository/org/apache/taverna/commonactivities/taverna-rest-activity/2.1.1-incubating-SNAPSHOT/taverna-rest-activity-2.1.1-incubating-SNAPSHOT.jar>
[INFO] Installing <https://builds.apache.org/job/incubator-taverna-common-activities/ws/taverna-rest-activity/pom.xml> to <https://builds.apache.org/job/incubator-taverna-common-activities/ws/.repository/org/apache/taverna/commonactivities/taverna-rest-activity/2.1.1-incubating-SNAPSHOT/taverna-rest-activity-2.1.1-incubating-SNAPSHOT.pom>
[INFO] Installing <https://builds.apache.org/job/incubator-taverna-common-activities/ws/taverna-rest-activity/target/taverna-rest-activity-2.1.1-incubating-SNAPSHOT-sources.jar> to <https://builds.apache.org/job/incubator-taverna-common-activities/ws/.repository/org/apache/taverna/commonactivities/taverna-rest-activity/2.1.1-incubating-SNAPSHOT/taverna-rest-activity-2.1.1-incubating-SNAPSHOT-sources.jar>
[INFO] Installing <https://builds.apache.org/job/incubator-taverna-common-activities/ws/taverna-rest-activity/target/taverna-rest-activity-2.1.1-incubating-SNAPSHOT-test-sources.jar> to <https://builds.apache.org/job/incubator-taverna-common-activities/ws/.repository/org/apache/taverna/commonactivities/taverna-rest-activity/2.1.1-incubating-SNAPSHOT/taverna-rest-activity-2.1.1-incubating-SNAPSHOT-test-sources.jar>
[INFO] Installing <https://builds.apache.org/job/incubator-taverna-common-activities/ws/taverna-rest-activity/target/taverna-rest-activity-2.1.1-incubating-SNAPSHOT-tests.jar> to <https://builds.apache.org/job/incubator-taverna-common-activities/ws/.repository/org/apache/taverna/commonactivities/taverna-rest-activity/2.1.1-incubating-SNAPSHOT/taverna-rest-activity-2.1.1-incubating-SNAPSHOT-tests.jar>
[INFO] Installing <https://builds.apache.org/job/incubator-taverna-common-activities/ws/taverna-rest-activity/target/taverna-rest-activity-2.1.1-incubating-SNAPSHOT-javadoc.jar> to <https://builds.apache.org/job/incubator-taverna-common-activities/ws/.repository/org/apache/taverna/commonactivities/taverna-rest-activity/2.1.1-incubating-SNAPSHOT/taverna-rest-activity-2.1.1-incubating-SNAPSHOT-javadoc.jar>
[INFO] Installing <https://builds.apache.org/job/incubator-taverna-common-activities/ws/taverna-rest-activity/target/taverna-rest-activity-2.1.1-incubating-SNAPSHOT-sources.jar> to <https://builds.apache.org/job/incubator-taverna-common-activities/ws/.repository/org/apache/taverna/commonactivities/taverna-rest-activity/2.1.1-incubating-SNAPSHOT/taverna-rest-activity-2.1.1-incubating-SNAPSHOT-sources.jar>
[INFO] Installing <https://builds.apache.org/job/incubator-taverna-common-activities/ws/taverna-rest-activity/target/taverna-rest-activity-2.1.1-incubating-SNAPSHOT-test-sources.jar> to <https://builds.apache.org/job/incubator-taverna-common-activities/ws/.repository/org/apache/taverna/commonactivities/taverna-rest-activity/2.1.1-incubating-SNAPSHOT/taverna-rest-activity-2.1.1-incubating-SNAPSHOT-test-sources.jar>
[INFO] Installing <https://builds.apache.org/job/incubator-taverna-common-activities/ws/taverna-rest-activity/target/taverna-rest-activity-2.1.1-incubating-SNAPSHOT-tests.jar> to <https://builds.apache.org/job/incubator-taverna-common-activities/ws/.repository/org/apache/taverna/commonactivities/taverna-rest-activity/2.1.1-incubating-SNAPSHOT/taverna-rest-activity-2.1.1-incubating-SNAPSHOT-tests.jar>
[INFO] Installing <https://builds.apache.org/job/incubator-taverna-common-activities/ws/taverna-rest-activity/target/taverna-rest-activity-2.1.1-incubating-SNAPSHOT-javadoc.jar> to <https://builds.apache.org/job/incubator-taverna-common-activities/ws/.repository/org/apache/taverna/commonactivities/taverna-rest-activity/2.1.1-incubating-SNAPSHOT/taverna-rest-activity-2.1.1-incubating-SNAPSHOT-javadoc.jar>
[WARNING] Failed to getClass for org.apache.felix.obrplugin.ObrInstall
[INFO]
[INFO] <<< maven-bundle-plugin:2.5.4:install (default-install) < install @ taverna-rest-activity <<<
[INFO]
[INFO] --- maven-bundle-plugin:2.5.4:install (default-install) @ taverna-rest-activity ---
[INFO] Installing org/apache/taverna/commonactivities/taverna-rest-activity/2.1.1-incubating-SNAPSHOT/taverna-rest-activity-2.1.1-incubating-SNAPSHOT.jar
[INFO] Writing OBR metadata
[INFO]
[INFO] ------------------------------------------------------------------------
[INFO] Building Apache Taverna Spreadsheet Import Activity 2.1.1-incubating-SNAPSHOT
[INFO] ------------------------------------------------------------------------
[INFO] Downloading: http://repository.mygrid.org.uk/artifactory/ext-release-local/org/apache/poi/poi/3.6/poi-3.6.pom
[INFO] Downloading: http://dl.bintray.com/spring/jars/org/apache/poi/poi/3.6/poi-3.6.pom
[INFO] Downloading: http://repository.springsource.com/maven/bundles/release/org/apache/poi/poi/3.6/poi-3.6.pom
[INFO] Downloading: http://repository.springsource.com/maven/bundles/external/org/apache/poi/poi/3.6/poi-3.6.pom
[INFO] Downloading: http://repo.spring.io/milestone/org/apache/poi/poi/3.6/poi-3.6.pom
[INFO] Downloading: https://repo.maven.apache.org/maven2/org/apache/poi/poi/3.6/poi-3.6.pom
[INFO] Downloaded: https://repo.maven.apache.org/maven2/org/apache/poi/poi/3.6/poi-3.6.pom (3 KB at 150.1 KB/sec)
[INFO] Downloading: http://repository.mygrid.org.uk/artifactory/ext-release-local/org/apache/poi/poi-ooxml/3.6/poi-ooxml-3.6.pom
[INFO] Downloading: http://dl.bintray.com/spring/jars/org/apache/poi/poi-ooxml/3.6/poi-ooxml-3.6.pom
[INFO] Downloading: http://repository.springsource.com/maven/bundles/release/org/apache/poi/poi-ooxml/3.6/poi-ooxml-3.6.pom
[INFO] Downloading: http://repository.springsource.com/maven/bundles/external/org/apache/poi/poi-ooxml/3.6/poi-ooxml-3.6.pom
[INFO] Downloading: http://repo.spring.io/milestone/org/apache/poi/poi-ooxml/3.6/poi-ooxml-3.6.pom
[INFO] Downloading: https://repo.maven.apache.org/maven2/org/apache/poi/poi-ooxml/3.6/poi-ooxml-3.6.pom
[INFO] Downloaded: https://repo.maven.apache.org/maven2/org/apache/poi/poi-ooxml/3.6/poi-ooxml-3.6.pom (3 KB at 188.9 KB/sec)
[INFO] Downloading: http://repository.mygrid.org.uk/artifactory/ext-release-local/org/apache/poi/poi-ooxml-schemas/3.6/poi-ooxml-schemas-3.6.pom
[INFO] Downloading: http://dl.bintray.com/spring/jars/org/apache/poi/poi-ooxml-schemas/3.6/poi-ooxml-schemas-3.6.pom
[INFO] Downloading: http://repository.springsource.com/maven/bundles/release/org/apache/poi/poi-ooxml-schemas/3.6/poi-ooxml-schemas-3.6.pom
[INFO] Downloading: http://repository.springsource.com/maven/bundles/external/org/apache/poi/poi-ooxml-schemas/3.6/poi-ooxml-schemas-3.6.pom
[INFO] Downloading: http://repo.spring.io/milestone/org/apache/poi/poi-ooxml-schemas/3.6/poi-ooxml-schemas-3.6.pom
[INFO] Downloading: https://repo.maven.apache.org/maven2/org/apache/poi/poi-ooxml-schemas/3.6/poi-ooxml-schemas-3.6.pom
[INFO] Downloaded: https://repo.maven.apache.org/maven2/org/apache/poi/poi-ooxml-schemas/3.6/poi-ooxml-schemas-3.6.pom (3 KB at 181.7 KB/sec)
[INFO] Downloading: http://repository.mygrid.org.uk/artifactory/ext-release-local/org/apache/geronimo/specs/geronimo-stax-api_1.0_spec/1.0/geronimo-stax-api_1.0_spec-1.0.pom
[INFO] Downloading: http://dl.bintray.com/spring/jars/org/apache/geronimo/specs/geronimo-stax-api_1.0_spec/1.0/geronimo-stax-api_1.0_spec-1.0.pom
[INFO] Downloading: http://repository.springsource.com/maven/bundles/release/org/apache/geronimo/specs/geronimo-stax-api_1.0_spec/1.0/geronimo-stax-api_1.0_spec-1.0.pom
[INFO] Downloading: http://repository.springsource.com/maven/bundles/external/org/apache/geronimo/specs/geronimo-stax-api_1.0_spec/1.0/geronimo-stax-api_1.0_spec-1.0.pom
[INFO] Downloading: http://repo.spring.io/milestone/org/apache/geronimo/specs/geronimo-stax-api_1.0_spec/1.0/geronimo-stax-api_1.0_spec-1.0.pom
[INFO] Downloading: https://repo.maven.apache.org/maven2/org/apache/geronimo/specs/geronimo-stax-api_1.0_spec/1.0/geronimo-stax-api_1.0_spec-1.0.pom
[INFO] Downloaded: https://repo.maven.apache.org/maven2/org/apache/geronimo/specs/geronimo-stax-api_1.0_spec/1.0/geronimo-stax-api_1.0_spec-1.0.pom (2 KB at 138.7 KB/sec)
[INFO] Downloading: http://repository.mygrid.org.uk/artifactory/ext-release-local/org/apache/geronimo/specs/specs/1.2/specs-1.2.pom
[INFO] Downloading: http://dl.bintray.com/spring/jars/org/apache/geronimo/specs/specs/1.2/specs-1.2.pom
[INFO] Downloading: http://repository.springsource.com/maven/bundles/release/org/apache/geronimo/specs/specs/1.2/specs-1.2.pom
[INFO] Downloading: http://repository.springsource.com/maven/bundles/external/org/apache/geronimo/specs/specs/1.2/specs-1.2.pom
[INFO] Downloading: http://repo.spring.io/milestone/org/apache/geronimo/specs/specs/1.2/specs-1.2.pom
[INFO] Downloading: https://repo.maven.apache.org/maven2/org/apache/geronimo/specs/specs/1.2/specs-1.2.pom
[INFO] Downloaded: https://repo.maven.apache.org/maven2/org/apache/geronimo/specs/specs/1.2/specs-1.2.pom (3 KB at 188.1 KB/sec)
[INFO] Downloading: http://repository.mygrid.org.uk/artifactory/ext-release-local/dom4j/dom4j/1.6.1/dom4j-1.6.1.pom
[INFO] Downloading: http://dl.bintray.com/spring/jars/dom4j/dom4j/1.6.1/dom4j-1.6.1.pom
[INFO] Downloading: http://repository.springsource.com/maven/bundles/release/dom4j/dom4j/1.6.1/dom4j-1.6.1.pom
[INFO] Downloading: http://repository.springsource.com/maven/bundles/external/dom4j/dom4j/1.6.1/dom4j-1.6.1.pom
[INFO] Downloading: http://repo.spring.io/milestone/dom4j/dom4j/1.6.1/dom4j-1.6.1.pom
[INFO] Downloading: https://repo.maven.apache.org/maven2/dom4j/dom4j/1.6.1/dom4j-1.6.1.pom
[INFO] Downloaded: https://repo.maven.apache.org/maven2/dom4j/dom4j/1.6.1/dom4j-1.6.1.pom (7 KB at 388.6 KB/sec)
[INFO] Downloading: http://repository.mygrid.org.uk/artifactory/ext-release-local/org/odftoolkit/odfdom-java/0.7/odfdom-java-0.7.pom
[INFO] Downloading: http://dl.bintray.com/spring/jars/org/odftoolkit/odfdom-java/0.7/odfdom-java-0.7.pom
[INFO] Downloading: http://repository.springsource.com/maven/bundles/release/org/odftoolkit/odfdom-java/0.7/odfdom-java-0.7.pom
[INFO] Downloading: http://repository.springsource.com/maven/bundles/external/org/odftoolkit/odfdom-java/0.7/odfdom-java-0.7.pom
[INFO] Downloading: http://repo.spring.io/milestone/org/odftoolkit/odfdom-java/0.7/odfdom-java-0.7.pom
[INFO] Downloading: https://repo.maven.apache.org/maven2/org/odftoolkit/odfdom-java/0.7/odfdom-java-0.7.pom
[INFO] Downloading: http://repository.mygrid.org.uk/artifactory/ext-release-local/net/sourceforge/javacsv/javacsv/2.0/javacsv-2.0.pom
[INFO] Downloading: http://dl.bintray.com/spring/jars/net/sourceforge/javacsv/javacsv/2.0/javacsv-2.0.pom
[INFO] Downloading: http://repository.springsource.com/maven/bundles/release/net/sourceforge/javacsv/javacsv/2.0/javacsv-2.0.pom
[INFO] Downloading: http://repository.springsource.com/maven/bundles/external/net/sourceforge/javacsv/javacsv/2.0/javacsv-2.0.pom
[INFO] Downloading: http://repo.spring.io/milestone/net/sourceforge/javacsv/javacsv/2.0/javacsv-2.0.pom
[INFO] Downloading: https://repo.maven.apache.org/maven2/net/sourceforge/javacsv/javacsv/2.0/javacsv-2.0.pom
[INFO] Downloaded: https://repo.maven.apache.org/maven2/net/sourceforge/javacsv/javacsv/2.0/javacsv-2.0.pom (865 B at 60.3 KB/sec)
[INFO] Downloading: http://repository.mygrid.org.uk/artifactory/ext-release-local/org/apache/xmlbeans/com.springsource.org.apache.xmlbeans/2.4.0/com.springsource.org.apache.xmlbeans-2.4.0.pom
[INFO] Downloading: http://dl.bintray.com/spring/jars/org/apache/xmlbeans/com.springsource.org.apache.xmlbeans/2.4.0/com.springsource.org.apache.xmlbeans-2.4.0.pom
[INFO] Downloading: http://repository.springsource.com/maven/bundles/release/org/apache/xmlbeans/com.springsource.org.apache.xmlbeans/2.4.0/com.springsource.org.apache.xmlbeans-2.4.0.pom
[INFO] Downloading: http://repository.springsource.com/maven/bundles/external/org/apache/xmlbeans/com.springsource.org.apache.xmlbeans/2.4.0/com.springsource.org.apache.xmlbeans-2.4.0.pom
[INFO] Downloaded: http://repository.springsource.com/maven/bundles/external/org/apache/xmlbeans/com.springsource.org.apache.xmlbeans/2.4.0/com.springsource.org.apache.xmlbeans-2.4.0.pom (851 B at 2.2 KB/sec)
[INFO] ------------------------------------------------------------------------
[INFO] Reactor Summary:
[INFO]
[INFO] Apache Taverna Common Activities ................... SUCCESS [ 11.059 s]
[INFO] Apache Taverna Beanshell Activity .................. SUCCESS [01:12 min]
[INFO] Apache Taverna External Tool Activity .............. SUCCESS [ 30.891 s]
[INFO] Apache Taverna Interaction Activity ................ SUCCESS [ 56.021 s]
[INFO] Apache Taverna REST Activity ....................... SUCCESS [ 30.746 s]
[INFO] Apache Taverna Spreadsheet Import Activity ......... FAILURE [ 8.565 s]
[INFO] Apache Taverna WSDL-generic Library ................ SKIPPED
[INFO] Apache Taverna WSDL Activity ....................... SKIPPED
[INFO] Apache Taverna XPath Activity ...................... SKIPPED
[INFO] ------------------------------------------------------------------------
[INFO] BUILD FAILURE
[INFO] ------------------------------------------------------------------------
[INFO] Total time: 03:44 min
[INFO] Finished at: 2017-05-17T23:30:31+00:00
[INFO] Final Memory: 53M/703M
[INFO] ------------------------------------------------------------------------
Waiting for Jenkins to finish collecting data
[ERROR] Failed to execute goal on project taverna-spreadsheet-import-activity: Could not resolve dependencies for project org.apache.taverna.commonactivities:taverna-spreadsheet-import-activity:bundle:2.1.1-incubating-SNAPSHOT: Failed to collect dependencies at org.odftoolkit:odfdom-java:jar:0.7: Failed to read artifact descriptor for org.odftoolkit:odfdom-java:jar:0.7: Could not transfer artifact org.odftoolkit:odfdom-java:pom:0.7 from/to mygrid-ext-release-local (http://repository.mygrid.org.uk/artifactory/ext-release-local): Failed to transfer file: http://repository.mygrid.org.uk/artifactory/ext-release-local/org/odftoolkit/odfdom-java/0.7/odfdom-java-0.7.pom. Return code is: 503 , ReasonPhrase:Service Temporarily Unavailable. -> [Help 1]
[ERROR]
[ERROR] To see the full stack trace of the errors, re-run Maven with the -e switch.
[ERROR] Re-run Maven using the -X switch to enable full debug logging.
[ERROR]
[ERROR] For more information about the errors and possible solutions, please read the following articles:
[ERROR] [Help 1] http://cwiki.apache.org/confluence/display/MAVEN/DependencyResolutionException
[ERROR]
[ERROR] After correcting the problems, you can resume the build with the command
[ERROR] mvn <goals> -rf :taverna-spreadsheet-import-activity
[JENKINS] Archiving <https://builds.apache.org/job/incubator-taverna-common-activities/ws/taverna-xpath-activity/pom.xml> to org.apache.taverna.commonactivities/taverna-xpath-activity/2.1.1-incubating-SNAPSHOT/taverna-xpath-activity-2.1.1-incubating-SNAPSHOT.pom
[JENKINS] Archiving <https://builds.apache.org/job/incubator-taverna-common-activities/ws/taverna-rest-activity/pom.xml> to org.apache.taverna.commonactivities/taverna-rest-activity/2.1.1-incubating-SNAPSHOT/taverna-rest-activity-2.1.1-incubating-SNAPSHOT.pom
[JENKINS] Archiving <https://builds.apache.org/job/incubator-taverna-common-activities/ws/taverna-rest-activity/target/taverna-rest-activity-2.1.1-incubating-SNAPSHOT.jar> to org.apache.taverna.commonactivities/taverna-rest-activity/2.1.1-incubating-SNAPSHOT/taverna-rest-activity-2.1.1-incubating-SNAPSHOT.jar
[JENKINS] Archiving <https://builds.apache.org/job/incubator-taverna-common-activities/ws/taverna-rest-activity/target/taverna-rest-activity-2.1.1-incubating-SNAPSHOT-sources.jar> to org.apache.taverna.commonactivities/taverna-rest-activity/2.1.1-incubating-SNAPSHOT/taverna-rest-activity-2.1.1-incubating-SNAPSHOT-sources.jar
[JENKINS] Archiving <https://builds.apache.org/job/incubator-taverna-common-activities/ws/taverna-rest-activity/target/taverna-rest-activity-2.1.1-incubating-SNAPSHOT-test-sources.jar> to org.apache.taverna.commonactivities/taverna-rest-activity/2.1.1-incubating-SNAPSHOT/taverna-rest-activity-2.1.1-incubating-SNAPSHOT-test-sources.jar
[JENKINS] Archiving <https://builds.apache.org/job/incubator-taverna-common-activities/ws/taverna-rest-activity/target/taverna-rest-activity-2.1.1-incubating-SNAPSHOT-tests.jar> to org.apache.taverna.commonactivities/taverna-rest-activity/2.1.1-incubating-SNAPSHOT/taverna-rest-activity-2.1.1-incubating-SNAPSHOT-tests.jar
[JENKINS] Archiving <https://builds.apache.org/job/incubator-taverna-common-activities/ws/taverna-rest-activity/target/taverna-rest-activity-2.1.1-incubating-SNAPSHOT-javadoc.jar> to org.apache.taverna.commonactivities/taverna-rest-activity/2.1.1-incubating-SNAPSHOT/taverna-rest-activity-2.1.1-incubating-SNAPSHOT-javadoc.jar
[JENKINS] Archiving <https://builds.apache.org/job/incubator-taverna-common-activities/ws/taverna-wsdl-activity/pom.xml> to org.apache.taverna.commonactivities/taverna-wsdl-activity/2.1.1-incubating-SNAPSHOT/taverna-wsdl-activity-2.1.1-incubating-SNAPSHOT.pom
[JENKINS] Archiving <https://builds.apache.org/job/incubator-taverna-common-activities/ws/taverna-external-tool-activity/pom.xml> to org.apache.taverna.commonactivities/taverna-external-tool-activity/2.1.1-incubating-SNAPSHOT/taverna-external-tool-activity-2.1.1-incubating-SNAPSHOT.pom
[JENKINS] Archiving <https://builds.apache.org/job/incubator-taverna-common-activities/ws/taverna-external-tool-activity/target/taverna-external-tool-activity-2.1.1-incubating-SNAPSHOT.jar> to org.apache.taverna.commonactivities/taverna-external-tool-activity/2.1.1-incubating-SNAPSHOT/taverna-external-tool-activity-2.1.1-incubating-SNAPSHOT.jar
[JENKINS] Archiving <https://builds.apache.org/job/incubator-taverna-common-activities/ws/taverna-external-tool-activity/target/taverna-external-tool-activity-2.1.1-incubating-SNAPSHOT-sources.jar> to org.apache.taverna.commonactivities/taverna-external-tool-activity/2.1.1-incubating-SNAPSHOT/taverna-external-tool-activity-2.1.1-incubating-SNAPSHOT-sources.jar
[JENKINS] Archiving <https://builds.apache.org/job/incubator-taverna-common-activities/ws/taverna-external-tool-activity/target/taverna-external-tool-activity-2.1.1-incubating-SNAPSHOT-test-sources.jar> to org.apache.taverna.commonactivities/taverna-external-tool-activity/2.1.1-incubating-SNAPSHOT/taverna-external-tool-activity-2.1.1-incubating-SNAPSHOT-test-sources.jar
[JENKINS] Archiving <https://builds.apache.org/job/incubator-taverna-common-activities/ws/taverna-external-tool-activity/target/taverna-external-tool-activity-2.1.1-incubating-SNAPSHOT-tests.jar> to org.apache.taverna.commonactivities/taverna-external-tool-activity/2.1.1-incubating-SNAPSHOT/taverna-external-tool-activity-2.1.1-incubating-SNAPSHOT-tests.jar
[JENKINS] Archiving <https://builds.apache.org/job/incubator-taverna-common-activities/ws/taverna-external-tool-activity/target/taverna-external-tool-activity-2.1.1-incubating-SNAPSHOT-javadoc.jar> to org.apache.taverna.commonactivities/taverna-external-tool-activity/2.1.1-incubating-SNAPSHOT/taverna-external-tool-activity-2.1.1-incubating-SNAPSHOT-javadoc.jar
[JENKINS] Archiving <https://builds.apache.org/job/incubator-taverna-common-activities/ws/taverna-wsdl-generic/pom.xml> to org.apache.taverna.commonactivities/taverna-wsdl-generic/2.1.1-incubating-SNAPSHOT/taverna-wsdl-generic-2.1.1-incubating-SNAPSHOT.pom
[JENKINS] Archiving <https://builds.apache.org/job/incubator-taverna-common-activities/ws/pom.xml> to org.apache.taverna.commonactivities/apache-taverna-common-activities/2.1.1-incubating-SNAPSHOT/apache-taverna-common-activities-2.1.1-incubating-SNAPSHOT.pom
[JENKINS] Archiving <https://builds.apache.org/job/incubator-taverna-common-activities/ws/target/apache-taverna-common-activities-2.1.1-incubating-SNAPSHOT-tests.jar> to org.apache.taverna.commonactivities/apache-taverna-common-activities/2.1.1-incubating-SNAPSHOT/apache-taverna-common-activities-2.1.1-incubating-SNAPSHOT-tests.jar
[JENKINS] Archiving <https://builds.apache.org/job/incubator-taverna-common-activities/ws/taverna-beanshell-activity/pom.xml> to org.apache.taverna.commonactivities/taverna-beanshell-activity/2.1.1-incubating-SNAPSHOT/taverna-beanshell-activity-2.1.1-incubating-SNAPSHOT.pom
[JENKINS] Archiving <https://builds.apache.org/job/incubator-taverna-common-activities/ws/taverna-beanshell-activity/target/taverna-beanshell-activity-2.1.1-incubating-SNAPSHOT.jar> to org.apache.taverna.commonactivities/taverna-beanshell-activity/2.1.1-incubating-SNAPSHOT/taverna-beanshell-activity-2.1.1-incubating-SNAPSHOT.jar
[JENKINS] Archiving <https://builds.apache.org/job/incubator-taverna-common-activities/ws/taverna-beanshell-activity/target/taverna-beanshell-activity-2.1.1-incubating-SNAPSHOT-sources.jar> to org.apache.taverna.commonactivities/taverna-beanshell-activity/2.1.1-incubating-SNAPSHOT/taverna-beanshell-activity-2.1.1-incubating-SNAPSHOT-sources.jar
[JENKINS] Archiving <https://builds.apache.org/job/incubator-taverna-common-activities/ws/taverna-beanshell-activity/target/taverna-beanshell-activity-2.1.1-incubating-SNAPSHOT-test-sources.jar> to org.apache.taverna.commonactivities/taverna-beanshell-activity/2.1.1-incubating-SNAPSHOT/taverna-beanshell-activity-2.1.1-incubating-SNAPSHOT-test-sources.jar
[JENKINS] Archiving <https://builds.apache.org/job/incubator-taverna-common-activities/ws/taverna-beanshell-activity/target/taverna-beanshell-activity-2.1.1-incubating-SNAPSHOT-tests.jar> to org.apache.taverna.commonactivities/taverna-beanshell-activity/2.1.1-incubating-SNAPSHOT/taverna-beanshell-activity-2.1.1-incubating-SNAPSHOT-tests.jar
[JENKINS] Archiving <https://builds.apache.org/job/incubator-taverna-common-activities/ws/taverna-beanshell-activity/target/taverna-beanshell-activity-2.1.1-incubating-SNAPSHOT-javadoc.jar> to org.apache.taverna.commonactivities/taverna-beanshell-activity/2.1.1-incubating-SNAPSHOT/taverna-beanshell-activity-2.1.1-incubating-SNAPSHOT-javadoc.jar
Compressed 511.13 KB of artifacts by 68.9% relative to #267
[JENKINS] Archiving <https://builds.apache.org/job/incubator-taverna-common-activities/ws/taverna-spreadsheet-import-activity/pom.xml> to org.apache.taverna.commonactivities/taverna-spreadsheet-import-activity/2.1.1-incubating-SNAPSHOT/taverna-spreadsheet-import-activity-2.1.1-incubating-SNAPSHOT.pom
[JENKINS] Archiving <https://builds.apache.org/job/incubator-taverna-common-activities/ws/taverna-interaction-activity/pom.xml> to org.apache.taverna.commonactivities/taverna-interaction-activity/2.1.1-incubating-SNAPSHOT/taverna-interaction-activity-2.1.1-incubating-SNAPSHOT.pom
[JENKINS] Archiving <https://builds.apache.org/job/incubator-taverna-common-activities/ws/taverna-interaction-activity/target/taverna-interaction-activity-2.1.1-incubating-SNAPSHOT.jar> to org.apache.taverna.commonactivities/taverna-interaction-activity/2.1.1-incubating-SNAPSHOT/taverna-interaction-activity-2.1.1-incubating-SNAPSHOT.jar
[JENKINS] Archiving <https://builds.apache.org/job/incubator-taverna-common-activities/ws/taverna-interaction-activity/target/taverna-interaction-activity-2.1.1-incubating-SNAPSHOT-sources.jar> to org.apache.taverna.commonactivities/taverna-interaction-activity/2.1.1-incubating-SNAPSHOT/taverna-interaction-activity-2.1.1-incubating-SNAPSHOT-sources.jar
[JENKINS] Archiving <https://builds.apache.org/job/incubator-taverna-common-activities/ws/taverna-interaction-activity/target/taverna-interaction-activity-2.1.1-incubating-SNAPSHOT-test-sources.jar> to org.apache.taverna.commonactivities/taverna-interaction-activity/2.1.1-incubating-SNAPSHOT/taverna-interaction-activity-2.1.1-incubating-SNAPSHOT-test-sources.jar
[JENKINS] Archiving <https://builds.apache.org/job/incubator-taverna-common-activities/ws/taverna-interaction-activity/target/taverna-interaction-activity-2.1.1-incubating-SNAPSHOT-tests.jar> to org.apache.taverna.commonactivities/taverna-interaction-activity/2.1.1-incubating-SNAPSHOT/taverna-interaction-activity-2.1.1-incubating-SNAPSHOT-tests.jar
[JENKINS] Archiving <https://builds.apache.org/job/incubator-taverna-common-activities/ws/taverna-interaction-activity/target/taverna-interaction-activity-2.1.1-incubating-SNAPSHOT-javadoc.jar> to org.apache.taverna.commonactivities/taverna-interaction-activity/2.1.1-incubating-SNAPSHOT/taverna-interaction-activity-2.1.1-incubating-SNAPSHOT-javadoc.jar
Compressed 469.56 KB of artifacts by 13.6% relative to #267
channel stopped
Jenkins build is back to normal :
incubator-taverna-common-activities #269
Posted by Apache Jenkins Server <je...@builds.apache.org>.
See <https://builds.apache.org/job/incubator-taverna-common-activities/269/display/redirect>