You are viewing a plain text version of this content. The canonical link for it is here.
Posted to builds@beam.apache.org by Apache Jenkins Server <je...@builds.apache.org> on 2023/09/20 16:29:24 UTC
Build failed in Jenkins: beam_PreCommit_Portable_Python_Cron #6955
See <https://ci-beam.apache.org/job/beam_PreCommit_Portable_Python_Cron/6955/display/redirect>
Changes:
------------------------------------------
[...truncated 1.54 MB...]
> Task :sdks:java:extensions:sql:expansion-service:createCheckerFrameworkManifest UP-TO-DATE
> Task :model:pipeline:extractIncludeProto UP-TO-DATE
> Task :sdks:java:build-tools:compileJava UP-TO-DATE
> Task :sdks:java:extensions:sql:udf:compileJava UP-TO-DATE
> Task :sdks:java:extensions:sql:expansion-service:processResources NO-SOURCE
> Task :sdks:java:extensions:sql:zetasql:createCheckerFrameworkManifest UP-TO-DATE
> Task :sdks:java:extensions:sql:udf:processResources NO-SOURCE
> Task :sdks:java:extensions:sql:udf:classes UP-TO-DATE
> Task :sdks:python:container:goPrepare UP-TO-DATE
> Task :model:pipeline:extractProto UP-TO-DATE
> Task :sdks:java:extensions:sql:zetasql:processResources NO-SOURCE
> Task :sdks:java:build-tools:processResources UP-TO-DATE
> Task :sdks:java:build-tools:classes UP-TO-DATE
> Task :sdks:java:extensions:sql:udf:jar UP-TO-DATE
> Task :sdks:java:build-tools:jar UP-TO-DATE
> Task :model:pipeline:generateProto UP-TO-DATE
> Task :sdks:python:container:py311:copyGolangLicenses
> Task :sdks:python:container:py311:copyLicenseScripts
> Task :sdks:python:container:py311:copyLicenses
> Task :sdks:python:container:py311:dockerClean UP-TO-DATE
> Task :model:pipeline:compileJava UP-TO-DATE
> Task :model:pipeline:processResources UP-TO-DATE
> Task :model:pipeline:classes UP-TO-DATE
> Task :model:pipeline:jar UP-TO-DATE
> Task :model:job-management:extractIncludeProto UP-TO-DATE
> Task :model:fn-execution:extractIncludeProto UP-TO-DATE
> Task :model:pipeline:shadowJar UP-TO-DATE
> Task :model:job-management:generateProto UP-TO-DATE
> Task :model:fn-execution:generateProto UP-TO-DATE
> Task :sdks:python:container:goBuild
/home/jenkins/go/bin/go1.21.1 build -o ./build/target/launcher/linux_amd64/boot boot.go piputil.go
> Task :model:job-management:compileJava UP-TO-DATE
> Task :model:job-management:classes UP-TO-DATE
> Task :model:job-management:shadowJar UP-TO-DATE
> Task :model:fn-execution:compileJava UP-TO-DATE
> Task :model:fn-execution:classes UP-TO-DATE
> Task :model:fn-execution:shadowJar UP-TO-DATE
> Task :sdks:python:container:py311:copyLauncherDependencies
> Task :sdks:java:extensions:sql:copyFmppTemplatesFromCalciteCore UP-TO-DATE
> Task :sdks:java:extensions:sql:copyFmppTemplatesFromSrc UP-TO-DATE
> Task :sdks:java:core:compileJava UP-TO-DATE
> Task :sdks:java:core:classes UP-TO-DATE
> Task :sdks:java:core:shadowJar UP-TO-DATE
> Task :runners:local-java:compileJava UP-TO-DATE
> Task :runners:local-java:classes UP-TO-DATE
> Task :runners:local-java:jar UP-TO-DATE
> Task :sdks:java:extensions:join-library:compileJava UP-TO-DATE
> Task :sdks:java:extensions:join-library:classes UP-TO-DATE
> Task :sdks:java:extensions:join-library:jar UP-TO-DATE
> Task :sdks:java:extensions:arrow:compileJava UP-TO-DATE
> Task :sdks:java:extensions:arrow:classes UP-TO-DATE
> Task :sdks:java:extensions:protobuf:extractIncludeProto UP-TO-DATE
> Task :sdks:java:fn-execution:compileJava UP-TO-DATE
> Task :sdks:java:extensions:arrow:jar UP-TO-DATE
> Task :sdks:java:fn-execution:classes UP-TO-DATE
> Task :sdks:java:extensions:protobuf:generateProto NO-SOURCE
> Task :sdks:java:extensions:avro:compileJava UP-TO-DATE
> Task :sdks:java:extensions:avro:classes UP-TO-DATE
> Task :sdks:java:extensions:avro:jar UP-TO-DATE
> Task :sdks:java:fn-execution:jar UP-TO-DATE
> Task :sdks:java:io:mongodb:compileJava UP-TO-DATE
> Task :sdks:java:io:mongodb:classes UP-TO-DATE
> Task :sdks:java:io:mongodb:jar UP-TO-DATE
> Task :sdks:java:extensions:protobuf:compileJava UP-TO-DATE
> Task :sdks:java:extensions:protobuf:classes UP-TO-DATE
> Task :sdks:java:extensions:protobuf:jar UP-TO-DATE
> Task :sdks:java:io:hadoop-common:compileJava UP-TO-DATE
> Task :sdks:java:io:hadoop-common:classes UP-TO-DATE
> Task :runners:core-construction-java:compileJava UP-TO-DATE
> Task :runners:core-construction-java:classes UP-TO-DATE
> Task :runners:core-construction-java:jar UP-TO-DATE
> Task :sdks:java:io:hadoop-common:jar UP-TO-DATE
> Task :sdks:java:io:amazon-web-services2:compileJava UP-TO-DATE
> Task :sdks:java:io:amazon-web-services2:classes UP-TO-DATE
> Task :sdks:java:io:amazon-web-services2:jar UP-TO-DATE
> Task :sdks:java:io:parquet:compileJava UP-TO-DATE
> Task :sdks:java:io:parquet:classes UP-TO-DATE
> Task :sdks:java:io:parquet:jar UP-TO-DATE
> Task :runners:core-java:compileJava UP-TO-DATE
> Task :runners:core-java:classes UP-TO-DATE
> Task :runners:core-java:jar UP-TO-DATE
> Task :sdks:java:extensions:google-cloud-platform-core:compileJava UP-TO-DATE
> Task :sdks:java:extensions:google-cloud-platform-core:classes UP-TO-DATE
> Task :sdks:java:extensions:google-cloud-platform-core:jar UP-TO-DATE
> Task :sdks:java:harness:compileJava UP-TO-DATE
> Task :sdks:java:harness:classes UP-TO-DATE
> Task :sdks:java:harness:jar UP-TO-DATE
> Task :sdks:java:harness:shadowJar UP-TO-DATE
> Task :runners:java-fn-execution:compileJava UP-TO-DATE
> Task :runners:java-fn-execution:classes UP-TO-DATE
> Task :runners:java-fn-execution:jar UP-TO-DATE
> Task :sdks:java:expansion-service:compileJava UP-TO-DATE
> Task :sdks:java:expansion-service:classes UP-TO-DATE
> Task :sdks:java:expansion-service:jar UP-TO-DATE
> Task :runners:java-job-service:compileJava UP-TO-DATE
> Task :runners:java-job-service:classes UP-TO-DATE
> Task :runners:java-job-service:jar UP-TO-DATE
> Task :runners:direct-java:compileJava UP-TO-DATE
> Task :runners:direct-java:classes UP-TO-DATE
> Task :sdks:java:io:kafka:compileJava UP-TO-DATE
> Task :sdks:java:io:kafka:classes UP-TO-DATE
> Task :runners:direct-java:shadowJar UP-TO-DATE
> Task :sdks:java:io:kafka:jar UP-TO-DATE
> Task :runners:flink:1.16:compileJava UP-TO-DATE
> Task :runners:flink:1.16:classes UP-TO-DATE
> Task :runners:flink:1.16:jar UP-TO-DATE
> Task :runners:flink:1.16:job-server:compileJava NO-SOURCE
> Task :runners:flink:1.16:job-server:classes UP-TO-DATE
> Task :sdks:java:io:google-cloud-platform:compileJava UP-TO-DATE
> Task :sdks:java:io:google-cloud-platform:classes UP-TO-DATE
> Task :sdks:java:io:google-cloud-platform:jar UP-TO-DATE
> Task :sdks:java:extensions:sql:generateFmppSources
> Task :sdks:java:extensions:sql:compileJavacc UP-TO-DATE
> Task :sdks:java:extensions:sql:createCheckerFrameworkManifest UP-TO-DATE
> Task :sdks:java:extensions:sql:compileJava UP-TO-DATE
> Task :sdks:java:extensions:sql:processResources UP-TO-DATE
> Task :sdks:java:extensions:sql:classes UP-TO-DATE
> Task :sdks:java:extensions:sql:jar UP-TO-DATE
> Task :sdks:java:extensions:sql:zetasql:compileJava UP-TO-DATE
> Task :sdks:java:extensions:sql:zetasql:classes UP-TO-DATE
> Task :sdks:java:extensions:sql:zetasql:jar UP-TO-DATE
> Task :sdks:java:extensions:sql:expansion-service:compileJava UP-TO-DATE
> Task :sdks:java:extensions:sql:expansion-service:classes UP-TO-DATE
> Task :sdks:java:extensions:sql:expansion-service:jar UP-TO-DATE
> Task :sdks:java:extensions:sql:expansion-service:shadowJar UP-TO-DATE
> Task :runners:flink:1.16:job-server:shadowJar UP-TO-DATE
> Task :sdks:python:test-suites:portable:py311:setupVirtualenv
Requirement already satisfied: pip in <https://ci-beam.apache.org/job/beam_PreCommit_Portable_Python_Cron/ws/src/build/gradleenv/-1720702906/lib/python3.11/site-packages> (22.3.1)
Collecting pip
Using cached pip-23.2.1-py3-none-any.whl (2.1 MB)
> Task :sdks:python:setupVirtualenv FAILED
ERROR: Could not find a version that satisfies the requirement pip (from versions: none)
ERROR: No matching distribution found for pip
> Task :sdks:python:test-suites:portable:py311:setupVirtualenv
Installing collected packages: pip
Attempting uninstall: pip
Found existing installation: pip 22.3.1
Uninstalling pip-22.3.1:
Successfully uninstalled pip-22.3.1
Successfully installed pip-23.2.1
Collecting tox
Obtaining dependency information for tox from https://files.pythonhosted.org/packages/f5/f9/963052e8b825645c54262dce7b7c88691505e3b9ee10a3e3667711eaaf21/tox-4.11.3-py3-none-any.whl.metadata
Using cached tox-4.11.3-py3-none-any.whl.metadata (5.0 kB)
Requirement already satisfied: setuptools in <https://ci-beam.apache.org/job/beam_PreCommit_Portable_Python_Cron/ws/src/build/gradleenv/-1720702906/lib/python3.11/site-packages> (from -r <https://ci-beam.apache.org/job/beam_PreCommit_Portable_Python_Cron/ws/src/sdks/python/build-requirements.txt> (line 20)) (65.5.0)
Collecting setuptools (from -r <https://ci-beam.apache.org/job/beam_PreCommit_Portable_Python_Cron/ws/src/sdks/python/build-requirements.txt> (line 20))
Obtaining dependency information for setuptools from https://files.pythonhosted.org/packages/bb/26/7945080113158354380a12ce26873dd6c1ebd88d47f5bc24e2c5bb38c16a/setuptools-68.2.2-py3-none-any.whl.metadata
Using cached setuptools-68.2.2-py3-none-any.whl.metadata (6.3 kB)
Collecting wheel>=0.36.0 (from -r <https://ci-beam.apache.org/job/beam_PreCommit_Portable_Python_Cron/ws/src/sdks/python/build-requirements.txt> (line 21))
Obtaining dependency information for wheel>=0.36.0 from https://files.pythonhosted.org/packages/b8/8b/31273bf66016be6ad22bb7345c37ff350276cfd46e389a0c2ac5da9d9073/wheel-0.41.2-py3-none-any.whl.metadata
Using cached wheel-0.41.2-py3-none-any.whl.metadata (2.2 kB)
Collecting grpcio-tools==1.53.0 (from -r <https://ci-beam.apache.org/job/beam_PreCommit_Portable_Python_Cron/ws/src/sdks/python/build-requirements.txt> (line 22))
Using cached grpcio_tools-1.53.0-cp311-cp311-manylinux_2_17_x86_64.manylinux2014_x86_64.whl (2.4 MB)
Collecting mypy-protobuf==3.5.0 (from -r <https://ci-beam.apache.org/job/beam_PreCommit_Portable_Python_Cron/ws/src/sdks/python/build-requirements.txt> (line 23))
Obtaining dependency information for mypy-protobuf==3.5.0 from https://files.pythonhosted.org/packages/b3/b8/10a141d38da112507c633eee498aa9939df34dfb417c93f0a246c4931eb7/mypy_protobuf-3.5.0-py3-none-any.whl.metadata
Using cached mypy_protobuf-3.5.0-py3-none-any.whl.metadata (474 bytes)
Collecting distlib==0.3.7 (from -r <https://ci-beam.apache.org/job/beam_PreCommit_Portable_Python_Cron/ws/src/sdks/python/build-requirements.txt> (line 25))
Obtaining dependency information for distlib==0.3.7 from https://files.pythonhosted.org/packages/43/a0/9ba967fdbd55293bacfc1507f58e316f740a3b231fc00e3d86dc39bc185a/distlib-0.3.7-py2.py3-none-any.whl.metadata
Using cached distlib-0.3.7-py2.py3-none-any.whl.metadata (5.1 kB)
Collecting numpy<1.26,>=1.14.3 (from -r <https://ci-beam.apache.org/job/beam_PreCommit_Portable_Python_Cron/ws/src/sdks/python/build-requirements.txt> (line 28))
Obtaining dependency information for numpy<1.26,>=1.14.3 from https://files.pythonhosted.org/packages/32/6a/65dbc57a89078af9ff8bfcd4c0761a50172d90192eaeb1b6f56e5fbf1c3d/numpy-1.25.2-cp311-cp311-manylinux_2_17_x86_64.manylinux2014_x86_64.whl.metadata
Using cached numpy-1.25.2-cp311-cp311-manylinux_2_17_x86_64.manylinux2014_x86_64.whl.metadata (5.6 kB)
Collecting protobuf<5.0dev,>=4.21.6 (from grpcio-tools==1.53.0->-r <https://ci-beam.apache.org/job/beam_PreCommit_Portable_Python_Cron/ws/src/sdks/python/build-requirements.txt> (line 22))
Obtaining dependency information for protobuf<5.0dev,>=4.21.6 from https://files.pythonhosted.org/packages/bb/c3/6a06208ecf0934ecaf509b51c52a6cf688586f54ae81ac65c56124571494/protobuf-4.24.3-cp37-abi3-manylinux2014_x86_64.whl.metadata
Using cached protobuf-4.24.3-cp37-abi3-manylinux2014_x86_64.whl.metadata (540 bytes)
Collecting grpcio>=1.53.0 (from grpcio-tools==1.53.0->-r <https://ci-beam.apache.org/job/beam_PreCommit_Portable_Python_Cron/ws/src/sdks/python/build-requirements.txt> (line 22))
Obtaining dependency information for grpcio>=1.53.0 from https://files.pythonhosted.org/packages/98/18/10a3af9b1f2521ad765e9fd518783b8883268357fef397d1b57585d1bef8/grpcio-1.58.0-cp311-cp311-manylinux_2_17_x86_64.manylinux2014_x86_64.whl.metadata
Using cached grpcio-1.58.0-cp311-cp311-manylinux_2_17_x86_64.manylinux2014_x86_64.whl.metadata (4.0 kB)
Collecting types-protobuf>=4.23.0.2 (from mypy-protobuf==3.5.0->-r <https://ci-beam.apache.org/job/beam_PreCommit_Portable_Python_Cron/ws/src/sdks/python/build-requirements.txt> (line 23))
Obtaining dependency information for types-protobuf>=4.23.0.2 from https://files.pythonhosted.org/packages/ee/a8/2bb7fe4322a251993e057bcb3b746ed9530ef483b1dc9d399823025070b4/types_protobuf-4.24.0.2-py3-none-any.whl.metadata
Using cached types_protobuf-4.24.0.2-py3-none-any.whl.metadata (1.7 kB)
Collecting cachetools>=5.3.1 (from tox)
Obtaining dependency information for cachetools>=5.3.1 from https://files.pythonhosted.org/packages/a9/c9/c8a7710f2cedcb1db9224fdd4d8307c9e48cbddc46c18b515fefc0f1abbe/cachetools-5.3.1-py3-none-any.whl.metadata
Using cached cachetools-5.3.1-py3-none-any.whl.metadata (5.2 kB)
Collecting chardet>=5.2 (from tox)
Obtaining dependency information for chardet>=5.2 from https://files.pythonhosted.org/packages/38/6f/f5fbc992a329ee4e0f288c1fe0e2ad9485ed064cac731ed2fe47dcc38cbf/chardet-5.2.0-py3-none-any.whl.metadata
Using cached chardet-5.2.0-py3-none-any.whl.metadata (3.4 kB)
Collecting colorama>=0.4.6 (from tox)
Using cached colorama-0.4.6-py2.py3-none-any.whl (25 kB)
Collecting filelock>=3.12.3 (from tox)
Obtaining dependency information for filelock>=3.12.3 from https://files.pythonhosted.org/packages/5e/5d/97afbafd9d584ff1b45fcb354a479a3609bd97f912f8f1f6c563cb1fae21/filelock-3.12.4-py3-none-any.whl.metadata
Using cached filelock-3.12.4-py3-none-any.whl.metadata (2.8 kB)
Collecting packaging>=23.1 (from tox)
Using cached packaging-23.1-py3-none-any.whl (48 kB)
Collecting platformdirs>=3.10 (from tox)
Obtaining dependency information for platformdirs>=3.10 from https://files.pythonhosted.org/packages/14/51/fe5a0d6ea589f0d4a1b97824fb518962ad48b27cd346dcdfa2405187997a/platformdirs-3.10.0-py3-none-any.whl.metadata
Using cached platformdirs-3.10.0-py3-none-any.whl.metadata (11 kB)
Collecting pluggy>=1.3 (from tox)
Obtaining dependency information for pluggy>=1.3 from https://files.pythonhosted.org/packages/05/b8/42ed91898d4784546c5f06c60506400548db3f7a4b3fb441cba4e5c17952/pluggy-1.3.0-py3-none-any.whl.metadata
Using cached pluggy-1.3.0-py3-none-any.whl.metadata (4.3 kB)
Collecting pyproject-api>=1.6.1 (from tox)
Obtaining dependency information for pyproject-api>=1.6.1 from https://files.pythonhosted.org/packages/cf/b4/39eea50542e50e93876ebc09c4349a9c9eee9f6b9c9d30f88c7dc5433db8/pyproject_api-1.6.1-py3-none-any.whl.metadata
Using cached pyproject_api-1.6.1-py3-none-any.whl.metadata (2.8 kB)
Collecting virtualenv>=20.24.3 (from tox)
Obtaining dependency information for virtualenv>=20.24.3 from https://files.pythonhosted.org/packages/4e/8b/f0d3a468c0186c603217a6656ea4f49259630e8ed99558501d92f6ff7dc3/virtualenv-20.24.5-py3-none-any.whl.metadata
Using cached virtualenv-20.24.5-py3-none-any.whl.metadata (4.5 kB)
Using cached mypy_protobuf-3.5.0-py3-none-any.whl (16 kB)
Using cached distlib-0.3.7-py2.py3-none-any.whl (468 kB)
Using cached tox-4.11.3-py3-none-any.whl (153 kB)
Using cached setuptools-68.2.2-py3-none-any.whl (807 kB)
Using cached wheel-0.41.2-py3-none-any.whl (64 kB)
Using cached numpy-1.25.2-cp311-cp311-manylinux_2_17_x86_64.manylinux2014_x86_64.whl (18.2 MB)
Using cached cachetools-5.3.1-py3-none-any.whl (9.3 kB)
Using cached chardet-5.2.0-py3-none-any.whl (199 kB)
Using cached filelock-3.12.4-py3-none-any.whl (11 kB)
Using cached grpcio-1.58.0-cp311-cp311-manylinux_2_17_x86_64.manylinux2014_x86_64.whl (5.3 MB)
Using cached platformdirs-3.10.0-py3-none-any.whl (17 kB)
Using cached pluggy-1.3.0-py3-none-any.whl (18 kB)
Using cached protobuf-4.24.3-cp37-abi3-manylinux2014_x86_64.whl (311 kB)
Using cached pyproject_api-1.6.1-py3-none-any.whl (12 kB)
Using cached types_protobuf-4.24.0.2-py3-none-any.whl (62 kB)
Using cached virtualenv-20.24.5-py3-none-any.whl (3.7 MB)
Installing collected packages: types-protobuf, distlib, wheel, setuptools, protobuf, pluggy, platformdirs, packaging, numpy, grpcio, filelock, colorama, chardet, cachetools, virtualenv, pyproject-api, mypy-protobuf, grpcio-tools, tox
Attempting uninstall: setuptools
Found existing installation: setuptools 65.5.0
Uninstalling setuptools-65.5.0:
Successfully uninstalled setuptools-65.5.0
Successfully installed cachetools-5.3.1 chardet-5.2.0 colorama-0.4.6 distlib-0.3.7 filelock-3.12.4 grpcio-1.58.0 grpcio-tools-1.53.0 mypy-protobuf-3.5.0 numpy-1.25.2 packaging-23.1 platformdirs-3.10.0 pluggy-1.3.0 protobuf-4.24.3 pyproject-api-1.6.1 setuptools-68.2.2 tox-4.11.3 types-protobuf-4.24.0.2 virtualenv-20.24.5 wheel-0.41.2
FAILURE: Build failed with an exception.
* What went wrong:
Execution failed for task ':sdks:python:setupVirtualenv'.
> Process 'command 'sh'' finished with non-zero exit value 1
* Try:
> Run with --stacktrace option to get the stack trace.
> Run with --info or --debug option to get more log output.
* Get more help at https://help.gradle.org
Deprecated Gradle features were used in this build, making it incompatible with Gradle 8.0.
You can use '--warning-mode all' to show the individual deprecation warnings and determine if they come from your own scripts or plugins.
See https://docs.gradle.org/7.6.2/userguide/command_line_interface.html#sec:command_line_warnings
BUILD FAILED in 36s
137 actionable tasks: 8 executed, 129 up-to-date
Publishing build scan...
https://ge.apache.org/s/4ki35kxv7gqn4
Build step 'Invoke Gradle script' changed build result to FAILURE
Build step 'Invoke Gradle script' marked build as failure
---------------------------------------------------------------------
To unsubscribe, e-mail: builds-unsubscribe@beam.apache.org
For additional commands, e-mail: builds-help@beam.apache.org
Jenkins build is back to normal : beam_PreCommit_Portable_Python_Cron #6956
Posted by Apache Jenkins Server <je...@builds.apache.org>.
See <https://ci-beam.apache.org/job/beam_PreCommit_Portable_Python_Cron/6956/display/redirect>
---------------------------------------------------------------------
To unsubscribe, e-mail: builds-unsubscribe@beam.apache.org
For additional commands, e-mail: builds-help@beam.apache.org