You are viewing a plain text version of this content. The canonical link for it is here.
Posted to builds@cassandra.apache.org by Apache Jenkins Server <je...@builds.apache.org> on 2021/09/21 05:37:02 UTC

Build complete: Cassandra-trunk #723 [UNSTABLE] e9645cc7a4e189b58eb0ba20269dfaec9b46da29

-------------------------------------------------------------------------------
Build Cassandra-trunk #723 Still Unstable
URL: https://ci-cassandra.apache.org/job/Cassandra-trunk/723/
-------------------------------------------------------------------------------
Changes:
[Ekaterina Dimitrova] Fix flaky test DatabaseDescriptorRefTest.


-------------------------------------------------------------------------------
Failed Tests:
23 tests failed.
FAILED:  dtest-offheap.snapshot_test.TestSnapshot.test_snapshot_and_restore_drop_table_remove_dropped_column
FAILED:  org.apache.cassandra.distributed.upgrade.CompactStorageUpgradeTest.compactStorageHiddenColumnTest
FAILED:  org.apache.cassandra.tools.SSTableExportTest.testPKArgOutOfOrder
FAILED:  org.apache.cassandra.tools.SSTableExportTest.testNoArgsPrintsHelp
FAILED:  org.apache.cassandra.tools.SSTableExportTest.testExcludePKArgOutOfOrder
FAILED:  org.apache.cassandra.tools.SSTableExportTest.testMaybeChangeDocs
FAILED:  org.apache.cassandra.tools.SSTableExportTest.testWrongArgFailsAndPrintsHelp
FAILED:  org.apache.cassandra.net.ConnectionTest.testMessageDeliveryOnReconnect
FAILED:  org.apache.cassandra.tools.SSTableExportTest.testPKArgOutOfOrder-cdc
FAILED:  org.apache.cassandra.tools.SSTableExportTest.testNoArgsPrintsHelp-cdc
FAILED:  org.apache.cassandra.tools.SSTableExportTest.testExcludePKArgOutOfOrder-cdc
FAILED:  org.apache.cassandra.tools.SSTableExportTest.testMaybeChangeDocs-cdc
FAILED:  org.apache.cassandra.tools.SSTableExportTest.testWrongArgFailsAndPrintsHelp-cdc
FAILED:  org.apache.cassandra.tools.SSTableExportTest.testPKArgOutOfOrder-compression
FAILED:  org.apache.cassandra.tools.SSTableExportTest.testNoArgsPrintsHelp-compression
FAILED:  org.apache.cassandra.tools.SSTableExportTest.testExcludePKArgOutOfOrder-compression
FAILED:  org.apache.cassandra.tools.SSTableExportTest.testMaybeChangeDocs-compression
FAILED:  org.apache.cassandra.tools.SSTableExportTest.testWrongArgFailsAndPrintsHelp-compression
FAILED:  org.apache.cassandra.tools.SSTableExportTest.testPKArgOutOfOrder-compression
FAILED:  org.apache.cassandra.tools.SSTableExportTest.testNoArgsPrintsHelp-compression
FAILED:  org.apache.cassandra.tools.SSTableExportTest.testExcludePKArgOutOfOrder-compression
FAILED:  org.apache.cassandra.tools.SSTableExportTest.testMaybeChangeDocs-compression
FAILED:  org.apache.cassandra.tools.SSTableExportTest.testWrongArgFailsAndPrintsHelp-compression

-------------------------------------------------------------------------------
For complete test report and logs see https://nightlies.apache.org/cassandra/Cassandra-trunk/723/