You are viewing a plain text version of this content. The canonical link for it is here.
Posted to builds@cassandra.apache.org by Apache Jenkins Server <je...@builds.apache.org> on 2021/04/20 04:44:13 UTC
Build complete: Cassandra-3.0 #122 [UNSTABLE]
83c2175abc580e8265db25da4853720d7c448b12
-------------------------------------------------------------------------------
Build Cassandra-3.0 #122 Still Unstable
URL: https://ci-cassandra.apache.org/job/Cassandra-3.0/122/
-------------------------------------------------------------------------------
Changes:
[Ekaterina Dimitrova] Ninja fix, add header to the Circle LOWRES and HIGHRES config files
-------------------------------------------------------------------------------
Failed Tests:
13 tests failed.
FAILED: org.apache.cassandra.distributed.test.RepairOperationalTest.repairUnreplicatedKStest
FAILED: dtest.offline_tools_test.TestOfflineTools.test_sstableverify
FAILED: org.apache.cassandra.concurrent.LongSharedExecutorPoolTest.testPromptnessOfExecution
FAILED: org.apache.cassandra.concurrent.LongSharedExecutorPoolTest.testPromptnessOfExecution
FAILED: org.apache.cassandra.concurrent.LongSharedExecutorPoolTest.testPromptnessOfExecution
FAILED: org.apache.cassandra.concurrent.LongSharedExecutorPoolTest.testPromptnessOfExecution
FAILED: org.apache.cassandra.concurrent.LongSharedExecutorPoolTest.testPromptnessOfExecution
FAILED: dtest-upgrade.upgrade_tests.thrift_upgrade_test.TestUpgradeSuperColumnsThrough.test_dense_supercolumn
FAILED: dtest-large-novnode.replace_address_test.TestReplaceAddress.test_restart_failed_replace
FAILED: dtest-large.replace_address_test.TestReplaceAddress.test_restart_failed_replace
FAILED: dtest-upgrade.upgrade_internal_auth_test.TestAuthUpgrade.test_upgrade_to_30
FAILED: dtest-upgrade.upgrade_tests.thrift_upgrade_test.TestUpgradeSuperColumnsThrough.test_sparse_supercolumn
FAILED: dtest-upgrade.upgrade_internal_auth_test.TestAuthUpgrade.test_upgrade_legacy_table
-------------------------------------------------------------------------------
For complete test report and logs see https://nightlies.apache.org/cassandra/Cassandra-3.0/122/