You are viewing a plain text version of this content. The canonical link for it is here.
Posted to notifications@maven.apache.org by Apache Jenkins Server <je...@builds.apache.org> on 2012/05/25 17:13:28 UTC

Build failed in Jenkins: maven-plugin-tools-m2 #54

See <https://builds.apache.org/job/maven-plugin-tools-m2/54/changes>

Changes:

[olamy] desactivate mac profile as it cause failure for me

[olamy] maven invoker plugin 1.6 for all modules

[olamy] maven invoker plugin 1.6

[hboutemy] [MPLUGIN-202] specific tools.jar location on Mac

[hboutemy] updated link to current instead of forced 3.0.4

[hboutemy] added a link to the injection code provided by Maven core

------------------------------------------
Started by an SCM change
Building remotely on ubuntu4 in workspace <https://builds.apache.org/job/maven-plugin-tools-m2/ws/>
Cleaning up <https://builds.apache.org/job/maven-plugin-tools-m2/ws/.>
Deleting <https://builds.apache.org/job/maven-plugin-tools-m2/ws/./target>
Deleting <https://builds.apache.org/job/maven-plugin-tools-m2/ws/./maven-plugin-tools-api/target>
Deleting <https://builds.apache.org/job/maven-plugin-tools-m2/ws/./maven-plugin-tools-beanshell/target>
Deleting <https://builds.apache.org/job/maven-plugin-tools-m2/ws/./maven-plugin-tools-annotations/target>
Deleting <https://builds.apache.org/job/maven-plugin-tools-m2/ws/./maven-plugin-tools-generators/target>
Deleting <https://builds.apache.org/job/maven-plugin-tools-m2/ws/./maven-plugin-plugin/target>
Deleting <https://builds.apache.org/job/maven-plugin-tools-m2/ws/./maven-plugin-annotations/target>
Deleting <https://builds.apache.org/job/maven-plugin-tools-m2/ws/./maven-plugin-tools-java/target>
Deleting <https://builds.apache.org/job/maven-plugin-tools-m2/ws/./maven-plugin-tools-javadoc/target>
Deleting <https://builds.apache.org/job/maven-plugin-tools-m2/ws/./maven-plugin-tools-ant/target>
Deleting <https://builds.apache.org/job/maven-plugin-tools-m2/ws/./maven-script/target>
Deleting <https://builds.apache.org/job/maven-plugin-tools-m2/ws/./maven-script/maven-script-beanshell/target>
Deleting <https://builds.apache.org/job/maven-plugin-tools-m2/ws/./maven-script/maven-script-ant/target>
Deleting <https://builds.apache.org/job/maven-plugin-tools-m2/ws/./maven-plugin-tools-model/target>
Updating http://svn.apache.org/repos/asf/maven/plugin-tools/trunk
U         maven-plugin-tools-javadoc/pom.xml
U         pom.xml
U         maven-plugin-tools-annotations/src/test/java/org/apache/maven/tools/plugin/annotations/FooMojo.java
U         maven-plugin-tools-annotations/src/main/java/org/apache/maven/tools/plugin/annotations/JavaAnnotationsMojoDescriptorExtractor.java
U         maven-plugin-tools-annotations/src/main/java/org/apache/maven/tools/plugin/annotations/datamodel/ComponentAnnotationContent.java
U         maven-plugin-tools-annotations/src/site/apt/index.apt
U         maven-plugin-annotations/src/main/java/org/apache/maven/plugins/annotations/Parameter.java
U         maven-plugin-annotations/src/main/java/org/apache/maven/plugins/annotations/Component.java
U         maven-plugin-plugin/src/it/java-basic-annotations/src/main/java/org/apache/maven/plugin/coreit/FirstMojo.java
U         maven-plugin-plugin/src/it/annotation-with-inheritance-reactor/module-abstract-mojo/src/main/java/org/apache/maven/plugins/AbstractFirstMojo.java
U         maven-plugin-plugin/src/it/annotation-with-inheritance/src/main/java/org/apache/maven/plugin/coreit/AbstractFirstMojo.java
U         maven-plugin-plugin/pom.xml
At revision 1342675
Parsing POMs
Modules changed, recalculating dependency graph
[maven-plugin-tools-m2] $ /home/hudson/tools/java/latest1.5/bin/java -cp /home/jenkins/jenkins-slave/maven-agent.jar:/home/jenkins/jenkins-slave/classworlds.jar hudson.maven.agent.Main /home/hudson/tools/maven/apache-maven-2.2.1 /home/jenkins/jenkins-slave/slave.jar /home/jenkins/jenkins-slave/maven-interceptor.jar 59367 /home/jenkins/jenkins-slave/maven2.1-interceptor.jar
<===[JENKINS REMOTING CAPACITY]===>   channel started
log4j:WARN No appenders could be found for logger (org.apache.commons.beanutils.converters.BooleanConverter).
log4j:WARN Please initialize the log4j system properly.
+ Error stacktraces are turned on.
Executing Maven:  -B -f <https://builds.apache.org/job/maven-plugin-tools-m2/ws/pom.xml> -Dmaven.repo.local=/home/jenkins/jenkins-slave/maven-repositories/0 clean install -B -U -e -fae -V -Prun-itsApache Maven 2.2.1 (r801777; 2009-08-06 19:16:01+0000)
Java version: 1.5.0_22
Java home: /home/jenkins/tools/java/jdk1.5.0_22-32/jre
Default locale: en_US, platform encoding: ANSI_X3.4-1968
OS name: "linux" version: "2.6.32-33-server" arch: "i386" Family: "unix"

May 25, 2012 3:13:20 PM hudson.remoting.SynchronousCommandTransport$ReaderThread run
SEVERE: I/O error in channel channel
java.io.StreamCorruptedException
	at java.io.ObjectInputStream.readObject0(ObjectInputStream.java:1332)
	at java.io.ObjectInputStream.readObject(ObjectInputStream.java:348)
	at hudson.remoting.Command.readFrom(Command.java:90)
	at hudson.remoting.ClassicCommandTransport.read(ClassicCommandTransport.java:59)
	at hudson.remoting.SynchronousCommandTransport$ReaderThread.run(SynchronousCommandTransport.java:48)
channel stopped
ERROR: Maven JVM terminated unexpectedly with exit code 0


Jenkins build is back to normal : maven-plugin-tools-m2 #56

Posted by Apache Jenkins Server <je...@builds.apache.org>.
See <https://builds.apache.org/job/maven-plugin-tools-m2/56/changes>


Build failed in Jenkins: maven-plugin-tools-m2 #55

Posted by Apache Jenkins Server <je...@builds.apache.org>.
See <https://builds.apache.org/job/maven-plugin-tools-m2/55/>

------------------------------------------
[...truncated 918 lines...]
[INFO] Installing <https://builds.apache.org/job/maven-plugin-tools-m2/ws/maven-plugin-tools-ant/target/maven-plugin-tools-ant-3.0-SNAPSHOT.jar> to /export/home/hudson/hudson-slave/maven-repositories/1/org/apache/maven/plugin-tools/maven-plugin-tools-ant/3.0-SNAPSHOT/maven-plugin-tools-ant-3.0-SNAPSHOT.jar
[JENKINS] Archiving <https://builds.apache.org/job/maven-plugin-tools-m2/ws/maven-plugin-tools-ant/pom.xml> to /home/hudson/hudson/jobs/maven-plugin-tools-m2/modules/org.apache.maven.plugin-tools$maven-plugin-tools-ant/builds/2012-05-25_22-34-37/archive/org.apache.maven.plugin-tools/maven-plugin-tools-ant/3.0-SNAPSHOT/maven-plugin-tools-ant-3.0-SNAPSHOT.pom
[JENKINS] Archiving <https://builds.apache.org/job/maven-plugin-tools-m2/ws/maven-plugin-tools-ant/target/maven-plugin-tools-ant-3.0-SNAPSHOT.jar> to /home/hudson/hudson/jobs/maven-plugin-tools-m2/modules/org.apache.maven.plugin-tools$maven-plugin-tools-ant/builds/2012-05-25_22-34-37/archive/org.apache.maven.plugin-tools/maven-plugin-tools-ant/3.0-SNAPSHOT/maven-plugin-tools-ant-3.0-SNAPSHOT.jar
[INFO] 
[INFO] 
[INFO] ------------------------------------------------------------------------
[INFO] Reactor Summary:
[INFO] ------------------------------------------------------------------------
[INFO] Maven Plugin Tools .................................... SUCCESS [56.350s]
[INFO] Maven Script Mojo Support ............................. SUCCESS [0.909s]
[INFO] Maven Ant Mojo Support ................................ SUCCESS [52.646s]
[INFO] Maven Beanshell Mojo Support .......................... SUCCESS [2.901s]
[INFO] Maven Plugin Tools APIs ............................... SUCCESS [12.245s]
[INFO] Maven Plugin Tools Generators ......................... SUCCESS [10.207s]
[INFO] Maven Plugin Tool for Java with Javadoc Tags .......... SUCCESS [7.756s]
[INFO] Maven Plugin Tool for Beanshell ....................... SUCCESS [3.138s]
[INFO] Maven Plugin Java 5 Annotations ....................... SUCCESS [3.473s]
[INFO] Maven Plugin Tool for Annotations ..................... SUCCESS [7.599s]
[INFO] Maven Plugin Plugin ................................... SUCCESS [5:09.251s]
[INFO] Maven Plugin Tools Javadoc ............................ FAILED [3.515s]
[INFO] Maven Plugin Metadata Model ........................... SUCCESS [9.441s]
[INFO] Maven Plugin Tool for Ant ............................. SUCCESS [6.425s]
[INFO] ------------------------------------------------------------------------
[INFO] Error for project: Maven Plugin Tools Javadoc (during install)
[INFO] ------------------------------------------------------------------------
[INFO] Compilation failure

<https://builds.apache.org/job/maven-plugin-tools-m2/ws/maven-plugin-tools-javadoc/src/main/java/org/apache/maven/tools/plugin/javadoc/MojoGoalTypeTaglet.java>:[26,29] package com.sun.tools.doclets does not exist
<https://builds.apache.org/job/maven-plugin-tools-m2/ws/maven-plugin-tools-javadoc/src/main/java/org/apache/maven/tools/plugin/javadoc/AbstractMojoTaglet.java>:[33,23] package com.sun.javadoc does not exist
<https://builds.apache.org/job/maven-plugin-tools-m2/ws/maven-plugin-tools-javadoc/src/main/java/org/apache/maven/tools/plugin/javadoc/AbstractMojoTaglet.java>:[34,29] package com.sun.tools.doclets does not exist
<https://builds.apache.org/job/maven-plugin-tools-m2/ws/maven-plugin-tools-javadoc/src/main/java/org/apache/maven/tools/plugin/javadoc/AbstractMojoTaglet.java>:[50,15] cannot find symbol
symbol: class Taglet
    implements Taglet
<https://builds.apache.org/job/maven-plugin-tools-m2/ws/maven-plugin-tools-javadoc/src/main/java/org/apache/maven/tools/plugin/javadoc/MojoGoalTypeTaglet.java>:[107,45] cannot find symbol
symbol  : class Taglet
location: class org.apache.maven.tools.plugin.javadoc.MojoGoalTypeTaglet
<https://builds.apache.org/job/maven-plugin-tools-m2/ws/maven-plugin-tools-javadoc/src/main/java/org/apache/maven/tools/plugin/javadoc/AbstractMojoTaglet.java>:[53,28] cannot find symbol
symbol  : class Tag
location: class org.apache.maven.tools.plugin.javadoc.AbstractMojoTaglet
<https://builds.apache.org/job/maven-plugin-tools-m2/ws/maven-plugin-tools-javadoc/src/main/java/org/apache/maven/tools/plugin/javadoc/AbstractMojoTaglet.java>:[71,28] cannot find symbol
symbol  : class Tag
location: class org.apache.maven.tools.plugin.javadoc.AbstractMojoTaglet
<https://builds.apache.org/job/maven-plugin-tools-m2/ws/maven-plugin-tools-javadoc/src/main/java/org/apache/maven/tools/plugin/javadoc/AbstractMojoTaglet.java>:[132,32] cannot find symbol
symbol  : class Tag
location: class org.apache.maven.tools.plugin.javadoc.AbstractMojoTaglet
<https://builds.apache.org/job/maven-plugin-tools-m2/ws/maven-plugin-tools-javadoc/src/main/java/org/apache/maven/tools/plugin/javadoc/AbstractMojoTaglet.java>:[166,50] cannot find symbol
symbol  : class Tag
location: class org.apache.maven.tools.plugin.javadoc.AbstractMojoTaglet
<https://builds.apache.org/job/maven-plugin-tools-m2/ws/maven-plugin-tools-javadoc/src/main/java/org/apache/maven/tools/plugin/javadoc/AbstractMojoTaglet.java>:[221,46] cannot find symbol
symbol  : class Tag
location: class org.apache.maven.tools.plugin.javadoc.AbstractMojoTaglet
<https://builds.apache.org/job/maven-plugin-tools-m2/ws/maven-plugin-tools-javadoc/src/main/java/org/apache/maven/tools/plugin/javadoc/MojoRequiresDependencyResolutionTypeTaglet.java>:[26,29] package com.sun.tools.doclets does not exist
<https://builds.apache.org/job/maven-plugin-tools-m2/ws/maven-plugin-tools-javadoc/src/main/java/org/apache/maven/tools/plugin/javadoc/MojoRequiresDependencyResolutionTypeTaglet.java>:[108,45] cannot find symbol
symbol  : class Taglet
location: class org.apache.maven.tools.plugin.javadoc.MojoRequiresDependencyResolutionTypeTaglet
<https://builds.apache.org/job/maven-plugin-tools-m2/ws/maven-plugin-tools-javadoc/src/main/java/org/apache/maven/tools/plugin/javadoc/MojoInstantiationStrategyTypeTaglet.java>:[26,29] package com.sun.tools.doclets does not exist
<https://builds.apache.org/job/maven-plugin-tools-m2/ws/maven-plugin-tools-javadoc/src/main/java/org/apache/maven/tools/plugin/javadoc/MojoInstantiationStrategyTypeTaglet.java>:[107,45] cannot find symbol
symbol  : class Taglet
location: class org.apache.maven.tools.plugin.javadoc.MojoInstantiationStrategyTypeTaglet
<https://builds.apache.org/job/maven-plugin-tools-m2/ws/maven-plugin-tools-javadoc/src/main/java/org/apache/maven/tools/plugin/javadoc/MojoRequiresDependencyCollectionTypeTaglet.java>:[22,29] package com.sun.tools.doclets does not exist
<https://builds.apache.org/job/maven-plugin-tools-m2/ws/maven-plugin-tools-javadoc/src/main/java/org/apache/maven/tools/plugin/javadoc/MojoRequiresDependencyCollectionTypeTaglet.java>:[107,45] cannot find symbol
symbol  : class Taglet
location: class org.apache.maven.tools.plugin.javadoc.MojoRequiresDependencyCollectionTypeTaglet
<https://builds.apache.org/job/maven-plugin-tools-m2/ws/maven-plugin-tools-javadoc/src/main/java/org/apache/maven/tools/plugin/javadoc/MojoRequiresProjectTypeTaglet.java>:[26,29] package com.sun.tools.doclets does not exist
<https://builds.apache.org/job/maven-plugin-tools-m2/ws/maven-plugin-tools-javadoc/src/main/java/org/apache/maven/tools/plugin/javadoc/MojoRequiresProjectTypeTaglet.java>:[108,45] cannot find symbol
symbol  : class Taglet
location: class org.apache.maven.tools.plugin.javadoc.MojoRequiresProjectTypeTaglet
<https://builds.apache.org/job/maven-plugin-tools-m2/ws/maven-plugin-tools-javadoc/src/main/java/org/apache/maven/tools/plugin/javadoc/MojoInheritByDefaultTypeTaglet.java>:[26,29] package com.sun.tools.doclets does not exist
<https://builds.apache.org/job/maven-plugin-tools-m2/ws/maven-plugin-tools-javadoc/src/main/java/org/apache/maven/tools/plugin/javadoc/MojoInheritByDefaultTypeTaglet.java>:[108,45] cannot find symbol
symbol  : class Taglet
location: class org.apache.maven.tools.plugin.javadoc.MojoInheritByDefaultTypeTaglet
<https://builds.apache.org/job/maven-plugin-tools-m2/ws/maven-plugin-tools-javadoc/src/main/java/org/apache/maven/tools/plugin/javadoc/MojoParameterFieldTaglet.java>:[26,29] package com.sun.tools.doclets does not exist
<https://builds.apache.org/job/maven-plugin-tools-m2/ws/maven-plugin-tools-javadoc/src/main/java/org/apache/maven/tools/plugin/javadoc/MojoParameterFieldTaglet.java>:[114,45] cannot find symbol
symbol  : class Taglet
location: class org.apache.maven.tools.plugin.javadoc.MojoParameterFieldTaglet
<https://builds.apache.org/job/maven-plugin-tools-m2/ws/maven-plugin-tools-javadoc/src/main/java/org/apache/maven/tools/plugin/javadoc/MojoRequiredFieldTaglet.java>:[26,29] package com.sun.tools.doclets does not exist
<https://builds.apache.org/job/maven-plugin-tools-m2/ws/maven-plugin-tools-javadoc/src/main/java/org/apache/maven/tools/plugin/javadoc/MojoRequiredFieldTaglet.java>:[111,45] cannot find symbol
symbol  : class Taglet
location: class org.apache.maven.tools.plugin.javadoc.MojoRequiredFieldTaglet
<https://builds.apache.org/job/maven-plugin-tools-m2/ws/maven-plugin-tools-javadoc/src/main/java/org/apache/maven/tools/plugin/javadoc/MojoRequiresDirectInvocationTypeTaglet.java>:[26,29] package com.sun.tools.doclets does not exist
<https://builds.apache.org/job/maven-plugin-tools-m2/ws/maven-plugin-tools-javadoc/src/main/java/org/apache/maven/tools/plugin/javadoc/MojoRequiresDirectInvocationTypeTaglet.java>:[108,45] cannot find symbol
symbol  : class Taglet
location: class org.apache.maven.tools.plugin.javadoc.MojoRequiresDirectInvocationTypeTaglet
<https://builds.apache.org/job/maven-plugin-tools-m2/ws/maven-plugin-tools-javadoc/src/main/java/org/apache/maven/tools/plugin/javadoc/MojoThreadSafeTypeTaglet.java>:[22,29] package com.sun.tools.doclets does not exist
<https://builds.apache.org/job/maven-plugin-tools-m2/ws/maven-plugin-tools-javadoc/src/main/java/org/apache/maven/tools/plugin/javadoc/MojoThreadSafeTypeTaglet.java>:[106,45] cannot find symbol
symbol  : class Taglet
location: class org.apache.maven.tools.plugin.javadoc.MojoThreadSafeTypeTaglet
<https://builds.apache.org/job/maven-plugin-tools-m2/ws/maven-plugin-tools-javadoc/src/main/java/org/apache/maven/tools/plugin/javadoc/MojoComponentFieldTaglet.java>:[26,29] package com.sun.tools.doclets does not exist
<https://builds.apache.org/job/maven-plugin-tools-m2/ws/maven-plugin-tools-javadoc/src/main/java/org/apache/maven/tools/plugin/javadoc/MojoComponentFieldTaglet.java>:[110,45] cannot find symbol
symbol  : class Taglet
location: class org.apache.maven.tools.plugin.javadoc.MojoComponentFieldTaglet
<https://builds.apache.org/job/maven-plugin-tools-m2/ws/maven-plugin-tools-javadoc/src/main/java/org/apache/maven/tools/plugin/javadoc/MojoRequiresOnLineTypeTaglet.java>:[26,29] package com.sun.tools.doclets does not exist
<https://builds.apache.org/job/maven-plugin-tools-m2/ws/maven-plugin-tools-javadoc/src/main/java/org/apache/maven/tools/plugin/javadoc/MojoRequiresOnLineTypeTaglet.java>:[108,45] cannot find symbol
symbol  : class Taglet
location: class org.apache.maven.tools.plugin.javadoc.MojoRequiresOnLineTypeTaglet
<https://builds.apache.org/job/maven-plugin-tools-m2/ws/maven-plugin-tools-javadoc/src/main/java/org/apache/maven/tools/plugin/javadoc/MojoConfiguratorTypeTaglet.java>:[26,29] package com.sun.tools.doclets does not exist
<https://builds.apache.org/job/maven-plugin-tools-m2/ws/maven-plugin-tools-javadoc/src/main/java/org/apache/maven/tools/plugin/javadoc/MojoConfiguratorTypeTaglet.java>:[107,45] cannot find symbol
symbol  : class Taglet
location: class org.apache.maven.tools.plugin.javadoc.MojoConfiguratorTypeTaglet
<https://builds.apache.org/job/maven-plugin-tools-m2/ws/maven-plugin-tools-javadoc/src/main/java/org/apache/maven/tools/plugin/javadoc/MojoExecuteTypeTaglet.java>:[26,29] package com.sun.tools.doclets does not exist
<https://builds.apache.org/job/maven-plugin-tools-m2/ws/maven-plugin-tools-javadoc/src/main/java/org/apache/maven/tools/plugin/javadoc/MojoExecuteTypeTaglet.java>:[113,45] cannot find symbol
symbol  : class Taglet
location: class org.apache.maven.tools.plugin.javadoc.MojoExecuteTypeTaglet
<https://builds.apache.org/job/maven-plugin-tools-m2/ws/maven-plugin-tools-javadoc/src/main/java/org/apache/maven/tools/plugin/javadoc/MojoAggregatorTypeTaglet.java>:[26,29] package com.sun.tools.doclets does not exist
<https://builds.apache.org/job/maven-plugin-tools-m2/ws/maven-plugin-tools-javadoc/src/main/java/org/apache/maven/tools/plugin/javadoc/MojoAggregatorTypeTaglet.java>:[108,45] cannot find symbol
symbol  : class Taglet
location: class org.apache.maven.tools.plugin.javadoc.MojoAggregatorTypeTaglet
<https://builds.apache.org/job/maven-plugin-tools-m2/ws/maven-plugin-tools-javadoc/src/main/java/org/apache/maven/tools/plugin/javadoc/MojoReadOnlyFieldTaglet.java>:[26,29] package com.sun.tools.doclets does not exist
<https://builds.apache.org/job/maven-plugin-tools-m2/ws/maven-plugin-tools-javadoc/src/main/java/org/apache/maven/tools/plugin/javadoc/MojoReadOnlyFieldTaglet.java>:[111,45] cannot find symbol
symbol  : class Taglet
location: class org.apache.maven.tools.plugin.javadoc.MojoReadOnlyFieldTaglet
<https://builds.apache.org/job/maven-plugin-tools-m2/ws/maven-plugin-tools-javadoc/src/main/java/org/apache/maven/tools/plugin/javadoc/MojoPhaseTypeTaglet.java>:[26,29] package com.sun.tools.doclets does not exist
<https://builds.apache.org/job/maven-plugin-tools-m2/ws/maven-plugin-tools-javadoc/src/main/java/org/apache/maven/tools/plugin/javadoc/MojoPhaseTypeTaglet.java>:[107,45] cannot find symbol
symbol  : class Taglet
location: class org.apache.maven.tools.plugin.javadoc.MojoPhaseTypeTaglet
<https://builds.apache.org/job/maven-plugin-tools-m2/ws/maven-plugin-tools-javadoc/src/main/java/org/apache/maven/tools/plugin/javadoc/MojoExecutionStrategyTypeTaglet.java>:[26,29] package com.sun.tools.doclets does not exist
<https://builds.apache.org/job/maven-plugin-tools-m2/ws/maven-plugin-tools-javadoc/src/main/java/org/apache/maven/tools/plugin/javadoc/MojoExecutionStrategyTypeTaglet.java>:[107,45] cannot find symbol
symbol  : class Taglet
location: class org.apache.maven.tools.plugin.javadoc.MojoExecutionStrategyTypeTaglet
<https://builds.apache.org/job/maven-plugin-tools-m2/ws/maven-plugin-tools-javadoc/src/main/java/org/apache/maven/tools/plugin/javadoc/MojoRequiresReportsTypeTaglet.java>:[26,29] package com.sun.tools.doclets does not exist
<https://builds.apache.org/job/maven-plugin-tools-m2/ws/maven-plugin-tools-javadoc/src/main/java/org/apache/maven/tools/plugin/javadoc/MojoRequiresReportsTypeTaglet.java>:[108,45] cannot find symbol
symbol  : class Taglet
location: class org.apache.maven.tools.plugin.javadoc.MojoRequiresReportsTypeTaglet
<https://builds.apache.org/job/maven-plugin-tools-m2/ws/maven-plugin-tools-javadoc/src/main/java/org/apache/maven/tools/plugin/javadoc/AbstractMojoTaglet.java>:[227,58] cannot find symbol
symbol  : method getName()
location: class org.apache.maven.tools.plugin.javadoc.AbstractMojoTaglet
<https://builds.apache.org/job/maven-plugin-tools-m2/ws/maven-plugin-tools-javadoc/src/main/java/org/apache/maven/tools/plugin/javadoc/AbstractMojoTaglet.java>:[242,66] cannot find symbol
symbol  : method getName()
location: class org.apache.maven.tools.plugin.javadoc.AbstractMojoTaglet
<https://builds.apache.org/job/maven-plugin-tools-m2/ws/maven-plugin-tools-javadoc/src/main/java/org/apache/maven/tools/plugin/javadoc/AbstractMojoTaglet.java>:[259,70] cannot find symbol
symbol  : method getName()
location: class org.apache.maven.tools.plugin.javadoc.AbstractMojoTaglet
<https://builds.apache.org/job/maven-plugin-tools-m2/ws/maven-plugin-tools-javadoc/src/main/java/org/apache/maven/tools/plugin/javadoc/AbstractMojoTaglet.java>:[275,62] cannot find symbol
symbol  : method getName()
location: class org.apache.maven.tools.plugin.javadoc.AbstractMojoTaglet
<https://builds.apache.org/job/maven-plugin-tools-m2/ws/maven-plugin-tools-javadoc/src/main/java/org/apache/maven/tools/plugin/javadoc/AbstractMojoTaglet.java>:[295,66] cannot find symbol
symbol  : method getName()
location: class org.apache.maven.tools.plugin.javadoc.AbstractMojoTaglet
<https://builds.apache.org/job/maven-plugin-tools-m2/ws/maven-plugin-tools-javadoc/src/main/java/org/apache/maven/tools/plugin/javadoc/AbstractMojoTaglet.java>:[312,70] cannot find symbol
symbol  : method getName()
location: class org.apache.maven.tools.plugin.javadoc.AbstractMojoTaglet
<https://builds.apache.org/job/maven-plugin-tools-m2/ws/maven-plugin-tools-javadoc/src/main/java/org/apache/maven/tools/plugin/javadoc/AbstractMojoTaglet.java>:[328,62] cannot find symbol
symbol  : method getName()
location: class org.apache.maven.tools.plugin.javadoc.AbstractMojoTaglet
<https://builds.apache.org/job/maven-plugin-tools-m2/ws/maven-plugin-tools-javadoc/src/main/java/org/apache/maven/tools/plugin/javadoc/MojoGoalTypeTaglet.java>:[110,8] cannot find symbol
symbol  : class Taglet
location: class org.apache.maven.tools.plugin.javadoc.MojoGoalTypeTaglet
<https://builds.apache.org/job/maven-plugin-tools-m2/ws/maven-plugin-tools-javadoc/src/main/java/org/apache/maven/tools/plugin/javadoc/MojoRequiresDependencyResolutionTypeTaglet.java>:[111,8] cannot find symbol
symbol  : class Taglet
location: class org.apache.maven.tools.plugin.javadoc.MojoRequiresDependencyResolutionTypeTaglet
<https://builds.apache.org/job/maven-plugin-tools-m2/ws/maven-plugin-tools-javadoc/src/main/java/org/apache/maven/tools/plugin/javadoc/MojoInstantiationStrategyTypeTaglet.java>:[110,8] cannot find symbol
symbol  : class Taglet
location: class org.apache.maven.tools.plugin.javadoc.MojoInstantiationStrategyTypeTaglet
<https://builds.apache.org/job/maven-plugin-tools-m2/ws/maven-plugin-tools-javadoc/src/main/java/org/apache/maven/tools/plugin/javadoc/MojoRequiresDependencyCollectionTypeTaglet.java>:[110,8] cannot find symbol
symbol  : class Taglet
location: class org.apache.maven.tools.plugin.javadoc.MojoRequiresDependencyCollectionTypeTaglet
<https://builds.apache.org/job/maven-plugin-tools-m2/ws/maven-plugin-tools-javadoc/src/main/java/org/apache/maven/tools/plugin/javadoc/MojoRequiresProjectTypeTaglet.java>:[111,8] cannot find symbol
symbol  : class Taglet
location: class org.apache.maven.tools.plugin.javadoc.MojoRequiresProjectTypeTaglet
<https://builds.apache.org/job/maven-plugin-tools-m2/ws/maven-plugin-tools-javadoc/src/main/java/org/apache/maven/tools/plugin/javadoc/MojoInheritByDefaultTypeTaglet.java>:[111,8] cannot find symbol
symbol  : class Taglet
location: class org.apache.maven.tools.plugin.javadoc.MojoInheritByDefaultTypeTaglet
<https://builds.apache.org/job/maven-plugin-tools-m2/ws/maven-plugin-tools-javadoc/src/main/java/org/apache/maven/tools/plugin/javadoc/MojoParameterFieldTaglet.java>:[117,8] cannot find symbol
symbol  : class Taglet
location: class org.apache.maven.tools.plugin.javadoc.MojoParameterFieldTaglet
<https://builds.apache.org/job/maven-plugin-tools-m2/ws/maven-plugin-tools-javadoc/src/main/java/org/apache/maven/tools/plugin/javadoc/MojoRequiredFieldTaglet.java>:[114,8] cannot find symbol
symbol  : class Taglet
location: class org.apache.maven.tools.plugin.javadoc.MojoRequiredFieldTaglet
<https://builds.apache.org/job/maven-plugin-tools-m2/ws/maven-plugin-tools-javadoc/src/main/java/org/apache/maven/tools/plugin/javadoc/MojoRequiresDirectInvocationTypeTaglet.java>:[111,8] cannot find symbol
symbol  : class Taglet
location: class org.apache.maven.tools.plugin.javadoc.MojoRequiresDirectInvocationTypeTaglet
<https://builds.apache.org/job/maven-plugin-tools-m2/ws/maven-plugin-tools-javadoc/src/main/java/org/apache/maven/tools/plugin/javadoc/MojoThreadSafeTypeTaglet.java>:[109,8] cannot find symbol
symbol  : class Taglet
location: class org.apache.maven.tools.plugin.javadoc.MojoThreadSafeTypeTaglet
<https://builds.apache.org/job/maven-plugin-tools-m2/ws/maven-plugin-tools-javadoc/src/main/java/org/apache/maven/tools/plugin/javadoc/MojoComponentFieldTaglet.java>:[113,8] cannot find symbol
symbol  : class Taglet
location: class org.apache.maven.tools.plugin.javadoc.MojoComponentFieldTaglet
<https://builds.apache.org/job/maven-plugin-tools-m2/ws/maven-plugin-tools-javadoc/src/main/java/org/apache/maven/tools/plugin/javadoc/MojoRequiresOnLineTypeTaglet.java>:[111,8] cannot find symbol
symbol  : class Taglet
location: class org.apache.maven.tools.plugin.javadoc.MojoRequiresOnLineTypeTaglet
<https://builds.apache.org/job/maven-plugin-tools-m2/ws/maven-plugin-tools-javadoc/src/main/java/org/apache/maven/tools/plugin/javadoc/MojoConfiguratorTypeTaglet.java>:[110,8] cannot find symbol
symbol  : class Taglet
location: class org.apache.maven.tools.plugin.javadoc.MojoConfiguratorTypeTaglet
<https://builds.apache.org/job/maven-plugin-tools-m2/ws/maven-plugin-tools-javadoc/src/main/java/org/apache/maven/tools/plugin/javadoc/MojoExecuteTypeTaglet.java>:[116,8] cannot find symbol
symbol  : class Taglet
location: class org.apache.maven.tools.plugin.javadoc.MojoExecuteTypeTaglet
<https://builds.apache.org/job/maven-plugin-tools-m2/ws/maven-plugin-tools-javadoc/src/main/java/org/apache/maven/tools/plugin/javadoc/MojoAggregatorTypeTaglet.java>:[111,8] cannot find symbol
symbol  : class Taglet
location: class org.apache.maven.tools.plugin.javadoc.MojoAggregatorTypeTaglet
<https://builds.apache.org/job/maven-plugin-tools-m2/ws/maven-plugin-tools-javadoc/src/main/java/org/apache/maven/tools/plugin/javadoc/MojoReadOnlyFieldTaglet.java>:[114,8] cannot find symbol
symbol  : class Taglet
location: class org.apache.maven.tools.plugin.javadoc.MojoReadOnlyFieldTaglet
<https://builds.apache.org/job/maven-plugin-tools-m2/ws/maven-plugin-tools-javadoc/src/main/java/org/apache/maven/tools/plugin/javadoc/MojoPhaseTypeTaglet.java>:[110,8] cannot find symbol
symbol  : class Taglet
location: class org.apache.maven.tools.plugin.javadoc.MojoPhaseTypeTaglet
<https://builds.apache.org/job/maven-plugin-tools-m2/ws/maven-plugin-tools-javadoc/src/main/java/org/apache/maven/tools/plugin/javadoc/MojoExecutionStrategyTypeTaglet.java>:[110,8] cannot find symbol
symbol  : class Taglet
location: class org.apache.maven.tools.plugin.javadoc.MojoExecutionStrategyTypeTaglet
<https://builds.apache.org/job/maven-plugin-tools-m2/ws/maven-plugin-tools-javadoc/src/main/java/org/apache/maven/tools/plugin/javadoc/MojoRequiresReportsTypeTaglet.java>:[111,8] cannot find symbol
symbol  : class Taglet
location: class org.apache.maven.tools.plugin.javadoc.MojoRequiresReportsTypeTaglet

[INFO] ------------------------------------------------------------------------
[INFO] Trace
org.apache.maven.BuildFailureException: Compilation failure
	at org.apache.maven.lifecycle.DefaultLifecycleExecutor.executeGoals(DefaultLifecycleExecutor.java:715)
	at org.apache.maven.lifecycle.DefaultLifecycleExecutor.executeGoalWithLifecycle(DefaultLifecycleExecutor.java:556)
	at org.apache.maven.lifecycle.DefaultLifecycleExecutor.executeGoal(DefaultLifecycleExecutor.java:535)
	at org.apache.maven.lifecycle.DefaultLifecycleExecutor.executeGoalAndHandleFailures(DefaultLifecycleExecutor.java:387)
	at org.apache.maven.lifecycle.DefaultLifecycleExecutor.executeTaskSegments(DefaultLifecycleExecutor.java:348)
	at org.apache.maven.lifecycle.DefaultLifecycleExecutor.execute(DefaultLifecycleExecutor.java:180)
	at org.apache.maven.lifecycle.LifecycleExecutorInterceptor.execute(LifecycleExecutorInterceptor.java:65)
	at org.apache.maven.DefaultMaven.doExecute(DefaultMaven.java:328)
	at org.apache.maven.DefaultMaven.execute(DefaultMaven.java:138)
	at org.apache.maven.cli.MavenCli.main(MavenCli.java:362)
	at sun.reflect.NativeMethodAccessorImpl.invoke0(Native Method)
	at sun.reflect.NativeMethodAccessorImpl.invoke(NativeMethodAccessorImpl.java:39)
	at sun.reflect.DelegatingMethodAccessorImpl.invoke(DelegatingMethodAccessorImpl.java:25)
	at java.lang.reflect.Method.invoke(Method.java:592)
	at org.codehaus.classworlds.Launcher.launchEnhanced(Launcher.java:315)
	at org.codehaus.classworlds.Launcher.launch(Launcher.java:255)
	at hudson.maven.agent.Main.launch(Main.java:185)
	at hudson.maven.MavenBuilder.call(MavenBuilder.java:151)
	at hudson.maven.Maven2Builder.call(Maven2Builder.java:77)
	at hudson.maven.Maven2Builder.call(Maven2Builder.java:53)
	at hudson.remoting.UserRequest.perform(UserRequest.java:118)
	at hudson.remoting.UserRequest.perform(UserRequest.java:48)
	at hudson.remoting.Request$2.run(Request.java:287)
	at hudson.remoting.InterceptingExecutorService$1.call(InterceptingExecutorService.java:72)
	at java.util.concurrent.FutureTask$Sync.innerRun(FutureTask.java:269)
	at java.util.concurrent.FutureTask.run(FutureTask.java:123)
	at java.util.concurrent.ThreadPoolExecutor$Worker.runTask(ThreadPoolExecutor.java:651)
	at java.util.concurrent.ThreadPoolExecutor$Worker.run(ThreadPoolExecutor.java:676)
	at java.lang.Thread.run(Thread.java:595)
Caused by: org.apache.maven.plugin.CompilationFailureException: Compilation failure
	at org.apache.maven.plugin.AbstractCompilerMojo.execute(AbstractCompilerMojo.java:678)
	at org.apache.maven.plugin.CompilerMojo.execute(CompilerMojo.java:128)
	at org.apache.maven.plugin.DefaultPluginManager.executeMojo(DefaultPluginManager.java:490)
	at hudson.maven.agent.PluginManagerInterceptor.executeMojo(PluginManagerInterceptor.java:182)
	at org.apache.maven.lifecycle.DefaultLifecycleExecutor.executeGoals(DefaultLifecycleExecutor.java:694)
	... 28 more
[INFO] ------------------------------------------------------------------------
[INFO] BUILD ERRORS
[INFO] ------------------------------------------------------------------------
[INFO] Total time: 9 minutes 46 seconds
[INFO] Finished at: Fri May 25 22:47:16 GMT+00:00 2012
[INFO] Final Memory: 91M/220M
[INFO] ------------------------------------------------------------------------
channel stopped