You are viewing a plain text version of this content. The canonical link for it is here.
Posted to builds@mesos.apache.org by Apache Jenkins Server <je...@builds.apache.org> on 2017/11/14 00:47:10 UTC
Build failed in Jenkins: Mesos-Buildbot » cmake,gcc,--verbose --disable-libtool-wrappers --enable-libevent --enable-ssl,GLOG_v=1 MESOS_VERBOSE=1,ubuntu:14.04,(ubuntu)&&(!ubuntu-us1)&&(!ubuntu-eu2)&&(!qnode3)&&(!H23) #4450
See <https://builds.apache.org/job/Mesos-Buildbot/BUILDTOOL=cmake,COMPILER=gcc,CONFIGURATION=--verbose%20--disable-libtool-wrappers%20--enable-libevent%20--enable-ssl,ENVIRONMENT=GLOG_v=1%20MESOS_VERBOSE=1,OS=ubuntu%3A14.04,label_exp=(ubuntu)&&(!ubuntu-us1)&&(!ubuntu-eu2)&&(!qnode3)&&(!H23)/4450/display/redirect?page=changes>
Changes:
[alexr] Fixed flaky RescindRevocableOfferWithIncreasedRevocable test.
[alexr] Added a two-parameter SendSubscribe action in test.
[alexr] Allowed multiple master detections in MasterFailover test.
[alexr] Updated a comment about resubscribing completed frameworks.
[alexr] Refactored scheduler test driver to avoid using uninitialized object.
[alexr] Refactored executor test driver to avoid using uninitialized object.
[alexr] Removed unnecessary check in v1 scheduler library.
[alexr] Passed scheduler as a shared pointer into the callback.
[alexr] Fixed bug in tests leading to orphaned containers.
------------------------------------------
[...truncated 1.47 MB...]
2: I1114 00:46:51.183745 17582 openssl.cpp:509] CA directory path unspecified! NOTE: Set CA directory path with LIBPROCESS_SSL_CA_DIR=<dirpath>
2: I1114 00:46:51.183749 17582 openssl.cpp:514] Will not verify peer certificate!
2: NOTE: Set LIBPROCESS_SSL_VERIFY_CERT=1 to enable peer certificate verification
2: I1114 00:46:51.183753 17582 openssl.cpp:520] Will only verify peer certificate if presented!
2: NOTE: Set LIBPROCESS_SSL_REQUIRE_CERT=1 to require peer certificate verification
2: I1114 00:46:51.184231 19389 process.cpp:1052] Failed to accept socket: future discarded
2: I1114 00:46:51.186736 17582 process.cpp:1367] libprocess is initialized on 172.17.0.9:34160 with 24 worker threads
2: I1114 00:46:51.195008 19408 process.cpp:3925] Handling HTTP event for process '(90)' with path: '/(90)/delete'
2: [ OK ] Scheme/HTTPTest.Delete/0 (503 ms)
2: [ RUN ] Scheme/HTTPTest.Delete/1
2: I1114 00:46:51.203912 17582 process.cpp:1367] libprocess is initialized on 172.17.0.9:37160 with 24 worker threads
2: I1114 00:46:51.206672 19434 process.cpp:3925] Handling HTTP event for process '(91)' with path: '/(91)/delete'
2: [ OK ] Scheme/HTTPTest.Delete/1 (10 ms)
2: [ RUN ] Scheme/HTTPTest.Request/0
2: I1114 00:46:51.590224 17582 openssl.cpp:504] CA file path is unspecified! NOTE: Set CA file path with LIBPROCESS_SSL_CA_FILE=<filepath>
2: I1114 00:46:51.590241 17582 openssl.cpp:509] CA directory path unspecified! NOTE: Set CA directory path with LIBPROCESS_SSL_CA_DIR=<dirpath>
2: I1114 00:46:51.590246 17582 openssl.cpp:514] Will not verify peer certificate!
2: NOTE: Set LIBPROCESS_SSL_VERIFY_CERT=1 to enable peer certificate verification
2: I1114 00:46:51.590250 17582 openssl.cpp:520] Will only verify peer certificate if presented!
2: NOTE: Set LIBPROCESS_SSL_REQUIRE_CERT=1 to require peer certificate verification
2: I1114 00:46:51.590836 19439 process.cpp:1052] Failed to accept socket: future discarded
2: I1114 00:46:51.593143 17582 process.cpp:1367] libprocess is initialized on 172.17.0.9:39070 with 24 worker threads
2: I1114 00:46:51.602293 19455 process.cpp:3925] Handling HTTP event for process '(92)' with path: '/(92)/request'
2: [ OK ] Scheme/HTTPTest.Request/0 (396 ms)
2: [ RUN ] Scheme/HTTPTest.Request/1
2: I1114 00:46:51.609030 17582 process.cpp:1367] libprocess is initialized on 172.17.0.9:35300 with 24 worker threads
2: I1114 00:46:51.611274 19482 process.cpp:3925] Handling HTTP event for process '(93)' with path: '/(93)/request'
2: [ OK ] Scheme/HTTPTest.Request/1 (9 ms)
2: [ RUN ] Scheme/HTTPTest.QueryEncodeDecode/0
2: I1114 00:46:51.891407 17582 openssl.cpp:504] CA file path is unspecified! NOTE: Set CA file path with LIBPROCESS_SSL_CA_FILE=<filepath>
2: I1114 00:46:51.891422 17582 openssl.cpp:509] CA directory path unspecified! NOTE: Set CA directory path with LIBPROCESS_SSL_CA_DIR=<dirpath>
2: I1114 00:46:51.891427 17582 openssl.cpp:514] Will not verify peer certificate!
2: NOTE: Set LIBPROCESS_SSL_VERIFY_CERT=1 to enable peer certificate verification
2: I1114 00:46:51.891432 17582 openssl.cpp:520] Will only verify peer certificate if presented!
2: NOTE: Set LIBPROCESS_SSL_REQUIRE_CERT=1 to require peer certificate verification
2: I1114 00:46:51.891921 19489 process.cpp:1052] Failed to accept socket: future discarded
2: I1114 00:46:51.894196 17582 process.cpp:1367] libprocess is initialized on 172.17.0.9:36569 with 24 worker threads
2: [ OK ] Scheme/HTTPTest.QueryEncodeDecode/0 (280 ms)
2: [ RUN ] Scheme/HTTPTest.QueryEncodeDecode/1
2: I1114 00:46:51.898572 17582 process.cpp:1367] libprocess is initialized on 172.17.0.9:46818 with 24 worker threads
2: [ OK ] Scheme/HTTPTest.QueryEncodeDecode/1 (5 ms)
2: [ RUN ] Scheme/HTTPTest.Headers/0
2: I1114 00:46:52.134394 17582 openssl.cpp:504] CA file path is unspecified! NOTE: Set CA file path with LIBPROCESS_SSL_CA_FILE=<filepath>
2: I1114 00:46:52.134410 17582 openssl.cpp:509] CA directory path unspecified! NOTE: Set CA directory path with LIBPROCESS_SSL_CA_DIR=<dirpath>
2: I1114 00:46:52.134415 17582 openssl.cpp:514] Will not verify peer certificate!
2: NOTE: Set LIBPROCESS_SSL_VERIFY_CERT=1 to enable peer certificate verification
2: I1114 00:46:52.134419 17582 openssl.cpp:520] Will only verify peer certificate if presented!
2: NOTE: Set LIBPROCESS_SSL_REQUIRE_CERT=1 to require peer certificate verification
2: I1114 00:46:52.134902 19539 process.cpp:1052] Failed to accept socket: future discarded
2: I1114 00:46:52.137153 17582 process.cpp:1367] libprocess is initialized on 172.17.0.9:39617 with 24 worker threads
2: [ OK ] Scheme/HTTPTest.Headers/0 (238 ms)
2: [ RUN ] Scheme/HTTPTest.Headers/1
2: I1114 00:46:52.141541 17582 process.cpp:1367] libprocess is initialized on 172.17.0.9:38307 with 24 worker threads
2: [ OK ] Scheme/HTTPTest.Headers/1 (4 ms)
2: [ RUN ] Scheme/HTTPTest.CaseInsensitiveHeaders/0
2: I1114 00:46:52.517423 17582 openssl.cpp:504] CA file path is unspecified! NOTE: Set CA file path with LIBPROCESS_SSL_CA_FILE=<filepath>
2: I1114 00:46:52.517438 17582 openssl.cpp:509] CA directory path unspecified! NOTE: Set CA directory path with LIBPROCESS_SSL_CA_DIR=<dirpath>
2: I1114 00:46:52.517442 17582 openssl.cpp:514] Will not verify peer certificate!
2: NOTE: Set LIBPROCESS_SSL_VERIFY_CERT=1 to enable peer certificate verification
2: I1114 00:46:52.517446 17582 openssl.cpp:520] Will only verify peer certificate if presented!
2: NOTE: Set LIBPROCESS_SSL_REQUIRE_CERT=1 to require peer certificate verification
2: I1114 00:46:52.517943 19589 process.cpp:1052] Failed to accept socket: future discarded
2: I1114 00:46:52.520038 17582 process.cpp:1367] libprocess is initialized on 172.17.0.9:38816 with 24 worker threads
2: [ OK ] Scheme/HTTPTest.CaseInsensitiveHeaders/0 (379 ms)
2: [ RUN ] Scheme/HTTPTest.CaseInsensitiveHeaders/1
2: I1114 00:46:52.523145 17582 process.cpp:1367] libprocess is initialized on 172.17.0.9:37976 with 24 worker threads
2: [ OK ] Scheme/HTTPTest.CaseInsensitiveHeaders/1 (3 ms)
2: [ RUN ] Scheme/HTTPTest.WWWAuthenticateHeader/0
2: I1114 00:46:52.961565 17582 openssl.cpp:504] CA file path is unspecified! NOTE: Set CA file path with LIBPROCESS_SSL_CA_FILE=<filepath>
2: I1114 00:46:52.961583 17582 openssl.cpp:509] CA directory path unspecified! NOTE: Set CA directory path with LIBPROCESS_SSL_CA_DIR=<dirpath>
2: I1114 00:46:52.961588 17582 openssl.cpp:514] Will not verify peer certificate!
2: NOTE: Set LIBPROCESS_SSL_VERIFY_CERT=1 to enable peer certificate verification
2: I1114 00:46:52.961591 17582 openssl.cpp:520] Will only verify peer certificate if presented!
2: NOTE: Set LIBPROCESS_SSL_REQUIRE_CERT=1 to require peer certificate verification
2: I1114 00:46:52.962080 19639 process.cpp:1052] Failed to accept socket: future discarded
2: I1114 00:46:52.964639 17582 process.cpp:1367] libprocess is initialized on 172.17.0.9:43315 with 24 worker threads
2: [ OK ] Scheme/HTTPTest.WWWAuthenticateHeader/0 (442 ms)
2: [ RUN ] Scheme/HTTPTest.WWWAuthenticateHeader/1
2: I1114 00:46:52.970182 17582 process.cpp:1367] libprocess is initialized on 172.17.0.9:44129 with 24 worker threads
2: [ OK ] Scheme/HTTPTest.WWWAuthenticateHeader/1 (5 ms)
2: [ RUN ] Scheme/HTTPTest.Accepts/0
2: I1114 00:46:53.179864 17582 openssl.cpp:504] CA file path is unspecified! NOTE: Set CA file path with LIBPROCESS_SSL_CA_FILE=<filepath>
2: I1114 00:46:53.179880 17582 openssl.cpp:509] CA directory path unspecified! NOTE: Set CA directory path with LIBPROCESS_SSL_CA_DIR=<dirpath>
2: I1114 00:46:53.179885 17582 openssl.cpp:514] Will not verify peer certificate!
2: NOTE: Set LIBPROCESS_SSL_VERIFY_CERT=1 to enable peer certificate verification
2: I1114 00:46:53.179888 17582 openssl.cpp:520] Will only verify peer certificate if presented!
2: NOTE: Set LIBPROCESS_SSL_REQUIRE_CERT=1 to require peer certificate verification
2: I1114 00:46:53.180387 19689 process.cpp:1052] Failed to accept socket: future discarded
2: I1114 00:46:53.183735 17582 process.cpp:1367] libprocess is initialized on 172.17.0.9:34176 with 24 worker threads
2: [ OK ] Scheme/HTTPTest.Accepts/0 (215 ms)
2: [ RUN ] Scheme/HTTPTest.Accepts/1
2: I1114 00:46:53.190742 17582 process.cpp:1367] libprocess is initialized on 172.17.0.9:42486 with 24 worker threads
2: [ OK ] Scheme/HTTPTest.Accepts/1 (7 ms)
2: I1114 00:46:53.193459 19739 process.cpp:1052] Failed to accept socket: future discarded
2: I1114 00:46:53.196532 17582 process.cpp:1367] libprocess is initialized on 172.17.0.9:36519 with 24 worker threads
2: [----------] 42 tests from Scheme/HTTPTest (7873 ms total)
2:
2: [----------] 4 tests from Encryption/NetSocketTest
2: [ RUN ] Encryption/NetSocketTest.EOFBeforeRecv/0
2: I1114 00:46:53.541868 17582 openssl.cpp:504] CA file path is unspecified! NOTE: Set CA file path with LIBPROCESS_SSL_CA_FILE=<filepath>
2: I1114 00:46:53.541884 17582 openssl.cpp:509] CA directory path unspecified! NOTE: Set CA directory path with LIBPROCESS_SSL_CA_DIR=<dirpath>
2: I1114 00:46:53.541889 17582 openssl.cpp:514] Will not verify peer certificate!
2: NOTE: Set LIBPROCESS_SSL_VERIFY_CERT=1 to enable peer certificate verification
2: I1114 00:46:53.541893 17582 openssl.cpp:520] Will only verify peer certificate if presented!
2: NOTE: Set LIBPROCESS_SSL_REQUIRE_CERT=1 to require peer certificate verification
2: I1114 00:46:53.542464 19764 process.cpp:1052] Failed to accept socket: future discarded
2: I1114 00:46:53.546097 17582 process.cpp:1367] libprocess is initialized on 172.17.0.9:35792 with 24 worker threads
2: [ OK ] Encryption/NetSocketTest.EOFBeforeRecv/0 (398 ms)
2: [ RUN ] Encryption/NetSocketTest.EOFBeforeRecv/1
2: I1114 00:46:53.598387 17582 process.cpp:1367] libprocess is initialized on 172.17.0.9:36819 with 24 worker threads
2: [ OK ] Encryption/NetSocketTest.EOFBeforeRecv/1 (7 ms)
2: [ RUN ] Encryption/NetSocketTest.EOFAfterRecv/0
2: I1114 00:46:54.011849 17582 openssl.cpp:504] CA file path is unspecified! NOTE: Set CA file path with LIBPROCESS_SSL_CA_FILE=<filepath>
2: I1114 00:46:54.011867 17582 openssl.cpp:509] CA directory path unspecified! NOTE: Set CA directory path with LIBPROCESS_SSL_CA_DIR=<dirpath>
2: I1114 00:46:54.011870 17582 openssl.cpp:514] Will not verify peer certificate!
2: NOTE: Set LIBPROCESS_SSL_VERIFY_CERT=1 to enable peer certificate verification
2: I1114 00:46:54.011874 17582 openssl.cpp:520] Will only verify peer certificate if presented!
2: NOTE: Set LIBPROCESS_SSL_REQUIRE_CERT=1 to require peer certificate verification
2: I1114 00:46:54.012348 19814 process.cpp:1052] Failed to accept socket: future discarded
2: I1114 00:46:54.014889 17582 process.cpp:1367] libprocess is initialized on 172.17.0.9:37860 with 24 worker threads
2: [ OK ] Encryption/NetSocketTest.EOFAfterRecv/0 (462 ms)
2: [ RUN ] Encryption/NetSocketTest.EOFAfterRecv/1
2: I1114 00:46:54.067773 17582 process.cpp:1367] libprocess is initialized on 172.17.0.9:36796 with 24 worker threads
2: [ OK ] Encryption/NetSocketTest.EOFAfterRecv/1 (7 ms)
2: I1114 00:46:54.070634 19864 process.cpp:1052] Failed to accept socket: future discarded
2: I1114 00:46:54.073364 17582 process.cpp:1367] libprocess is initialized on 172.17.0.9:38439 with 24 worker threads
2: [----------] 4 tests from Encryption/NetSocketTest (874 ms total)
2:
2: [----------] 6 tests from SSLVerifyIPAdd/SSLTest
2: [ RUN ] SSLVerifyIPAdd/SSLTest.BasicSameProcess/0
2: I1114 00:46:54.409263 17582 openssl.cpp:514] Will not verify peer certificate!
2: NOTE: Set LIBPROCESS_SSL_VERIFY_CERT=1 to enable peer certificate verification
2: I1114 00:46:54.409278 17582 openssl.cpp:534] LIBPROCESS_SSL_REQUIRE_CERT implies peer certificate verification.
2: LIBPROCESS_SSL_VERIFY_CERT set to true
2: I1114 00:46:54.409389 17582 openssl.cpp:563] Using CA file: /tmp/ic3c2x/cert.pem
2: I1114 00:46:54.409399 17582 openssl.cpp:566] Using CA dir: /tmp/ic3c2x
2: [ OK ] SSLVerifyIPAdd/SSLTest.BasicSameProcess/0 (352 ms)
2: [ RUN ] SSLVerifyIPAdd/SSLTest.BasicSameProcess/1
2: I1114 00:46:54.846900 17582 openssl.cpp:514] Will not verify peer certificate!
2: NOTE: Set LIBPROCESS_SSL_VERIFY_CERT=1 to enable peer certificate verification
2: I1114 00:46:54.846923 17582 openssl.cpp:526] Will use IP address verification in subject alternative name certificate extension.
2: I1114 00:46:54.846928 17582 openssl.cpp:534] LIBPROCESS_SSL_REQUIRE_CERT implies peer certificate verification.
2: LIBPROCESS_SSL_VERIFY_CERT set to true
2: I1114 00:46:54.847043 17582 openssl.cpp:563] Using CA file: /tmp/RwQScR/cert.pem
2: I1114 00:46:54.847054 17582 openssl.cpp:566] Using CA dir: /tmp/RwQScR
2: [ OK ] SSLVerifyIPAdd/SSLTest.BasicSameProcess/1 (436 ms)
2: [ RUN ] SSLVerifyIPAdd/SSLTest.BasicSameProcessUnix/0
2: I1114 00:46:55.202941 17582 openssl.cpp:514] Will not verify peer certificate!
2: NOTE: Set LIBPROCESS_SSL_VERIFY_CERT=1 to enable peer certificate verification
2: I1114 00:46:55.202957 17582 openssl.cpp:520] Will only verify peer certificate if presented!
2: NOTE: Set LIBPROCESS_SSL_REQUIRE_CERT=1 to require peer certificate verification
2: [ OK ] SSLVerifyIPAdd/SSLTest.BasicSameProcessUnix/0 (350 ms)
2: [ RUN ] SSLVerifyIPAdd/SSLTest.BasicSameProcessUnix/1
2: I1114 00:46:55.701550 17582 openssl.cpp:514] Will not verify peer certificate!
2: NOTE: Set LIBPROCESS_SSL_VERIFY_CERT=1 to enable peer certificate verification
2: I1114 00:46:55.701571 17582 openssl.cpp:520] Will only verify peer certificate if presented!
2: NOTE: Set LIBPROCESS_SSL_REQUIRE_CERT=1 to require peer certificate verification
2: I1114 00:46:55.701576 17582 openssl.cpp:526] Will use IP address verification in subject alternative name certificate extension.
2: [ OK ] SSLVerifyIPAdd/SSLTest.BasicSameProcessUnix/1 (498 ms)
2: [ RUN ] SSLVerifyIPAdd/SSLTest.RequireCertificate/0
2: I1114 00:46:55.841533 17582 openssl.cpp:509] CA directory path unspecified! NOTE: Set CA directory path with LIBPROCESS_SSL_CA_DIR=<dirpath>
2: I1114 00:46:55.841555 17582 openssl.cpp:514] Will not verify peer certificate!
2: NOTE: Set LIBPROCESS_SSL_VERIFY_CERT=1 to enable peer certificate verification
2: I1114 00:46:55.841562 17582 openssl.cpp:534] LIBPROCESS_SSL_REQUIRE_CERT implies peer certificate verification.
2: LIBPROCESS_SSL_VERIFY_CERT set to true
2: I1114 00:46:55.841672 17582 openssl.cpp:563] Using CA file: /tmp/cvi4JS/cert.pem
2: WARNING: Logging before InitGoogleLogging() is written to STDERR
2: I1114 00:46:55.860112 19890 openssl.cpp:509] CA directory path unspecified! NOTE: Set CA directory path with LIBPROCESS_SSL_CA_DIR=<dirpath>
2: I1114 00:46:55.860245 19890 openssl.cpp:514] Will not verify peer certificate!
2: NOTE: Set LIBPROCESS_SSL_VERIFY_CERT=1 to enable peer certificate verification
2: I1114 00:46:55.860254 19890 openssl.cpp:534] LIBPROCESS_SSL_REQUIRE_CERT implies peer certificate verification.
2: LIBPROCESS_SSL_VERIFY_CERT set to true
2: I1114 00:46:55.860468 19890 openssl.cpp:563] Using CA file: /tmp/cvi4JS/cert.pem
2: [ OK ] SSLVerifyIPAdd/SSLTest.RequireCertificate/0 (182 ms)
2: [ RUN ] SSLVerifyIPAdd/SSLTest.RequireCertificate/1
2: I1114 00:46:56.388237 17582 openssl.cpp:509] CA directory path unspecified! NOTE: Set CA directory path with LIBPROCESS_SSL_CA_DIR=<dirpath>
2: I1114 00:46:56.388263 17582 openssl.cpp:514] Will not verify peer certificate!
2: NOTE: Set LIBPROCESS_SSL_VERIFY_CERT=1 to enable peer certificate verification
2: I1114 00:46:56.388268 17582 openssl.cpp:526] Will use IP address verification in subject alternative name certificate extension.
2: I1114 00:46:56.388273 17582 openssl.cpp:534] LIBPROCESS_SSL_REQUIRE_CERT implies peer certificate verification.
2: LIBPROCESS_SSL_VERIFY_CERT set to true
2: I1114 00:46:56.388380 17582 openssl.cpp:563] Using CA file: /tmp/jqg5qf/cert.pem
2: WARNING: Logging before InitGoogleLogging() is written to STDERR
2: I1114 00:46:56.410598 19916 openssl.cpp:509] CA directory path unspecified! NOTE: Set CA directory path with LIBPROCESS_SSL_CA_DIR=<dirpath>
2: I1114 00:46:56.410723 19916 openssl.cpp:514] Will not verify peer certificate!
2: NOTE: Set LIBPROCESS_SSL_VERIFY_CERT=1 to enable peer certificate verification
2: I1114 00:46:56.410732 19916 openssl.cpp:526] Will use IP address verification in subject alternative name certificate extension.
2: I1114 00:46:56.410737 19916 openssl.cpp:534] LIBPROCESS_SSL_REQUIRE_CERT implies peer certificate verification.
2: LIBPROCESS_SSL_VERIFY_CERT set to true
2: I1114 00:46:56.410938 19916 openssl.cpp:563] Using CA file: /tmp/jqg5qf/cert.pem
2: [ OK ] SSLVerifyIPAdd/SSLTest.RequireCertificate/1 (604 ms)
2: [----------] 6 tests from SSLVerifyIPAdd/SSLTest (2422 ms total)
2:
2: [----------] Global test environment tear-down
2: [==========] 252 tests from 38 test cases ran. (29520 ms total)
2: [ PASSED ] 252 tests.
2:
2: YOU HAVE 2 DISABLED TESTS
2:
2: I1114 00:46:56.509428 19889 process.cpp:1052] Failed to accept socket: future discarded
2/3 Test #2: ProcessTests ..................... Passed 29.56 sec
test 3
Start 3: MesosTests
3: Test command: /mesos/build/src/mesos-tests
3: Test timeout computed to be: 9.99988e+06
3: I1114 00:46:56.663816 19942 logging.cpp:206] Logging to STDERR
3: I1114 00:46:56.695861 19942 process.cpp:1367] libprocess is initialized on 172.17.0.9:41739 with 24 worker threads
3: I1114 00:47:00.203110 19942 main.cpp:156] Source directory: /mesos
3: I1114 00:47:00.203153 19942 main.cpp:157] Build directory: /mesos/build
3: -------------------------------------------------------------
3: We cannot run any cgroups tests that require mounting
3: hierarchies because you have the following hierarchies mounted:
3: /sys/fs/cgroup/blkio, /sys/fs/cgroup/cpu,cpuacct, /sys/fs/cgroup/cpuset, /sys/fs/cgroup/devices, /sys/fs/cgroup/freezer, /sys/fs/cgroup/hugetlb, /sys/fs/cgroup/memory, /sys/fs/cgroup/net_cls,net_prio, /sys/fs/cgroup/perf_event, /sys/fs/cgroup/pids, /sys/fs/cgroup/systemd
3: We'll disable the CgroupsNoHierarchyTest test fixture for now.
3: -------------------------------------------------------------
3: /usr/bin/curl
3: -------------------------------------------------------------
3: We cannot run any Docker tests because:
3: Failed to get docker version: Failed to execute 'docker -H unix:///var/run/docker.sock --version': exited with status 127
3: -------------------------------------------------------------
3: PING google.com (172.217.3.206) 56(84) bytes of data.
3: 64 bytes from sea15s12-in-f14.1e100.net (172.217.3.206): icmp_seq=1 ttl=54 time=4.34 ms
3:
3: --- google.com ping statistics ---
3: 1 packets transmitted, 1 received, 0% packet loss, time 0ms
3: rtt min/avg/max/mdev = 4.344/4.344/4.344/0.000 ms
3: /usr/sbin/logrotate
3: /bin/nc
3: -------------------------------------------------------------
3: No 'nvidia-smi' command found so no Nvidia GPU tests will run
3: -------------------------------------------------------------
3: -------------------------------------------------------------
3: We cannot run any overlayfs tests because:
3: overlayfs is not supported on your systems
3: -------------------------------------------------------------
3: E1114 00:47:00.518137 19942 perf.cpp:245] Failed to get perf version: Failed to execute perf: exited with status 2
3: -------------------------------------------------------------
3: Could not find the 'perf' command or its version lower that 2.6.39 so tests using it to sample the 'cpu-cycles' hardware event will not be run.
3: -------------------------------------------------------------
3: E1114 00:47:00.622676 19942 perf.cpp:245] Failed to get perf version: Failed to execute perf: exited with status 2
3: -------------------------------------------------------------
3: require 'perf' version >= 2.6.39 so no 'perf' tests will be run
3: -------------------------------------------------------------
3: /usr/bin/unzip
3: Note: Google Test filter = *-FetcherTest.ROOT_RootProtectedFileURI:GarbageCollectorIntegrationTest.ROOT_BusyMountPoint:HealthCheckTest.ROOT_HealthyTaskWithContainerImage:HealthCheckTest.ROOT_DOCKER_DockerHealthyTask:HealthCheckTest.ROOT_DOCKER_DockerHealthStatusChange:HealthCheckTest.ROOT_INTERNET_CURL_HealthyTaskViaHTTPWithContainerImage:HealthCheckTest.ROOT_INTERNET_CURL_HealthyTaskViaHTTPSWithContainerImage:HealthCheckTest.ROOT_INTERNET_CURL_HealthyTaskViaTCPWithContainerImage:HealthCheckTest.ROOT_DOCKER_DockerHealthyTaskViaHTTP:HealthCheckTest.ROOT_DOCKER_DockerHealthyTaskViaHTTPS:HealthCheckTest.ROOT_DOCKER_DockerHealthyTaskViaTCP:HookTest.ROOT_DOCKER_VerifySlavePreLaunchDockerTaskExecutorDecorator:HookTest.ROOT_DOCKER_VerifySlavePreLaunchDockerValidator:HookTest.ROOT_DOCKER_VerifySlavePreLaunchDockerHook:HookTest.ROOT_DOCKER_VerifySlavePostFetchHook:Resources_Filter_BENCHMARK_Test.Filters:SlaveTest.ROOT_LaunchTaskInfoWithContainerInfo:SlaveTest.ROOT_RunTaskWithCommandInfoWithoutUser:SlaveTest.DISABLED_ROOT_RunTaskWithCommandInfoWithUser:DockerTest.ROOT_DOCKER_interface:DockerTest.ROOT_DOCKER_kill:DockerTest.ROOT_DOCKER_Version:DockerTest.ROOT_DOCKER_CheckCommandWithShell:DockerTest.ROOT_DOCKER_CheckPortResource:DockerTest.ROOT_DOCKER_CancelPull:DockerTest.ROOT_DOCKER_MountRelativeHostPath:DockerTest.ROOT_DOCKER_MountAbsoluteHostPath:DockerTest.ROOT_DOCKER_MountRelativeContainerPath:DockerTest.ROOT_DOCKER_MountRelativeHostPathRelativeContainerPath:DockerTest.ROOT_DOCKER_NVIDIA_GPU_DeviceAllow:DockerTest.ROOT_DOCKER_NVIDIA_GPU_InspectDevices:DockerTest.ROOT_DOCKER_ConflictingVolumeDriversInMultipleVolumes:DockerTest.ROOT_DOCKER_ConflictingVolumeDrivers:SlaveRecoveryTest/0.DISABLED_ROOT_CGROUPS_ReconnectDefaultExecutor:MesosContainerizerSlaveRecoveryTest.CGROUPS_ROOT_PidNamespaceForward:MesosContainerizerSlaveRecoveryTest.CGROUPS_ROOT_PidNamespaceBackward:DockerContainerizerTest.ROOT_DOCKER_Launch_Executor:DockerContainerizerTest.DISABLED_ROOT_DOCKER_Launch_Executor_Bridged:DockerContainerizerTest.ROOT_DOCKER_Launch:DockerContainerizerTest.ROOT_DOCKER_Kill:DockerContainerizerTest.ROOT_DOCKER_TaskKillingCapability:DockerContainerizerTest.ROOT_DOCKER_Usage:DockerContainerizerTest.ROOT_DOCKER_Update:DockerContainerizerTest.ROOT_DOCKER_Recover:DockerContainerizerTest.ROOT_DOCKER_KillOrphanContainers:DockerContainerizerTest.ROOT_DOCKER_SkipRecoverNonDocker:DockerContainerizerTest.ROOT_DOCKER_SkipRecoverMalformedUUID:DockerContainerizerTest.ROOT_DOCKER_LaunchWithPersistentVolumes:DockerContainerizerTest.ROOT_DOCKER_RecoverPersistentVolumes:DockerContainerizerTest.ROOT_DOCKER_RecoverOrphanedPersistentVolumes:DockerContainerizerTest.ROOT_DOCKER_Logs:DockerContainerizerTest.ROOT_DOCKER_Default_CMD:DockerContainerizerTest.ROOT_DOCKER_Default_CMD_Override:DockerContainerizerTest.ROOT_DOCKER_Default_CMD_Args:DockerContainerizerTest.ROOT_DOCKER_SlaveRecoveryTaskContainer:DockerContainerizerTest.DISABLED_ROOT_DOCKER_SlaveRecoveryExecutorContainer:DockerContainerizerTest.ROOT_DOCKER_NC_PortMapping:DockerContainerizerTest.ROOT_DOCKER_LaunchSandboxWithColon:DockerContainerizerTest.ROOT_DOCKER_DestroyWhileFetching:DockerContainerizerTest.ROOT_DOCKER_DestroyWhilePulling:DockerContainerizerTest.ROOT_DOCKER_DestroyUnknownContainer:DockerContainerizerTest.ROOT_DOCKER_ExecutorCleanupWhenLaunchFailed:DockerContainerizerTest.ROOT_DOCKER_FetchFailure:DockerContainerizerTest.ROOT_DOCKER_DockerPullFailure:DockerContainerizerTest.ROOT_DOCKER_DockerInspectDiscard:DockerContainerizerTest.ROOT_DOCKER_WaitUnknownContainer:DockerContainerizerTest.ROOT_DOCKER_NoTransitionFromKillingToRunning:DockerContainerizerTest.ROOT_DOCKER_NoTransitionFromKillingToFinished:DockerContainerizerTest.ROOT_DOCKER_CGROUPS_CFS_CgroupsEnableCFS:DockerContainerizerTest.ROOT_DOCKER_Non_Root_Sandbox:DockerContainerizerTest.ROOT_DOCKER_DefaultDNS:DockerContainerizerIPv6Test.ROOT_DOCKER_LaunchIPv6HostNetwork:DockerContainerizerIPv6UserNetworkTest.ROOT_DOCKER_USERNETWORK_LaunchIPv6Container:NamespacesIsolatorTest.ROOT_PidNamespace:NamespacesIsolatorTest.ROOT_SharePidNamespace:NamespacesIsolatorTest.ROOT_SharePidNamespaceWhenDisallow:NamespacesIsolatorTest.ROOT_IPCNamespace:MesosContainerizerExecuteTest.ROOT_SandboxFileOwnership:ProvisionerAppcTest.ROOT_Provision:ProvisionerAppcTest.ROOT_ProvisionNestedContainer:AppcProvisionerIntegrationTest.ROOT_SimpleLinuxImageTest:OverlayBackendTest.ROOT_OVERLAYFS_OverlayFSBackend:OverlayBackendTest.ROOT_OVERLAYFS_OverlayFSBackendWithManyLayers:BindBackendTest.ROOT_BindBackend:AufsBackendTest.ROOT_AUFS_AufsBackend:AufsBackendTest.ROOT_AUFS_AufsBackendWithManyLayers:CopyBackendTest.ROOT_CopyBackend:ProvisionerDockerTest.ROOT_LocalPullerSimpleCommand:ProvisionerDockerTest.ROOT_INTERNET_CURL_ScratchImage:ProvisionerDockerTest.ROOT_INTERNET_CURL_ImageDigest:ProvisionerDockerTest.ROOT_INTERNET_CURL_CommandTaskUser:ProvisionerDockerTest.ROOT_RecoverNestedOnReboot:VolumeSandboxPathIsolatorTest.ROOT_SelfType:VolumeSandboxPathIsolatorTest.ROOT_SelfTypeOwnership:VolumeSandboxPathIsolatorTest.ROOT_ParentTypeOwnership:CapabilitiesTest.ROOT_PingWithNoNetRawCaps:CapabilitiesTest.ROOT_PingWithNoNetRawCapsChangeUser:CapabilitiesTest.ROOT_PingWithJustNetRawSysAdminCap:AmbientCapabilities.ROOT_SetAmbient:ContainerizerTest.ROOT_CGROUPS_BalloonFramework:CgroupsIsolatorTest.ROOT_CGROUPS_PERF_NET_CLS_UserCgroup:CgroupsIsolatorTest.ROOT_CGROUPS_RevocableCpu:CgroupsIsolatorTest.ROOT_CGROUPS_CFS_EnableCfs:CgroupsIsolatorTest.ROOT_CGROUPS_LimitSwap:CgroupsIsolatorTest.ROOT_CGROUPS_PidsAndTids:CgroupsIsolatorTest.ROOT_CGROUPS_NET_CLS_Isolate:CgroupsIsolatorTest.ROOT_CGROUPS_NET_CLS_ContainerStatus:CgroupsIsolatorTest.ROOT_CGROUPS_PERF_Sample:CgroupsIsolatorTest.ROOT_CGROUPS_PERF_PerfForward:CgroupsIsolatorTest.ROOT_CGROUPS_MemoryForward:CgroupsIsolatorTest.ROOT_CGROUPS_MemoryBackward:CgroupsAnyHierarchyTest.ROOT_CGROUPS_Enabled:CgroupsAnyHierarchyTest.ROOT_CGROUPS_Subsystems:CgroupsAnyHierarchyTest.ROOT_CGROUPS_Mounted:CgroupsAnyHierarchyTest.ROOT_CGROUPS_Get:CgroupsAnyHierarchyTest.ROOT_CGROUPS_NestedCgroups:CgroupsAnyHierarchyTest.ROOT_CGROUPS_Tasks:CgroupsAnyHierarchyTest.ROOT_CGROUPS_Read:CgroupsAnyHierarchyTest.ROOT_CGROUPS_Write:CgroupsAnyHierarchyTest.ROOT_CGROUPS_CFS_Big_Quota:CgroupsAnyHierarchyWithCpuMemoryTest.ROOT_CGROUPS_Busy:CgroupsAnyHierarchyWithCpuMemoryTest.ROOT_CGROUPS_SubsystemsHierarchy:CgroupsAnyHierarchyWithCpuMemoryTest.ROOT_CGROUPS_FindCgroupSubsystems:CgroupsAnyHierarchyWithCpuMemoryTest.ROOT_CGROUPS_MountedSubsystems:CgroupsAnyHierarchyWithCpuMemoryTest.ROOT_CGROUPS_CreateRemove:CgroupsAnyHierarchyWithCpuMemoryTest.ROOT_CGROUPS_Listen:CgroupsAnyHierarchyWithCpuMemoryTest.ROOT_CGROUPS_FreezeNonFreezer:CgroupsNoHierarchyTest.ROOT_CGROUPS_NOHIERARCHY_MountUnmountHierarchy:CgroupsAnyHierarchyWithCpuAcctMemoryTest.ROOT_CGROUPS_Stat:CgroupsAnyHierarchyWithCpuAcctMemoryTest.ROOT_CGROUPS_CpuAcctsStats:CgroupsAnyHierarchyWithFreezerTest.ROOT_CGROUPS_Freeze:CgroupsAnyHierarchyWithFreezerTest.ROOT_CGROUPS_Kill:CgroupsAnyHierarchyWithFreezerTest.ROOT_CGROUPS_Destroy:CgroupsAnyHierarchyWithFreezerTest.ROOT_CGROUPS_AssignThreads:CgroupsAnyHierarchyWithFreezerTest.ROOT_CGROUPS_DestroyStoppedProcess:CgroupsAnyHierarchyWithFreezerTest.ROOT_CGROUPS_DestroyTracedProcess:CgroupsAnyHierarchyWithPerfEventTest.ROOT_CGROUPS_PERF_PerfTest:CgroupsAnyHierarchyMemoryPressureTest.ROOT_IncreaseRSS:CgroupsAnyHierarchyMemoryPressureTest.ROOT_IncreasePageCache:CgroupsAnyHierarchyDevicesTest.ROOT_CGROUPS_Devices:CniIsolatorTest.ROOT_INTERNET_CURL_LaunchCommandTask:CniIsolatorTest.ROOT_VerifyCheckpointedInfo:CniIsolatorTest.ROOT_FailedPlugin:CniIsolatorTest.ROOT_SlaveRecovery:CniIsolatorTest.ROOT_EnvironmentLibprocessIP:CniIsolatorTest.ROOT_INTERNET_CURL_LaunchContainerInHostNetwork:CniIsolatorTest.ROOT_DynamicAddDelofCniConfig:CniIsolatorTest.ROOT_OverrideHostname:CniIsolatorTest.ROOT_VerifyResolverConfig:CniIsolatorTest.ROOT_INTERNET_VerifyResolverConfig:CniIsolatorTest.ROOT_INTERNET_CURL_ReadOnlyBindMounts:CniIsolatorPortMapperTest.ROOT_INTERNET_CURL_PortMapper:DockerVolumeIsolatorTest.ROOT_CommandTaskNoRootfsWithVolumes:DockerVolumeIsolatorTest.ROOT_CommandTaskNoRootfsFailedWithSameVolumes:DockerVolumeIsolatorTest.ROOT_CommandTaskNoRootfsSlaveRecovery:DockerVolumeIsolatorTest.ROOT_CommandTaskNoRootfsSingleVolumeMultipleContainers:DockerVolumeIsolatorTest.ROOT_INTERNET_CURL_CommandTaskRootfsWithAbsolutePathVolume:DockerVolumeIsolatorTest.ROOT_INTERNET_CURL_CommandTaskRootfsWithRelativeVolume:FsTest.ROOT_SharedMount:FsTest.ROOT_SlaveMount:LinuxCapabilitiesIsolatorFlagsTest.ROOT_IsolatorFlags:LinuxFilesystemIsolatorTest.ROOT_ChangeRootFilesystem:LinuxFilesystemIsolatorTest.ROOT_Metrics:LinuxFilesystemIsolatorTest.ROOT_PersistentVolumeWithRootFilesystem:LinuxFilesystemIsolatorTest.ROOT_PersistentVolumeAndHostVolumeWithRootFilesystem:LinuxFilesystemIsolatorTest.ROOT_PersistentVolumeWithoutRootFilesystem:LinuxFilesystemIsolatorTest.ROOT_MultipleContainers:LinuxFilesystemIsolatorTest.ROOT_WorkDirMountNotNeeded:LinuxFilesystemIsolatorTest.ROOT_WorkDirMountNeeded:LinuxFilesystemIsolatorTest.ROOT_PersistentVolumeMountPointCleanup:LinuxFilesystemIsolatorMesosTest.ROOT_ChangeRootFilesystemCommandExecutor:LinuxFilesystemIsolatorMesosTest.ROOT_ChangeRootFilesystemCommandExecutorPersistentVolume:LinuxFilesystemIsolatorMesosTest.ROOT_RecoverOrphanedPersistentVolume:LinuxFilesystemIsolatorMesosTest.ROOT_SandboxEnvironmentVariable:LinuxFilesystemIsolatorMesosTest.ROOT_VolumeUsageExceedsSandboxQuota:LinuxFilesystemIsolatorMesosTest.ROOT_WriteAccessSharedPersistentVolumeReadOnlyMode:MemoryPressureMesosTest.CGROUPS_ROOT_Statistics:MemoryPressureMesosTest.CGROUPS_ROOT_SlaveRecovery:NestedMesosContainerizerTest.ROOT_CGROUPS_LaunchNested:NestedMesosContainerizerTest.ROOT_CGROUPS_DebugNestedContainerInheritsEnvironment:NestedMesosContainerizerTest.ROOT_CGROUPS_DebugNestedContainerInheritsMesosSandbox:NestedMesosContainerizerTest.ROOT_CGROUPS_DebugNestedContainerInheritsWorkingDirectory:NestedMesosContainerizerTest.ROOT_CGROUPS_LaunchNestedDebugCheckPidNamespace:NestedMesosContainerizerTest.ROOT_CGROUPS_LaunchNestedSharePidNamespace:NestedMesosContainerizerTest.ROOT_CGROUPS_INTERNET_CURL_LaunchNestedDebugCheckMntNamespace:NestedMesosContainerizerTest.ROOT_CGROUPS_DestroyDebugContainerOnRecover:NestedMesosContainerizerTest.ROOT_CGROUPS_DestroyNested:NestedMesosContainerizerTest.ROOT_CGROUPS_DestroyParent:NestedMesosContainerizerTest.ROOT_CGROUPS_ParentExit:NestedMesosContainerizerTest.ROOT_CGROUPS_ParentSigterm:NestedMesosContainerizerTest.ROOT_CGROUPS_RecoverNested:NestedMesosContainerizerTest.ROOT_CGROUPS_RecoverLauncherOrphans:NestedMesosContainerizerTest.ROOT_CGROUPS_RecoverNestedLauncherOrphans:NestedMesosContainerizerTest.ROOT_CGROUPS_RecoverLauncherOrphanAndSingleNestedLauncherOrphan:NestedMesosContainerizerTest.ROOT_CGROUPS_RecoverMultipleNestedLauncherOrphans:NestedMesosContainerizerTest.ROOT_CGROUPS_RecoverNestedContainersWithLauncherOrphans:NestedMesosContainerizerTest.ROOT_CGROUPS_RecoverLauncherOrphanAndMultipleNestedLauncherOrphans:NestedMesosContainerizerTest.ROOT_CGROUPS_WaitAfterDestroy:NestedMesosContainerizerTest.ROOT_CGROUPS_AgentEnvironmentNotLeaked:NestedMesosContainerizerTest.ROOT_CGROUPS_LaunchNestedThreeLevels:NestedMesosContainerizerTest.ROOT_CGROUPS_Remove:NestedMesosContainerizerTest.ROOT_CGROUPS_RemoveAfterParentDestroyed:NsTest.ROOT_setns:NsTest.ROOT_setnsMultipleThreads:NsTest.ROOT_getns:NsTest.ROOT_clone:NvidiaGpuTest.ROOT_CGROUPS_NVIDIA_GPU_VerifyDeviceAccess:NvidiaGpuTest.ROOT_INTERNET_CURL_CGROUPS_NVIDIA_GPU_NvidiaDockerImage:NvidiaGpuTest.ROOT_CGROUPS_NVIDIA_GPU_FractionalResources:NvidiaGpuTest.NVIDIA_GPU_Discovery:NvidiaGpuTest.ROOT_CGROUPS_NVIDIA_GPU_FlagValidation:NvidiaGpuTest.NVIDIA_GPU_Allocator:NvidiaGpuTest.ROOT_NVIDIA_GPU_VolumeCreation:NvidiaGpuTest.ROOT_NVIDIA_GPU_VolumeShouldInject:NvidiaGpuTest.ROOT_CGROUPS_NVIDIA_GPU_DefaultExecutorVerifyDeviceAccess:PerfTest.ROOT_PERF_Events:PerfTest.ROOT_PERF_Sample:DockerArchiveTest.ROOT_CreateDockerLocalTar:DockerRuntimeIsolatorTest.ROOT_DockerDefaultCmdLocalPuller:DockerRuntimeIsolatorTest.ROOT_DockerDefaultEntryptLocalPuller:DockerRuntimeIsolatorTest.ROOT_INTERNET_CURL_DockerDefaultEntryptRegistryPuller:DockerRuntimeIsolatorTest.ROOT_INTERNET_CURL_NestedSimpleCommand:DockerRuntimeIsolatorTest.ROOT_NestedDockerDefaultCmdLocalPuller:DockerRuntimeIsolatorTest.ROOT_NestedDockerDefaultEntryptLocalPuller:SchedTest.ROOT_PolicySelf:SchedTest.ROOT_PolicyChild:VolumeHostPathIsolatorTest.ROOT_VolumeFromHost:VolumeHostPathIsolatorTest.ROOT_FileVolumeFromHost:VolumeHostPathIsolatorTest.ROOT_VolumeFromHostSandboxMountPoint:VolumeHostPathIsolatorTest.ROOT_FileVolumeFromHostSandboxMountPoint:MesosContainerizer/DefaultExecutorTest.ROOT_ContainerStatusForTask/0:MesosContainerizer/DefaultExecutorTest.ROOT_NoTransitionFromKillingToFinished/0:MesosContainerizer/DefaultExecutorTest.ROOT_MultiTaskgroupSharePidNamespace/0:MesosContainerizer/DefaultExecutorTest.ROOT_INTERNET_CURL_DockerTaskWithFileURI/0:ROOT_DOCKER_DockerAndMesosContainerizers/DefaultExecutorTest.TaskRunning/0:ROOT_DOCKER_DockerAndMesosContainerizers/DefaultExecutorTest.KillTask/0:ROOT_DOCKER_DockerAndMesosContainerizers/DefaultExecutorTest.KillMultipleTasks/0:ROOT_DOCKER_DockerAndMesosContainerizers/DefaultExecutorTest.KillTaskGroupOnTaskFailure/0:ROOT_DOCKER_DockerAndMesosContainerizers/DefaultExecutorTest.TaskUsesExecutor/0:ROOT_DOCKER_DockerAndMesosContainerizers/DefaultExecutorTest.ROOT_ContainerStatusForTask/0:ROOT_DOCKER_DockerAndMesosContainerizers/DefaultExecutorTest.CommitSuicideOnTaskFailure/0:ROOT_DOCKER_DockerAndMesosContainerizers/DefaultExecutorTest.CommitSuicideOnKillTask/0:ROOT_DOCKER_DockerAndMesosContainerizers/DefaultExecutorTest.ReservedResources/0:ROOT_DOCKER_DockerAndMesosContainerizers/DefaultExecutorTest.SigkillExecutor/0:ROOT_DOCKER_DockerAndMesosContainerizers/DefaultExecutorTest.ROOT_NoTransitionFromKillingToFinished/0:ROOT_DOCKER_DockerAndMesosContainerizers/DefaultExecutorTest.ROOT_MultiTaskgroupSharePidNamespace/0:ROOT_DOCKER_DockerAndMesosContainerizers/DefaultExecutorTest.ResourceLimitation/0:ROOT_DOCKER_DockerAndMesosContainerizers/DefaultExecutorTest.TaskWithFileURI/0:ROOT_DOCKER_DockerAndMesosContainerizers/DefaultExecutorTest.ROOT_INTERNET_CURL_DockerTaskWithFileURI/0:LauncherAndIsolationParam/PersistentVolumeDefaultExecutor.ROOT_PersistentResources/0:LauncherAndIsolationParam/PersistentVolumeDefaultExecutor.ROOT_PersistentResources/1:LauncherAndIsolationParam/PersistentVolumeDefaultExecutor.ROOT_PersistentResources/2:LauncherAndIsolationParam/PersistentVolumeDefaultExecutor.ROOT_TaskSandboxPersistentVolume/0:LauncherAndIsolationParam/PersistentVolumeDefaultExecutor.ROOT_TaskSandboxPersistentVolume/1:LauncherAndIsolationParam/PersistentVolumeDefaultExecutor.ROOT_TaskSandboxPersistentVolume/2:LauncherAndIsolationParam/PersistentVolumeDefaultExecutor.ROOT_TasksSharingViaSandboxVolumes/0:LauncherAndIsolationParam/PersistentVolumeDefaultExecutor.ROOT_TasksSharingViaSandboxVolumes/1:LauncherAndIsolationParam/PersistentVolumeDefaultExecutor.ROOT_TasksSharingViaSandboxVolumes/2:LauncherAndIsolationParam/PersistentVolumeDefaultExecutor.ROOT_TaskGroupsSharingViaSandboxVolumes/0:LauncherAndIsolationParam/PersistentVolumeDefaultExecutor.ROOT_TaskGroupsSharingViaSandboxVolumes/1:LauncherAndIsolationParam/PersistentVolumeDefaultExecutor.ROOT_TaskGroupsSharingViaSandboxVolumes/2:LauncherAndIsolationParam/PersistentVolumeDefaultExecutor.ROOT_HealthCheckUsingPersistentVolume/0:LauncherAndIsolationParam/PersistentVolumeDefaultExecutor.ROOT_HealthCheckUsingPersistentVolume/1:LauncherAndIsolationParam/PersistentVolumeDefaultExecutor.ROOT_HealthCheckUsingPersistentVolume/2:AllResources/HierarchicalAllocations_BENCHMARK_Test.PersistentVolumes/0:AllResources/HierarchicalAllocations_BENCHMARK_Test.PersistentVolumes/1:AllResources/HierarchicalAllocations_BENCHMARK_Test.PersistentVolumes/2:AllResources/HierarchicalAllocations_BENCHMARK_Test.PersistentVolumes/3:AllResources/HierarchicalAllocations_BENCHMARK_Test.PersistentVolumes/4:AllResources/HierarchicalAllocations_BENCHMARK_Test.PersistentVolumes/5:AllResources/HierarchicalAllocations_BENCHMARK_Test.PersistentVolumes/6:AllResources/HierarchicalAllocations_BENCHMARK_Test.PersistentVolumes/7:AllResources/HierarchicalAllocations_BENCHMARK_Test.PersistentVolumes/8:AllResources/HierarchicalAllocations_BENCHMARK_Test.PersistentVolumes/9:AllResources/HierarchicalAllocations_BENCHMARK_Test.PersistentVolumes/10:AllResources/HierarchicalAllocations_BENCHMARK_Test.PersistentVolumes/11:AllResources/HierarchicalAllocations_BENCHMARK_Test.PersistentVolumes/12:AllResources/HierarchicalAllocations_BENCHMARK_Test.PersistentVolumes/13:AllResources/HierarchicalAllocations_BENCHMARK_Test.PersistentVolumes/14:AllResources/HierarchicalAllocations_BENCHMARK_Test.PersistentVolumes/15:AllResources/HierarchicalAllocations_BENCHMARK_Test.PersistentVolumes/16:AllResources/HierarchicalAllocations_BENCHMARK_Test.PersistentVolumes/17:AllResources/HierarchicalAllocations_BENCHMARK_Test.PersistentVolumes/18:AllResources/HierarchicalAllocations_BENCHMARK_Test.PersistentVolumes/19:AllResources/HierarchicalAllocations_BENCHMARK_Test.PersistentVolumes/20:AllResources/HierarchicalAllocations_BENCHMARK_Test.PersistentVolumes/21:AllResources/HierarchicalAllocations_BENCHMARK_Test.PersistentVolumes/22:AllResources/HierarchicalAllocations_BENCHMARK_Test.PersistentVolumes/23:AllResources/HierarchicalAllocations_BENCHMARK_Test.PersistentVolumes/24:AllResources/HierarchicalAllocations_BENCHMARK_Test.PersistentVolumes/25:AllResources/HierarchicalAllocations_BENCHMARK_Test.PersistentVolumes/26:AllResources/HierarchicalAllocations_BENCHMARK_Test.PersistentVolumes/27:AllResources/HierarchicalAllocations_BENCHMARK_Test.PersistentVolumes/28:AllResources/HierarchicalAllocations_BENCHMARK_Test.PersistentVolumes/29:AllResources/HierarchicalAllocations_BENCHMARK_Test.PersistentVolumes/30:AllResources/HierarchicalAllocations_BENCHMARK_Test.PersistentVolumes/31:AllResources/HierarchicalAllocations_BENCHMARK_Test.PersistentVolumes/32:AllResources/HierarchicalAllocations_BENCHMARK_Test.PersistentVolumes/33:AllResources/HierarchicalAllocations_BENCHMARK_Test.PersistentVolumes/34:AllResources/HierarchicalAllocations_BENCHMARK_Test.PersistentVolumes/35:AllResources/HierarchicalAllocations_BENCHMARK_Test.PersistentVolumes/36:AllResources/HierarchicalAllocations_BENCHMARK_Test.PersistentVolumes/37:AllResources/HierarchicalAllocations_BENCHMARK_Test.PersistentVolumes/38:AllResources/HierarchicalAllocations_BENCHMARK_Test.PersistentVolumes/39:AllResources/HierarchicalAllocations_BENCHMARK_Test.PersistentVolumes/40:AllResources/HierarchicalAllocations_BENCHMARK_Test.PersistentVolumes/41:AllResources/HierarchicalAllocations_BENCHMARK_Test.PersistentVolumes/42:AllResources/HierarchicalAllocations_BENCHMARK_Test.PersistentVolumes/43:AllResources/HierarchicalAllocations_BENCHMARK_Test.PersistentVolumes/44:AllResources/HierarchicalAllocations_BENCHMARK_Test.PersistentVolumes/45:AllResources/HierarchicalAllocations_BENCHMARK_Test.PersistentVolumes/46:AllResources/HierarchicalAllocations_BENCHMARK_Test.PersistentVolumes/47:AllResources/HierarchicalAllocations_BENCHMARK_Test.PersistentVolumes/48:AllResources/HierarchicalAllocations_BENCHMARK_Test.PersistentVolumes/49:AllResources/HierarchicalAllocations_BENCHMARK_Test.PersistentVolumes/50:AllResources/HierarchicalAllocations_BENCHMARK_Test.PersistentVolumes/51:AllResources/HierarchicalAllocations_BENCHMARK_Test.PersistentVolumes/52:AllResources/HierarchicalAllocations_BENCHMARK_Test.PersistentVolumes/53:AllResources/HierarchicalAllocations_BENCHMARK_Test.PersistentVolumes/54:AllResources/HierarchicalAllocations_BENCHMARK_Test.PersistentVolumes/55:AllResources/HierarchicalAllocations_BENCHMARK_Test.PersistentVolumes/56:AllResources/HierarchicalAllocations_BENCHMARK_Test.PersistentVolumes/57:AllResources/HierarchicalAllocations_BENCHMARK_Test.PersistentVolumes/58:AllResources/HierarchicalAllocations_BENCHMARK_Test.PersistentVolumes/59:AllResources/HierarchicalAllocations_BENCHMARK_Test.PersistentVolumes/60:AllResources/HierarchicalAllocations_BENCHMARK_Test.PersistentVolumes/61:AllResources/HierarchicalAllocations_BENCHMARK_Test.PersistentVolumes/62:AllResources/HierarchicalAllocations_BENCHMARK_Test.PersistentVolumes/63:AllResources/HierarchicalAllocations_BENCHMARK_Test.PersistentVolumes/64:AllResources/HierarchicalAllocations_BENCHMARK_Test.PersistentVolumes/65:AllResources/HierarchicalAllocations_BENCHMARK_Test.PersistentVolumes/66:AllResources/HierarchicalAllocations_BENCHMARK_Test.PersistentVolumes/67:AllResources/HierarchicalAllocations_BENCHMARK_Test.PersistentVolumes/68:AllResources/HierarchicalAllocations_BENCHMARK_Test.PersistentVolumes/69:AllResources/HierarchicalAllocations_BENCHMARK_Test.PersistentVolumes/70:AllResources/HierarchicalAllocations_BENCHMARK_Test.PersistentVolumes/71:AllResources/HierarchicalAllocations_BENCHMARK_Test.PersistentVolumes/72:AllResources/HierarchicalAllocations_BENCHMARK_Test.PersistentVolumes/73:AllResources/HierarchicalAllocations_BENCHMARK_Test.PersistentVolumes/74:AllResources/HierarchicalAllocations_BENCHMARK_Test.PersistentVolumes/75:AllResources/HierarchicalAllocations_BENCHMARK_Test.PersistentVolumes/76:AllResources/HierarchicalAllocations_BENCHMARK_Test.PersistentVolumes/77:AllResources/HierarchicalAllocations_BENCHMARK_Test.PersistentVolumes/78:AllResources/HierarchicalAllocations_BENCHMARK_Test.PersistentVolumes/79:AllResources/HierarchicalAllocations_BENCHMARK_Test.PersistentVolumes/80:AllResources/HierarchicalAllocations_BENCHMARK_Test.PersistentVolumes/81:AllResources/HierarchicalAllocations_BENCHMARK_Test.PersistentVolumes/82:AllResources/HierarchicalAllocations_BENCHMARK_Test.PersistentVolumes/83:AllResources/HierarchicalAllocations_BENCHMARK_Test.PersistentVolumes/84:AllResources/HierarchicalAllocations_BENCHMARK_Test.PersistentVolumes/85:AllResources/HierarchicalAllocations_BENCHMARK_Test.PersistentVolumes/86:AllResources/HierarchicalAllocations_BENCHMARK_Test.PersistentVolumes/87:AllResources/HierarchicalAllocations_BENCHMARK_Test.PersistentVolumes/88:AllResources/HierarchicalAllocations_BENCHMARK_Test.PersistentVolumes/89:AllResources/HierarchicalAllocations_BENCHMARK_Test.PersistentVolumes/90:AllResources/HierarchicalAllocations_BENCHMARK_Test.PersistentVolumes/91:AllResources/HierarchicalAllocations_BENCHMARK_Test.PersistentVolumes/92:AllResources/HierarchicalAllocations_BENCHMARK_Test.PersistentVolumes/93:AllResources/HierarchicalAllocations_BENCHMARK_Test.PersistentVolumes/94:AllResources/HierarchicalAllocations_BENCHMARK_Test.PersistentVolumes/95:AllResources/HierarchicalAllocations_BENCHMARK_Test.PersistentVolumes/96:AllResources/HierarchicalAllocations_BENCHMARK_Test.PersistentVolumes/97:AllResources/HierarchicalAllocations_BENCHMARK_Test.PersistentVolumes/98:AllResources/HierarchicalAllocations_BENCHMARK_Test.PersistentVolumes/99:AllResources/HierarchicalAllocations_BENCHMARK_Test.PersistentVolumes/100:AllResources/HierarchicalAllocations_BENCHMARK_Test.PersistentVolumes/101:AllResources/HierarchicalAllocations_BENCHMARK_Test.PersistentVolumes/102:AllResources/HierarchicalAllocations_BENCHMARK_Test.PersistentVolumes/103:AllResources/HierarchicalAllocations_BENCHMARK_Test.PersistentVolumes/104:AllResources/HierarchicalAllocations_BENCHMARK_Test.PersistentVolumes/105:AllResources/HierarchicalAllocations_BENCHMARK_Test.PersistentVolumes/106:AllResources/HierarchicalAllocations_BENCHMARK_Test.PersistentVolumes/107:AllResources/HierarchicalAllocations_BENCHMARK_Test.PersistentVolumes/108:AllResources/HierarchicalAllocations_BENCHMARK_Test.PersistentVolumes/109:AllResources/HierarchicalAllocations_BENCHMARK_Test.PersistentVolumes/110:AllResources/HierarchicalAllocations_BENCHMARK_Test.PersistentVolumes/111:AllResources/HierarchicalAllocations_BENCHMARK_Test.PersistentVolumes/112:AllResources/HierarchicalAllocations_BENCHMARK_Test.PersistentVolumes/113:AllResources/HierarchicalAllocations_BENCHMARK_Test.PersistentVolumes/114:AllResources/HierarchicalAllocations_BENCHMARK_Test.PersistentVolumes/115:AllResources/HierarchicalAllocations_BENCHMARK_Test.PersistentVolumes/116:AllResources/HierarchicalAllocations_BENCHMARK_Test.PersistentVolumes/117:AllResources/HierarchicalAllocations_BENCHMARK_Test.PersistentVolumes/118:AllResources/HierarchicalAllocations_BENCHMARK_Test.PersistentVolumes/119:AllResources/HierarchicalAllocations_BENCHMARK_Test.PersistentVolumes/120:AllResources/HierarchicalAllocations_BENCHMARK_Test.PersistentVolumes/121:AllResources/HierarchicalAllocations_BENCHMARK_Test.PersistentVolumes/122:AllResources/HierarchicalAllocations_BENCHMARK_Test.PersistentVolumes/123:AllResources/HierarchicalAllocations_BENCHMARK_Test.PersistentVolumes/124:AllResources/HierarchicalAllocations_BENCHMARK_Test.PersistentVolumes/125:AllResources/HierarchicalAllocations_BENCHMARK_Test.PersistentVolumes/126:AllResources/HierarchicalAllocations_BENCHMARK_Test.PersistentVolumes/127:AllResources/HierarchicalAllocations_BENCHMARK_Test.PersistentVolumes/128:AllResources/HierarchicalAllocations_BENCHMARK_Test.PersistentVolumes/129:AllResources/HierarchicalAllocations_BENCHMARK_Test.PersistentVolumes/130:AllResources/HierarchicalAllocations_BENCHMARK_Test.PersistentVolumes/131:AllResources/HierarchicalAllocations_BENCHMARK_Test.PersistentVolumes/132:AllResources/HierarchicalAllocations_BENCHMARK_Test.PersistentVolumes/133:AllResources/HierarchicalAllocations_BENCHMARK_Test.PersistentVolumes/134:AllResources/HierarchicalAllocations_BENCHMARK_Test.PersistentVolumes/135:AllResources/HierarchicalAllocations_BENCHMARK_Test.PersistentVolumes/136:AllResources/HierarchicalAllocations_BENCHMARK_Test.PersistentVolumes/137:AllResources/HierarchicalAllocations_BENCHMARK_Test.PersistentVolumes/138:AllResources/HierarchicalAllocations_BENCHMARK_Test.PersistentVolumes/139:AllResources/HierarchicalAllocations_BENCHMARK_Test.PersistentVolumes/140:AllResources/HierarchicalAllocations_BENCHMARK_Test.PersistentVolumes/141:AllResources/HierarchicalAllocations_BENCHMARK_Test.PersistentVolumes/142:AllResources/HierarchicalAllocations_BENCHMARK_Test.PersistentVolumes/143:SlaveAndFrameworkCount/HierarchicalAllocator_BENCHMARK_Test.AddAndUpdateSlave/0:SlaveAndFrameworkCount/HierarchicalAllocator_BENCHMARK_Test.AddAndUpdateSlave/1:SlaveAndFrameworkCount/HierarchicalAllocator_BENCHMARK_Test.AddAndUpdateSlave/2:SlaveAndFrameworkCount/HierarchicalAllocator_BENCHMARK_Test.AddAndUpdateSlave/3:SlaveAndFrameworkCount/HierarchicalAllocator_BENCHMARK_Test.AddAndUpdateSlave/4:SlaveAndFrameworkCount/HierarchicalAllocator_BENCHMARK_Test.AddAndUpdateSlave/5:SlaveAndFrameworkCount/HierarchicalAllocator_BENCHMARK_Test.AddAndUpdateSlave/6:SlaveAndFrameworkCount/HierarchicalAllocator_BENCHMARK_Test.AddAndUpdateSlave/7:SlaveAndFrameworkCount/HierarchicalAllocator_BENCHMARK_Test.AddAndUpdateSlave/8:SlaveAndFrameworkCount/HierarchicalAllocator_BENCHMARK_Test.AddAndUpdateSlave/9:SlaveAndFrameworkCount/HierarchicalAllocator_BENCHMARK_Test.AddAndUpdateSlave/10:SlaveAndFrameworkCount/HierarchicalAllocator_BENCHMARK_Test.AddAndUpdateSlave/11:SlaveAndFrameworkCount/HierarchicalAllocator_BENCHMARK_Test.AddAndUpdateSlave/12:SlaveAndFrameworkCount/HierarchicalAllocator_BENCHMARK_Test.AddAndUpdateSlave/13:SlaveAndFrameworkCount/HierarchicalAllocator_BENCHMARK_Test.AddAndUpdateSlave/14:SlaveAndFrameworkCount/HierarchicalAllocator_BENCHMARK_Test.AddAndUpdateSlave/15:SlaveAndFrameworkCount/HierarchicalAllocator_BENCHMARK_Test.AddAndUpdateSlave/16:SlaveAndFrameworkCount/HierarchicalAllocator_BENCHMARK_Test.AddAndUpdateSlave/17:SlaveAndFrameworkCount/HierarchicalAllocator_BENCHMARK_Test.AddAndUpdateSlave/18:SlaveAndFrameworkCount/HierarchicalAllocator_BENCHMARK_Test.AddAndUpdateSlave/19:SlaveAndFrameworkCount/HierarchicalAllocator_BENCHMARK_Test.AddAndUpdateSlave/20:SlaveAndFrameworkCount/HierarchicalAllocator_BENCHMARK_Test.AddAndUpdateSlave/21:SlaveAndFrameworkCount/HierarchicalAllocator_BENCHMARK_Test.AddAndUpdateSlave/22:SlaveAndFrameworkCount/HierarchicalAllocator_BENCHMARK_Test.AddAndUpdateSlave/23:SlaveAndFrameworkCount/HierarchicalAllocator_BENCHMARK_Test.AddAndUpdateSlave/24:SlaveAndFrameworkCount/HierarchicalAllocator_BENCHMARK_Test.AddAndUpdateSlave/25:SlaveAndFrameworkCount/HierarchicalAllocator_BENCHMARK_Test.AddAndUpdateSlave/26:SlaveAndFrameworkCount/HierarchicalAllocator_BENCHMARK_Test.AddAndUpdateSlave/27:SlaveAndFrameworkCount/HierarchicalAllocator_BENCHMARK_Test.AddAndUpdateSlave/28:SlaveAndFrameworkCount/HierarchicalAllocator_BENCHMARK_Test.AddAndUpdateSlave/29:SlaveAndFrameworkCount/HierarchicalAllocator_BENCHMARK_Test.AddAndUpdateSlave/30:SlaveAndFrameworkCount/HierarchicalAllocator_BENCHMARK_Test.AddAndUpdateSlave/31:SlaveAndFrameworkCount/HierarchicalAllocator_BENCHMARK_Test.AddAndUpdateSlave/32:SlaveAndFrameworkCount/HierarchicalAllocator_BENCHMARK_Test.AddAndUpdateSlave/33:SlaveAndFrameworkCount/HierarchicalAllocator_BENCHMARK_Test.AddAndUpdateSlave/34:SlaveAndFrameworkCount/HierarchicalAllocator_BENCHMARK_Test.AddAndUpdateSlave/35:SlaveAndFrameworkCount/HierarchicalAllocator_BENCHMARK_Test.AddAndUpdateSlave/36:SlaveAndFrameworkCount/HierarchicalAllocator_BENCHMARK_Test.AddAndUpdateSlave/37:SlaveAndFrameworkCount/HierarchicalAllocator_BENCHMARK_Test.AddAndUpdateSlave/38:SlaveAndFrameworkCount/HierarchicalAllocator_BENCHMARK_Test.AddAndUpdateSlave/39:SlaveAndFrameworkCount/HierarchicalAllocator_BENCHMARK_Test.AddAndUpdateSlave/40:SlaveAndFrameworkCount/HierarchicalAllocator_BENCHMARK_Test.AddAndUpdateSlave/41:SlaveAndFrameworkCount/HierarchicalAllocator_BENCHMARK_Test.AddAndUpdateSlave/42:SlaveAndFrameworkCount/HierarchicalAllocator_BENCHMARK_Test.AddAndUpdateSlave/43:SlaveAndFrameworkCount/HierarchicalAllocator_BENCHMARK_Test.AddAndUpdateSlave/44:SlaveAndFrameworkCount/HierarchicalAllocator_BENCHMARK_Test.AddAndUpdateSlave/45:SlaveAndFrameworkCount/HierarchicalAllocator_BENCHMARK_Test.AddAndUpdateSlave/46:SlaveAndFrameworkCount/HierarchicalAllocator_BENCHMARK_Test.AddAndUpdateSlave/47:SlaveAndFrameworkCount/HierarchicalAllocator_BENCHMARK_Test.DeclineOffers/0:SlaveAndFrameworkCount/HierarchicalAllocator_BENCHMARK_Test.DeclineOffers/1:SlaveAndFrameworkCount/HierarchicalAllocator_BENCHMARK_Test.DeclineOffers/2:SlaveAndFrameworkCount/HierarchicalAllocator_BENCHMARK_Test.DeclineOffers/3:SlaveAndFrameworkCount/HierarchicalAllocator_BENCHMARK_Test.DeclineOffers/4:SlaveAndFrameworkCount/HierarchicalAllocator_BENCHMARK_Test.DeclineOffers/5:SlaveAndFrameworkCount/HierarchicalAllocator_BENCHMARK_Test.DeclineOffers/6:SlaveAndFrameworkCount/HierarchicalAllocator_BENCHMARK_Test.DeclineOffers/7:SlaveAndFrameworkCount/HierarchicalAllocator_BENCHMARK_Test.DeclineOffers/8:SlaveAndFrameworkCount/HierarchicalAllocator_BENCHMARK_Test.DeclineOffers/9:SlaveAndFrameworkCount/HierarchicalAllocator_BENCHMARK_Test.DeclineOffers/10:SlaveAndFrameworkCount/HierarchicalAllocator_BENCHMARK_Test.DeclineOffers/11:SlaveAndFrameworkCount/HierarchicalAllocator_BENCHMARK_Test.DeclineOffers/12:SlaveAndFrameworkCount/HierarchicalAllocator_BENCHMARK_Test.DeclineOffers/13:SlaveAndFrameworkCount/HierarchicalAllocator_BENCHMARK_Test.DeclineOffers/14:SlaveAndFrameworkCount/HierarchicalAllocator_BENCHMARK_Test.DeclineOffers/15:SlaveAndFrameworkCount/HierarchicalAllocator_BENCHMARK_Test.DeclineOffers/16:SlaveAndFrameworkCount/HierarchicalAllocator_BENCHMARK_Test.DeclineOffers/17:SlaveAndFrameworkCount/HierarchicalAllocator_BENCHMARK_Test.DeclineOffers/18:SlaveAndFrameworkCount/HierarchicalAllocator_BENCHMARK_Test.DeclineOffers/19:SlaveAndFrameworkCount/HierarchicalAllocator_BENCHMARK_Test.DeclineOffers/20:SlaveAndFrameworkCount/HierarchicalAllocator_BENCHMARK_Test.DeclineOffers/21:SlaveAndFrameworkCount/HierarchicalAllocator_BENCHMARK_Test.DeclineOffers/22:SlaveAndFrameworkCount/HierarchicalAllocator_BENCHMARK_Test.DeclineOffers/23:SlaveAndFrameworkCount/HierarchicalAllocator_BENCHMARK_Test.DeclineOffers/24:SlaveAndFrameworkCount/HierarchicalAllocator_BENCHMARK_Test.DeclineOffers/25:SlaveAndFrameworkCount/HierarchicalAllocator_BENCHMARK_Test.DeclineOffers/26:SlaveAndFrameworkCount/HierarchicalAllocator_BENCHMARK_Test.DeclineOffers/27:SlaveAndFrameworkCount/HierarchicalAllocator_BENCHMARK_Test.DeclineOffers/28:SlaveAndFrameworkCount/HierarchicalAllocator_BENCHMARK_Test.DeclineOffers/29:SlaveAndFrameworkCount/HierarchicalAllocator_BENCHMARK_Test.DeclineOffers/30:SlaveAndFrameworkCount/HierarchicalAllocator_BENCHMARK_Test.DeclineOffers/31:SlaveAndFrameworkCount/HierarchicalAllocator_BENCHMARK_Test.DeclineOffers/32:SlaveAndFrameworkCount/HierarchicalAllocator_BENCHMARK_Test.DeclineOffers/33:SlaveAndFrameworkCount/HierarchicalAllocator_BENCHMARK_Test.DeclineOffers/34:SlaveAndFrameworkCount/HierarchicalAllocator_BENCHMARK_Test.DeclineOffers/35:SlaveAndFrameworkCount/HierarchicalAllocator_BENCHMARK_Test.DeclineOffers/36:SlaveAndFrameworkCount/HierarchicalAllocator_BENCHMARK_Test.DeclineOffers/37:SlaveAndFrameworkCount/HierarchicalAllocator_BENCHMARK_Test.DeclineOffers/38:SlaveAndFrameworkCount/HierarchicalAllocator_BENCHMARK_Test.DeclineOffers/39:SlaveAndFrameworkCount/HierarchicalAllocator_BENCHMARK_Test.DeclineOffers/40:SlaveAndFrameworkCount/HierarchicalAllocator_BENCHMARK_Test.DeclineOffers/41:SlaveAndFrameworkCount/HierarchicalAllocator_BENCHMARK_Test.DeclineOffers/42:SlaveAndFrameworkCount/HierarchicalAllocator_BENCHMARK_Test.DeclineOffers/43:SlaveAndFrameworkCount/HierarchicalAllocator_BENCHMARK_Test.DeclineOffers/44:SlaveAndFrameworkCount/HierarchicalAllocator_BENCHMARK_Test.DeclineOffers/45:SlaveAndFrameworkCount/HierarchicalAllocator_BENCHMARK_Test.DeclineOffers/46:SlaveAndFrameworkCount/HierarchicalAllocator_BENCHMARK_Test.DeclineOffers/47:SlaveAndFrameworkCount/HierarchicalAllocator_BENCHMARK_Test.ResourceLabels/0:SlaveAndFrameworkCount/HierarchicalAllocator_BENCHMARK_Test.ResourceLabels/1:SlaveAndFrameworkCount/HierarchicalAllocator_BENCHMARK_Test.ResourceLabels/2:SlaveAndFrameworkCount/HierarchicalAllocator_BENCHMARK_Test.ResourceLabels/3:SlaveAndFrameworkCount/HierarchicalAllocator_BENCHMARK_Test.ResourceLabels/4:SlaveAndFrameworkCount/HierarchicalAllocator_BENCHMARK_Test.ResourceLabels/5:SlaveAndFrameworkCount/HierarchicalAllocator_BENCHMARK_Test.ResourceLabels/6:SlaveAndFrameworkCount/HierarchicalAllocator_BENCHMARK_Test.ResourceLabels/7:SlaveAndFrameworkCount/HierarchicalAllocator_BENCHMARK_Test.ResourceLabels/8:SlaveAndFrameworkCount/HierarchicalAllocator_BENCHMARK_Test.ResourceLabels/9:SlaveAndFrameworkCount/HierarchicalAllocator_BENCHMARK_Test.ResourceLabels/10:SlaveAndFrameworkCount/HierarchicalAllocator_BENCHMARK_Test.ResourceLabels/11:SlaveAndFrameworkCount/HierarchicalAllocator_BENCHMARK_Test.ResourceLabels/12:SlaveAndFrameworkCount/HierarchicalAllocator_BENCHMARK_Test.ResourceLabels/13:SlaveAndFrameworkCount/HierarchicalAllocator_BENCHMARK_Test.ResourceLabels/14:SlaveAndFrameworkCount/HierarchicalAllocator_BENCHMARK_Test.ResourceLabels/15:SlaveAndFrameworkCount/HierarchicalAllocator_BENCHMARK_Test.ResourceLabels/16:SlaveAndFrameworkCount/HierarchicalAllocator_BENCHMARK_Test.ResourceLabels/17:SlaveAndFrameworkCount/HierarchicalAllocator_BENCHMARK_Test.ResourceLabels/18:SlaveAndFrameworkCount/HierarchicalAllocator_BENCHMARK_Test.ResourceLabels/19:SlaveAndFrameworkCount/HierarchicalAllocator_BENCHMARK_Test.ResourceLabels/20:SlaveAndFrameworkCount/HierarchicalAllocator_BENCHMARK_Test.ResourceLabels/21:SlaveAndFrameworkCount/HierarchicalAllocator_BENCHMARK_Test.ResourceLabels/22:SlaveAndFrameworkCount/HierarchicalAllocator_BENCHMARK_Test.ResourceLabels/23:SlaveAndFrameworkCount/HierarchicalAllocator_BENCHMARK_Test.ResourceLabels/24:SlaveAndFrameworkCount/HierarchicalAllocator_BENCHMARK_Test.ResourceLabels/25:SlaveAndFrameworkCount/HierarchicalAllocator_BENCHMARK_Test.ResourceLabels/26:SlaveAndFrameworkCount/HierarchicalAllocator_BENCHMARK_Test.ResourceLabels/27:SlaveAndFrameworkCount/HierarchicalAllocator_BENCHMARK_Test.ResourceLabels/28:SlaveAndFrameworkCount/HierarchicalAllocator_BENCHMARK_Test.ResourceLabels/29:SlaveAndFrameworkCount/HierarchicalAllocator_BENCHMARK_Test.ResourceLabels/30:SlaveAndFrameworkCount/HierarchicalAllocator_BENCHMARK_Test.ResourceLabels/31:SlaveAndFrameworkCount/HierarchicalAllocator_BENCHMARK_Test.ResourceLabels/32:SlaveAndFrameworkCount/HierarchicalAllocator_BENCHMARK_Test.ResourceLabels/33:SlaveAndFrameworkCount/HierarchicalAllocator_BENCHMARK_Test.ResourceLabels/34:SlaveAndFrameworkCount/HierarchicalAllocator_BENCHMARK_Test.ResourceLabels/35:SlaveAndFrameworkCount/HierarchicalAllocator_BENCHMARK_Test.ResourceLabels/36:SlaveAndFrameworkCount/HierarchicalAllocator_BENCHMARK_Test.ResourceLabels/37:SlaveAndFrameworkCount/HierarchicalAllocator_BENCHMARK_Test.ResourceLabels/38:SlaveAndFrameworkCount/HierarchicalAllocator_BENCHMARK_Test.ResourceLabels/39:SlaveAndFrameworkCount/HierarchicalAllocator_BENCHMARK_Test.ResourceLabels/40:SlaveAndFrameworkCount/HierarchicalAllocator_BENCHMARK_Test.ResourceLabels/41:SlaveAndFrameworkCount/HierarchicalAllocator_BENCHMARK_Test.ResourceLabels/42:SlaveAndFrameworkCount/HierarchicalAllocator_BENCHMARK_Test.ResourceLabels/43:SlaveAndFrameworkCount/HierarchicalAllocator_BENCHMARK_Test.ResourceLabels/44:SlaveAndFrameworkCount/HierarchicalAllocator_BENCHMARK_Test.ResourceLabels/45:SlaveAndFrameworkCount/HierarchicalAllocator_BENCHMARK_Test.ResourceLabels/46:SlaveAndFrameworkCount/HierarchicalAllocator_BENCHMARK_Test.ResourceLabels/47:SlaveAndFrameworkCount/HierarchicalAllocator_BENCHMARK_Test.SuppressOffers/0:SlaveAndFrameworkCount/HierarchicalAllocator_BENCHMARK_Test.SuppressOffers/1:SlaveAndFrameworkCount/HierarchicalAllocator_BENCHMARK_Test.SuppressOffers/2:SlaveAndFrameworkCount/HierarchicalAllocator_BENCHMARK_Test.SuppressOffers/3:SlaveAndFrameworkCount/HierarchicalAllocator_BENCHMARK_Test.SuppressOffers/4:SlaveAndFrameworkCount/HierarchicalAllocator_BENCHMARK_Test.SuppressOffers/5:SlaveAndFrameworkCount/HierarchicalAllocator_BENCHMARK_Test.SuppressOffers/6:SlaveAndFrameworkCount/HierarchicalAllocator_BENCHMARK_Test.SuppressOffers/7:SlaveAndFrameworkCount/HierarchicalAllocator_BENCHMARK_Test.SuppressOffers/8:SlaveAndFrameworkCount/HierarchicalAllocator_BENCHMARK_Test.SuppressOffers/9:SlaveAndFrameworkCount/HierarchicalAllocator_BENCHMARK_Test.SuppressOffers/10:SlaveAndFrameworkCount/HierarchicalAllocator_BENCHMARK_Test.SuppressOffers/11:SlaveAndFrameworkCount/HierarchicalAllocator_BENCHMARK_Test.SuppressOffers/12:SlaveAndFrameworkCount/HierarchicalAllocator_BENCHMARK_Test.SuppressOffers/13:SlaveAndFrameworkCount/HierarchicalAllocator_BENCHMARK_Test.SuppressOffers/14:SlaveAndFrameworkCount/HierarchicalAllocator_BENCHMARK_Test.SuppressOffers/15:SlaveAndFrameworkCount/HierarchicalAllocator_BENCHMARK_Test.SuppressOffers/16:SlaveAndFrameworkCount/HierarchicalAllocator_BENCHMARK_Test.SuppressOffers/17:SlaveAndFrameworkCount/HierarchicalAllocator_BENCHMARK_Test.SuppressOffers/18:SlaveAndFrameworkCount/HierarchicalAllocator_BENCHMARK_Test.SuppressOffers/19:SlaveAndFrameworkCount/HierarchicalAllocator_BENCHMARK_Test.SuppressOffers/20:SlaveAndFrameworkCount/HierarchicalAllocator_BENCHMARK_Test.SuppressOffers/21:SlaveAndFrameworkCount/HierarchicalAllocator_BENCHMARK_Test.SuppressOffers/22:SlaveAndFrameworkCount/HierarchicalAllocator_BENCHMARK_Test.SuppressOffers/23:SlaveAndFrameworkCount/HierarchicalAllocator_BENCHMARK_Test.SuppressOffers/24:SlaveAndFrameworkCount/HierarchicalAllocator_BENCHMARK_Test.SuppressOffers/25:SlaveAndFrameworkCount/HierarchicalAllocator_BENCHMARK_Test.SuppressOffers/26:SlaveAndFrameworkCount/HierarchicalAllocator_BENCHMARK_Test.SuppressOffers/27:SlaveAndFrameworkCount/HierarchicalAllocator_BENCHMARK_Test.SuppressOffers/28:SlaveAndFrameworkCount/HierarchicalAllocator_BENCHMARK_Test.SuppressOffers/29:SlaveAndFrameworkCount/HierarchicalAllocator_BENCHMARK_Test.SuppressOffers/30:SlaveAndFrameworkCount/HierarchicalAllocator_BENCHMARK_Test.SuppressOffers/31:SlaveAndFrameworkCount/HierarchicalAllocator_BENCHMARK_Test.SuppressOffers/32:SlaveAndFrameworkCount/HierarchicalAllocator_BENCHMARK_Test.SuppressOffers/33:SlaveAndFrameworkCount/HierarchicalAllocator_BENCHMARK_Test.SuppressOffers/34:SlaveAndFrameworkCount/HierarchicalAllocator_BENCHMARK_Test.SuppressOffers/35:SlaveAndFrameworkCount/HierarchicalAllocator_BENCHMARK_Test.SuppressOffers/36:SlaveAndFrameworkCount/HierarchicalAllocator_BENCHMARK_Test.SuppressOffers/37:SlaveAndFrameworkCount/HierarchicalAllocator_BENCHMARK_Test.SuppressOffers/38:SlaveAndFrameworkCount/HierarchicalAllocator_BENCHMARK_Test.SuppressOffers/39:SlaveAndFrameworkCount/HierarchicalAllocator_BENCHMARK_Test.SuppressOffers/40:SlaveAndFrameworkCount/HierarchicalAllocator_BENCHMARK_Test.SuppressOffers/41:SlaveAndFrameworkCount/HierarchicalAllocator_BENCHMARK_Test.SuppressOffers/42:SlaveAndFrameworkCount/HierarchicalAllocator_BENCHMARK_Test.SuppressOffers/43:SlaveAndFrameworkCount/HierarchicalAllocator_BENCHMARK_Test.SuppressOffers/44:SlaveAndFrameworkCount/HierarchicalAllocator_BENCHMARK_Test.SuppressOffers/45:SlaveAndFrameworkCount/HierarchicalAllocator_BENCHMARK_Test.SuppressOffers/46:SlaveAndFrameworkCount/HierarchicalAllocator_BENCHMARK_Test.SuppressOffers/47:SlaveAndFrameworkCount/HierarchicalAllocator_BENCHMARK_Test.ExtremeSuppressOffers/0:SlaveAndFrameworkCount/HierarchicalAllocator_BENCHMARK_Test.ExtremeSuppressOffers/1:SlaveAndFrameworkCount/HierarchicalAllocator_BENCHMARK_Test.ExtremeSuppressOffers/2:SlaveAndFrameworkCount/HierarchicalAllocator_BENCHMARK_Test.ExtremeSuppressOffers/3:SlaveAndFrameworkCount/HierarchicalAllocator_BENCHMARK_Test.ExtremeSuppressOffers/4:SlaveAndFrameworkCount/HierarchicalAllocator_BENCHMARK_Test.ExtremeSuppressOffers/5:SlaveAndFrameworkCount/HierarchicalAllocator_BENCHMARK_Test.ExtremeSuppressOffers/6:SlaveAndFrameworkCount/HierarchicalAllocator_BENCHMARK_Test.ExtremeSuppressOffers/7:SlaveAndFrameworkCount/HierarchicalAllocator_BENCHMARK_Test.ExtremeSuppressOffers/8:SlaveAndFrameworkCount/HierarchicalAllocator_BENCHMARK_Test.ExtremeSuppressOffers/9:SlaveAndFrameworkCount/HierarchicalAllocator_BENCHMARK_Test.ExtremeSuppressOffers/10:SlaveAndFrameworkCount/HierarchicalAllocator_BENCHMARK_Test.ExtremeSuppressOffers/11:SlaveAndFrameworkCount/HierarchicalAllocator_BENCHMARK_Test.ExtremeSuppressOffers/12:SlaveAndFrameworkCount/HierarchicalAllocator_BENCHMARK_Test.ExtremeSuppressOffers/13:SlaveAndFrameworkCount/HierarchicalAllocator_BENCHMARK_Test.ExtremeSuppressOffers/14:SlaveAndFrameworkCount/HierarchicalAllocator_BENCHMARK_Test.ExtremeSuppressOffers/15:SlaveAndFrameworkCount/HierarchicalAllocator_BENCHMARK_Test.ExtremeSuppressOffers/16:SlaveAndFrameworkCount/HierarchicalAllocator_BENCHMARK_Test.ExtremeSuppressOffers/17:SlaveAndFrameworkCount/HierarchicalAllocator_BENCHMARK_Test.ExtremeSuppressOffers/18:SlaveAndFrameworkCount/HierarchicalAllocator_BENCHMARK_Test.ExtremeSuppressOffers/19:SlaveAndFrameworkCount/HierarchicalAllocator_BENCHMARK_Test.ExtremeSuppressOffers/20:SlaveAndFrameworkCount/HierarchicalAllocator_BENCHMARK_Test.ExtremeSuppressOffers/21:SlaveAndFrameworkCount/HierarchicalAllocator_BENCHMARK_Test.ExtremeSuppressOffers/22:SlaveAndFrameworkCount/HierarchicalAllocator_BENCHMARK_Test.ExtremeSuppressOffers/23:SlaveAndFrameworkCount/HierarchicalAllocator_BENCHMARK_Test.ExtremeSuppressOffers/24:SlaveAndFrameworkCount/HierarchicalAllocator_BENCHMARK_Test.ExtremeSuppressOffers/25:SlaveAndFrameworkCount/HierarchicalAllocator_BENCHMARK_Test.ExtremeSuppressOffers/26:SlaveAndFrameworkCount/HierarchicalAllocator_BENCHMARK_Test.ExtremeSuppressOffers/27:SlaveAndFrameworkCount/HierarchicalAllocator_BENCHMARK_Test.ExtremeSuppressOffers/28:SlaveAndFrameworkCount/HierarchicalAllocator_BENCHMARK_Test.ExtremeSuppressOffers/29:SlaveAndFrameworkCount/HierarchicalAllocator_BENCHMARK_Test.ExtremeSuppressOffers/30:SlaveAndFrameworkCount/HierarchicalAllocator_BENCHMARK_Test.ExtremeSuppressOffers/31:SlaveAndFrameworkCount/HierarchicalAllocator_BENCHMARK_Test.ExtremeSuppressOffers/32:SlaveAndFrameworkCount/HierarchicalAllocator_BENCHMARK_Test.ExtremeSuppressOffers/33:SlaveAndFrameworkCount/HierarchicalAllocator_BENCHMARK_Test.ExtremeSuppressOffers/34:SlaveAndFrameworkCount/HierarchicalAllocator_BENCHMARK_Test.ExtremeSuppressOffers/35:SlaveAndFrameworkCount/HierarchicalAllocator_BENCHMARK_Test.ExtremeSuppressOffers/36:SlaveAndFrameworkCount/HierarchicalAllocator_BENCHMARK_Test.ExtremeSuppressOffers/37:SlaveAndFrameworkCount/HierarchicalAllocator_BENCHMARK_Test.ExtremeSuppressOffers/38:SlaveAndFrameworkCount/HierarchicalAllocator_BENCHMARK_Test.ExtremeSuppressOffers/39:SlaveAndFrameworkCount/HierarchicalAllocator_BENCHMARK_Test.ExtremeSuppressOffers/40:SlaveAndFrameworkCount/HierarchicalAllocator_BENCHMARK_Test.ExtremeSuppressOffers/41:SlaveAndFrameworkCount/HierarchicalAllocator_BENCHMARK_Test.ExtremeSuppressOffers/42:SlaveAndFrameworkCount/HierarchicalAllocator_BENCHMARK_Test.ExtremeSuppressOffers/43:SlaveAndFrameworkCount/HierarchicalAllocator_BENCHMARK_Test.ExtremeSuppressOffers/44:SlaveAndFrameworkCount/HierarchicalAllocator_BENCHMARK_Test.ExtremeSuppressOffers/45:SlaveAndFrameworkCount/HierarchicalAllocator_BENCHMARK_Test.ExtremeSuppressOffers/46:SlaveAndFrameworkCount/HierarchicalAllocator_BENCHMARK_Test.ExtremeSuppressOffers/47:SlaveAndFrameworkCount/HierarchicalAllocator_BENCHMARK_Test.Metrics/0:SlaveAndFrameworkCount/HierarchicalAllocator_BENCHMARK_Test.Metrics/1:SlaveAndFrameworkCount/HierarchicalAllocator_BENCHMARK_Test.Metrics/2:SlaveAndFrameworkCount/HierarchicalAllocator_BENCHMARK_Test.Metrics/3:SlaveAndFrameworkCount/HierarchicalAllocator_BENCHMARK_Test.Metrics/4:SlaveAndFrameworkCount/HierarchicalAllocator_BENCHMARK_Test.Metrics/5:SlaveAndFrameworkCount/HierarchicalAllocator_BENCHMARK_Test.Metrics/6:SlaveAndFrameworkCount/HierarchicalAllocator_BENCHMARK_Test.Metrics/7:SlaveAndFrameworkCount/HierarchicalAllocator_BENCHMARK_Test.Metrics/8:SlaveAndFrameworkCount/HierarchicalAllocator_BENCHMARK_Test.Metrics/9:SlaveAndFrameworkCount/HierarchicalAllocator_BENCHMARK_Test.Metrics/10:SlaveAndFrameworkCount/HierarchicalAllocator_BENCHMARK_Test.Metrics/11:SlaveAndFrameworkCount/HierarchicalAllocator_BENCHMARK_Test.Metrics/12:SlaveAndFrameworkCount/HierarchicalAllocator_BENCHMARK_Test.Metrics/13:SlaveAndFrameworkCount/HierarchicalAllocator_BENCHMARK_Test.Metrics/14:SlaveAndFrameworkCount/HierarchicalAllocator_BENCHMARK_Test.Metrics/15:SlaveAndFrameworkCount/HierarchicalAllocator_BENCHMARK_Test.Metrics/16:SlaveAndFrameworkCount/HierarchicalAllocator_BENCHMARK_Test.Metrics/17:SlaveAndFrameworkCount/HierarchicalAllocator_BENCHMARK_Test.Metrics/18:SlaveAndFrameworkCount/HierarchicalAllocator_BENCHMARK_Test.Metrics/19:SlaveAndFrameworkCount/HierarchicalAllocator_BENCHMARK_Test.Metrics/20:SlaveAndFrameworkCount/HierarchicalAllocator_BENCHMARK_Test.Metrics/21:SlaveAndFrameworkCount/HierarchicalAllocator_BENCHMARK_Test.Metrics/22:SlaveAndFrameworkCount/HierarchicalAllocator_BENCHMARK_Test.Metrics/23:SlaveAndFrameworkCount/HierarchicalAllocator_BENCHMARK_Test.Metrics/24:SlaveAndFrameworkCount/HierarchicalAllocator_BENCHMARK_Test.Metrics/25:SlaveAndFrameworkCount/HierarchicalAllocator_BENCHMARK_Test.Metrics/26:SlaveAndFrameworkCount/HierarchicalAllocator_BENCHMARK_Test.Metrics/27:SlaveAndFrameworkCount/HierarchicalAllocator_BENCHMARK_Test.Metrics/28:SlaveAndFrameworkCount/HierarchicalAllocator_BENCHMARK_Test.Metrics/29:SlaveAndFrameworkCount/HierarchicalAllocator_BENCHMARK_Test.Metrics/30:SlaveAndFrameworkCount/HierarchicalAllocator_BENCHMARK_Test.Metrics/31:SlaveAndFrameworkCount/HierarchicalAllocator_BENCHMARK_Test.Metrics/32:SlaveAndFrameworkCount/HierarchicalAllocator_BENCHMARK_Test.Metrics/33:SlaveAndFrameworkCount/HierarchicalAllocator_BENCHMARK_Test.Metrics/34:SlaveAndFrameworkCount/HierarchicalAllocator_BENCHMARK_Test.Metrics/35:SlaveAndFrameworkCount/HierarchicalAllocator_BENCHMARK_Test.Metrics/36:SlaveAndFrameworkCount/HierarchicalAllocator_BENCHMARK_Test.Metrics/37:SlaveAndFrameworkCount/HierarchicalAllocator_BENCHMARK_Test.Metrics/38:SlaveAndFrameworkCount/HierarchicalAllocator_BENCHMARK_Test.Metrics/39:SlaveAndFrameworkCount/HierarchicalAllocator_BENCHMARK_Test.Metrics/40:SlaveAndFrameworkCount/HierarchicalAllocator_BENCHMARK_Test.Metrics/41:SlaveAndFrameworkCount/HierarchicalAllocator_BENCHMARK_Test.Metrics/42:SlaveAndFrameworkCount/HierarchicalAllocator_BENCHMARK_Test.Metrics/43:SlaveAndFrameworkCount/HierarchicalAllocator_BENCHMARK_Test.Metrics/44:SlaveAndFrameworkCount/HierarchicalAllocator_BENCHMARK_Test.Metrics/45:SlaveAndFrameworkCount/HierarchicalAllocator_BENCHMARK_Test.Metrics/46:SlaveAndFrameworkCount/HierarchicalAllocator_BENCHMARK_Test.Metrics/47:SlaveAndFrameworkCount/HierarchicalAllocator_BENCHMARK_Test.AllocatorBacklog/0:SlaveAndFrameworkCount/HierarchicalAllocator_BENCHMARK_Test.AllocatorBacklog/1:SlaveAndFrameworkCount/HierarchicalAllocator_BENCHMARK_Test.AllocatorBacklog/2:SlaveAndFrameworkCount/HierarchicalAllocator_BENCHMARK_Test.AllocatorBacklog/3:SlaveAndFrameworkCount/HierarchicalAllocator_BENCHMARK_Test.AllocatorBacklog/4:SlaveAndFrameworkCount/HierarchicalAllocator_BENCHMARK_Test.AllocatorBacklog/5:SlaveAndFrameworkCount/HierarchicalAllocator_BENCHMARK_Test.AllocatorBacklog/6:SlaveAndFrameworkCount/HierarchicalAllocator_BENCHMARK_Test.AllocatorBacklog/7:SlaveAndFrameworkCount/HierarchicalAllocator_BENCHMARK_Test.AllocatorBacklog/8:SlaveAndFrameworkCount/HierarchicalAllocator_BENCHMARK_Test.AllocatorBacklog/9:SlaveAndFrameworkCount/HierarchicalAllocator_BENCHMARK_Test.AllocatorBacklog/10:SlaveAndFrameworkCount/HierarchicalAllocator_BENCHMARK_Test.AllocatorBacklog/11:SlaveAndFrameworkCount/HierarchicalAllocator_BENCHMARK_Test.AllocatorBacklog/12:SlaveAndFrameworkCount/HierarchicalAllocator_BENCHMARK_Test.AllocatorBacklog/13:SlaveAndFrameworkCount/HierarchicalAllocator_BENCHMARK_Test.AllocatorBacklog/14:SlaveAndFrameworkCount/HierarchicalAllocator_BENCHMARK_Test.AllocatorBacklog/15:SlaveAndFrameworkCount/HierarchicalAllocator_BENCHMARK_Test.AllocatorBacklog/16:SlaveAndFrameworkCount/HierarchicalAllocator_BENCHMARK_Test.AllocatorBacklog/17:SlaveAndFrameworkCount/HierarchicalAllocator_BENCHMARK_Test.AllocatorBacklog/18:SlaveAndFrameworkCount/HierarchicalAllocator_BENCHMARK_Test.AllocatorBacklog/19:SlaveAndFrameworkCount/HierarchicalAllocator_BENCHMARK_Test.AllocatorBacklog/20:SlaveAndFrameworkCount/HierarchicalAllocator_BENCHMARK_Test.AllocatorBacklog/21:SlaveAndFrameworkCount/HierarchicalAllocator_BENCHMARK_Test.AllocatorBacklog/22:SlaveAndFrameworkCount/HierarchicalAllocator_BENCHMARK_Test.AllocatorBacklog/23:SlaveAndFrameworkCount/HierarchicalAllocator_BENCHMARK_Test.AllocatorBacklog/24:SlaveAndFrameworkCount/HierarchicalAllocator_BENCHMARK_Test.AllocatorBacklog/25:SlaveAndFrameworkCount/HierarchicalAllocator_BENCHMARK_Test.AllocatorBacklog/26:SlaveAndFrameworkCount/HierarchicalAllocator_BENCHMARK_Test.AllocatorBacklog/27:SlaveAndFrameworkCount/HierarchicalAllocator_BENCHMARK_Test.AllocatorBacklog/28:SlaveAndFrameworkCount/HierarchicalAllocator_BENCHMARK_Test.AllocatorBacklog/29:SlaveAndFrameworkCount/HierarchicalAllocator_BENCHMARK_Test.AllocatorBacklog/30:SlaveAndFrameworkCount/HierarchicalAllocator_BENCHMARK_Test.AllocatorBacklog/31:SlaveAndFrameworkCount/HierarchicalAllocator_BENCHMARK_Test.AllocatorBacklog/32:SlaveAndFrameworkCount/HierarchicalAllocator_BENCHMARK_Test.AllocatorBacklog/33:SlaveAndFrameworkCount/HierarchicalAllocator_BENCHMARK_Test.AllocatorBacklog/34:SlaveAndFrameworkCount/HierarchicalAllocator_BENCHMARK_Test.AllocatorBacklog/35:SlaveAndFrameworkCount/HierarchicalAllocator_BENCHMARK_Test.AllocatorBacklog/36:SlaveAndFrameworkCount/HierarchicalAllocator_BENCHMARK_Test.AllocatorBacklog/37:SlaveAndFrameworkCount/HierarchicalAllocator_BENCHMARK_Test.AllocatorBacklog/38:SlaveAndFrameworkCount/HierarchicalAllocator_BENCHMARK_Test.AllocatorBacklog/39:SlaveAndFrameworkCount/HierarchicalAllocator_BENCHMARK_Test.AllocatorBacklog/40:SlaveAndFrameworkCount/HierarchicalAllocator_BENCHMARK_Test.AllocatorBacklog/41:SlaveAndFrameworkCount/HierarchicalAllocator_BENCHMARK_Test.AllocatorBacklog/42:SlaveAndFrameworkCount/HierarchicalAllocator_BENCHMARK_Test.AllocatorBacklog/43:SlaveAndFrameworkCount/HierarchicalAllocator_BENCHMARK_Test.AllocatorBacklog/44:SlaveAndFrameworkCount/HierarchicalAllocator_BENCHMARK_Test.AllocatorBacklog/45:SlaveAndFrameworkCount/HierarchicalAllocator_BENCHMARK_Test.AllocatorBacklog/46:SlaveAndFrameworkCount/HierarchicalAllocator_BENCHMARK_Test.AllocatorBacklog/47:ResourcesScalarArithmeticOperators/Resources_Scalar_Arithmetic_BENCHMARK_Test.Arithmetic/0:ResourcesScalarArithmeticOperators/Resources_Scalar_Arithmetic_BENCHMARK_Test.Arithmetic/1:ResourcesScalarArithmeticOperators/Resources_Scalar_Arithmetic_BENCHMARK_Test.Arithmetic/2:ResourcesScalarArithmeticOperators/Resources_Scalar_Arithmetic_BENCHMARK_Test.Arithmetic/3:ResourcesContains/Resources_Contains_BENCHMARK_Test.Contains/0:ResourcesContains/Resources_Contains_BENCHMARK_Test.Contains/1:ResourcesContains/Resources_Contains_BENCHMARK_Test.Contains/2:ResourcesContains/Resources_Contains_BENCHMARK_Test.Contains/3:ResourcesContains/Resources_Contains_BENCHMARK_Test.Contains/4:ResourcesContains/Resources_Contains_BENCHMARK_Test.Contains/5:ResourcesContains/Resources_Contains_BENCHMARK_Test.Contains/6:ResourcesContains/Resources_Contains_BENCHMARK_Test.Contains/7:ResourcesContains/Resources_Contains_BENCHMARK_Test.Contains/8:Resources_Parse/Resources_Parse_BENCHMARK_Test.Parse/0:Resources_Parse/Resources_Parse_BENCHMARK_Test.Parse/1:Resources_Parse/Resources_Parse_BENCHMARK_Test.Parse/2:Tasks/SchedulerReconcileTasks_BENCHMARK_Test.SchedulerLibrary/0:Tasks/SchedulerReconcileTasks_BENCHMARK_Test.SchedulerLibrary/1:Tasks/SchedulerReconcileTasks_BENCHMARK_Test.SchedulerLibrary/2:Tasks/SchedulerReconcileTasks_BENCHMARK_Test.SchedulerLibrary/3:Tasks/SchedulerReconcileTasks_BENCHMARK_Test.SchedulerDriver/0:Tasks/SchedulerReconcileTasks_BENCHMARK_Test.SchedulerDriver/1:Tasks/SchedulerReconcileTasks_BENCHMARK_Test.SchedulerDriver/2:Tasks/SchedulerReconcileTasks_BENCHMARK_Test.SchedulerDriver/3:AgentAndClientCount/Sorter_BENCHMARK_Test.FullSort/0:AgentAndClientCount/Sorter_BENCHMARK_Test.FullSort/1:AgentAndClientCount/Sorter_BENCHMARK_Test.FullSort/2:AgentAndClientCount/Sorter_BENCHMARK_Test.FullSort/3:AgentAndClientCount/Sorter_BENCHMARK_Test.FullSort/4:AgentAndClientCount/Sorter_BENCHMARK_Test.FullSort/5:AgentAndClientCount/Sorter_BENCHMARK_Test.FullSort/6:AgentAndClientCount/Sorter_BENCHMARK_Test.FullSort/7:AgentAndClientCount/Sorter_BENCHMARK_Test.FullSort/8:AgentAndClientCount/Sorter_BENCHMARK_Test.FullSort/9:AgentAndClientCount/Sorter_BENCHMARK_Test.FullSort/10:AgentAndClientCount/Sorter_BENCHMARK_Test.FullSort/11:AgentAndClientCount/Sorter_BENCHMARK_Test.FullSort/12:AgentAndClientCount/Sorter_BENCHMARK_Test.FullSort/13:AgentAndClientCount/Sorter_BENCHMARK_Test.FullSort/14:AgentAndClientCount/Sorter_BENCHMARK_Test.FullSort/15:AgentAndClientCount/Sorter_BENCHMARK_Test.FullSort/16:AgentAndClientCount/Sorter_BENCHMARK_Test.FullSort/17:AgentAndClientCount/Sorter_BENCHMARK_Test.FullSort/18:AgentAndClientCount/Sorter_BENCHMARK_Test.FullSort/19:AgentAndClientCount/Sorter_BENCHMARK_Test.FullSort/20:AgentAndClientCount/Sorter_BENCHMARK_Test.FullSort/21:AgentAndClientCount/Sorter_BENCHMARK_Test.FullSort/22:AgentAndClientCount/Sorter_BENCHMARK_Test.FullSort/23:AgentAndClientCount/Sorter_BENCHMARK_Test.FullSort/24:AgentAndClientCount/Sorter_BENCHMARK_Test.FullSort/25:AgentAndClientCount/Sorter_BENCHMARK_Test.FullSort/26:AgentAndClientCount/Sorter_BENCHMARK_Test.FullSort/27:AgentAndClientCount/Sorter_BENCHMARK_Test.FullSort/28:AgentAndClientCount/Sorter_BENCHMARK_Test.FullSort/29:AgentAndClientCount/Sorter_BENCHMARK_Test.FullSort/30:AgentAndClientCount/Sorter_BENCHMARK_Test.FullSort/31:AgentAndClientCount/Sorter_BENCHMARK_Test.FullSort/32:AgentAndClientCount/Sorter_BENCHMARK_Test.FullSort/33:AgentAndClientCount/Sorter_BENCHMARK_Test.FullSort/34:AgentAndClientCount/Sorter_BENCHMARK_Test.FullSort/35:AgentAndClientCount/HierarchicalSorter_BENCHMARK_Test.FullSort/0:AgentAndClientCount/HierarchicalSorter_BENCHMARK_Test.FullSort/1:AgentAndClientCount/HierarchicalSorter_BENCHMARK_Test.FullSort/2:AgentAndClientCount/HierarchicalSorter_BENCHMARK_Test.FullSort/3:AgentAndClientCount/HierarchicalSorter_BENCHMARK_Test.FullSort/4:AgentAndClientCount/HierarchicalSorter_BENCHMARK_Test.FullSort/5:AgentAndClientCount/HierarchicalSorter_BENCHMARK_Test.FullSort/6:AgentAndClientCount/HierarchicalSorter_BENCHMARK_Test.FullSort/7:AgentAndClientCount/HierarchicalSorter_BENCHMARK_Test.FullSort/8:AgentAndClientCount/HierarchicalSorter_BENCHMARK_Test.FullSort/9:AgentAndClientCount/HierarchicalSorter_BENCHMARK_Test.FullSort/10:AgentAndClientCount/HierarchicalSorter_BENCHMARK_Test.FullSort/11:AgentAndClientCount/HierarchicalSorter_BENCHMARK_Test.FullSort/12:AgentAndClientCount/HierarchicalSorter_BENCHMARK_Test.FullSort/13:AgentAndClientCount/HierarchicalSorter_BENCHMARK_Test.FullSort/14:AgentAndClientCount/HierarchicalSorter_BENCHMARK_Test.FullSort/15:AgentAndClientCount/HierarchicalSorter_BENCHMARK_Test.FullSort/16:AgentAndClientCount/HierarchicalSorter_BENCHMARK_Test.FullSort/17:bool/UserContainerLoggerTest.ROOT_LOGROTATE_RotateWithSwitchUserTrueOrFalse/0:bool/UserContainerLoggerTest.ROOT_LOGROTATE_RotateWithSwitchUserTrueOrFalse/1:AgentFrameworkTaskCount/MasterFailover_BENCHMARK_Test.AgentReregistrationDelay/0:AgentFrameworkTaskCount/MasterFailover_BENCHMARK_Test.AgentReregistrationDelay/1:AgentFrameworkTaskCount/MasterFailover_BENCHMARK_Test.AgentReregistrationDelay/2:ROOT_MountDiskResource/PersistentVolumeTest.CreateAndDestroyPersistentVolumes/0:ROOT_MountDiskResource/PersistentVolumeTest.ResourcesCheckpointing/0:ROOT_MountDiskResource/PersistentVolumeTest.PreparePersistentVolume/0:ROOT_MountDiskResource/PersistentVolumeTest.MasterFailover/0:ROOT_MountDiskResource/PersistentVolumeTest.IncompatibleCheckpointedResources/0:ROOT_MountDiskResource/PersistentVolumeTest.AccessPersistentVolume/0:ROOT_MountDiskResource/PersistentVolumeTest.SharedPersistentVolumeMultipleTasks/0:ROOT_MountDiskResource/PersistentVolumeTest.SharedPersistentVolumeRescindOnDestroy/0:ROOT_MountDiskResource/PersistentVolumeTest.SharedPersistentVolumeMultipleFrameworks/0:ROOT_MountDiskResource/PersistentVolumeTest.SharedPersistentVolumeMasterFailover/0:ROOT_MountDiskResource/PersistentVolumeTest.DestroyPersistentVolumeMultipleTasks/0:ROOT_MountDiskResource/PersistentVolumeTest.SharedPersistentVolumeMultipleIterations/0:ROOT_MountDiskResource/PersistentVolumeTest.SlaveRecovery/0:ROOT_MountDiskResource/PersistentVolumeTest.GoodACLCreateThenDestroy/0:ROOT_MountDiskResource/PersistentVolumeTest.GoodACLNoPrincipal/0:ROOT_MountDiskResource/PersistentVolumeTest.BadACLNoPrincipal/0:ROOT_MountDiskResource/PersistentVolumeTest.BadACLDropCreateAndDestroy/0:SlaveCount/Registrar_BENCHMARK_Test.Performance/0:SlaveCount/Registrar_BENCHMARK_Test.Performance/1:SlaveCount/Registrar_BENCHMARK_Test.Performance/2:SlaveCount/Registrar_BENCHMARK_Test.Performance/3:SlaveCount/Registrar_BENCHMARK_Test.MarkUnreachableThenReachable/0:SlaveCount/Registrar_BENCHMARK_Test.MarkUnreachableThenReachable/1:SlaveCount/Registrar_BENCHMARK_Test.MarkUnreachableThenReachable/2:SlaveCount/Registrar_BENCHMARK_Test.MarkUnreachableThenReachable/3:SlaveCount/Registrar_BENCHMARK_Test.GcManyAgents/0:SlaveCount/Registrar_BENCHMARK_Test.GcManyAgents/1:SlaveCount/Registrar_BENCHMARK_Test.GcManyAgents/2:SlaveCount/Registrar_BENCHMARK_Test.GcManyAgents/3:IsolationFlag/CpuIsolatorTest.ROOT_UserCpuUsage/0:IsolationFlag/CpuIsolatorTest.ROOT_UserCpuUsage/1:IsolationFlag/CpuIsolatorTest.ROOT_SystemCpuUsage/0:IsolationFlag/CpuIsolatorTest.ROOT_SystemCpuUsage/1:IsolationFlag/MemoryIsolatorTest.ROOT_MemUsage/0:IsolationFlag/MemoryIsolatorTest.ROOT_MemUsage/1:ImageAlpine/ProvisionerDockerTest.ROOT_INTERNET_CURL_SimpleCommand/0:ImageAlpine/ProvisionerDockerTest.ROOT_INTERNET_CURL_SimpleCommand/1:ImageAlpine/ProvisionerDockerTest.ROOT_INTERNET_CURL_SimpleCommand/2:ImageAlpine/ProvisionerDockerTest.ROOT_INTERNET_CURL_SimpleCommand/3:BackendFlag/ProvisionerDockerBackendTest.ROOT_INTERNET_CURL_Whiteout/0:BackendFlag/ProvisionerDockerBackendTest.ROOT_INTERNET_CURL_Whiteout/1:BackendFlag/ProvisionerDockerBackendTest.ROOT_INTERNET_CURL_Overwrite/0:BackendFlag/ProvisionerDockerBackendTest.ROOT_INTERNET_CURL_Overwrite/1:NetworkParam/DefaultExecutorCniTest.ROOT_VerifyContainerIP/0:NetworkParam/DefaultExecutorCniTest.ROOT_VerifyContainerIP/1:DefaultContainerDNSInfo/DefaultContainerDNSCniTest.ROOT_VerifyDefaultDNS/0:DefaultContainerDNSInfo/DefaultContainerDNSCniTest.ROOT_VerifyDefaultDNS/1:DefaultContainerDNSInfo/DefaultContainerDNSCniTest.ROOT_VerifyDefaultDNS/2:TestParam/LinuxCapabilitiesIsolatorTest.ROOT_Ping/0:TestParam/LinuxCapabilitiesIsolatorTest.ROOT_Ping/1:TestParam/LinuxCapabilitiesIsolatorTest.ROOT_Ping/2:TestParam/LinuxCapabilitiesIsolatorTest.ROOT_Ping/3:TestParam/LinuxCapabilitiesIsolatorTest.ROOT_Ping/4:TestParam/LinuxCapabilitiesIsolatorTest.ROOT_Ping/5:TestParam/LinuxCapabilitiesIsolatorTest.ROOT_Ping/6:TestParam/LinuxCapabilitiesIsolatorTest.ROOT_Ping/7:TestParam/LinuxCapabilitiesIsolatorTest.ROOT_Ping/8:TestParam/LinuxCapabilitiesIsolatorTest.ROOT_Ping/9:TestParam/LinuxCapabilitiesIsolatorTest.ROOT_Ping/10:TestParam/LinuxCapabilitiesIsolatorTest.ROOT_Ping/11:TestParam/LinuxCapabilitiesIsolatorTest.ROOT_Ping/12:TestParam/LinuxCapabilitiesIsolatorTest.ROOT_Ping/13:TestParam/LinuxCapabilitiesIsolatorTest.ROOT_Ping/14:TestParam/LinuxCapabilitiesIsolatorTest.ROOT_Ping/15:TestParam/LinuxCapabilitiesIsolatorTest.ROOT_Ping/16:TestParam/LinuxCapabilitiesIsolatorTest.ROOT_Ping/17:TestParam/LinuxCapabilitiesIsolatorTest.ROOT_Ping/18:TestParam/LinuxCapabilitiesIsolatorTest.ROOT_Ping/19:TestParam/LinuxCapabilitiesIsolatorTest.ROOT_Ping/20:TestParam/LinuxCapabilitiesIsolatorTest.ROOT_Ping/21:TestParam/LinuxCapabilitiesIsolatorTest.ROOT_Ping/22:TestParam/LinuxCapabilitiesIsolatorTest.ROOT_Ping/23:TestParam/LinuxCapabilitiesIsolatorTest.ROOT_Ping/24:TestParam/LinuxCapabilitiesIsolatorTest.ROOT_Ping/25:TestParam/LinuxCapabilitiesIsolatorTest.ROOT_Ping/26:TestParam/LinuxCapabilitiesIsolatorTest.ROOT_Ping/27:TestParam/LinuxCapabilitiesIsolatorTest.ROOT_Ping/28:TestParam/LinuxCapabilitiesIsolatorTest.ROOT_Ping/29:TestParam/LinuxCapabilitiesIsolatorTest.ROOT_Ping/30:TestParam/LinuxCapabilitiesIsolatorTest.ROOT_Ping/31:TestParam/LinuxCapabilitiesIsolatorTest.ROOT_NestedPing/0:TestParam/LinuxCapabilitiesIsolatorTest.ROOT_NestedPing/1:TestParam/LinuxCapabilitiesIsolatorTest.ROOT_NestedPing/2:TestParam/LinuxCapabilitiesIsolatorTest.ROOT_NestedPing/3:TestParam/LinuxCapabilitiesIsolatorTest.ROOT_NestedPing/4:TestParam/LinuxCapabilitiesIsolatorTest.ROOT_NestedPing/5:TestParam/LinuxCapabilitiesIsolatorTest.ROOT_NestedPing/6:TestParam/LinuxCapabilitiesIsolatorTest.ROOT_NestedPing/7:TestParam/LinuxCapabilitiesIsolatorTest.ROOT_NestedPing/8:TestParam/LinuxCapabilitiesIsolatorTest.ROOT_NestedPing/9:TestParam/LinuxCapabilitiesIsolatorTest.ROOT_NestedPing/10:TestParam/LinuxCapabilitiesIsolatorTest.ROOT_NestedPing/11:TestParam/LinuxCapabilitiesIsolatorTest.ROOT_NestedPing/12:TestParam/LinuxCapabilitiesIsolatorTest.ROOT_NestedPing/13:TestParam/LinuxCapabilitiesIsolatorTest.ROOT_NestedPing/14:TestParam/LinuxCapabilitiesIsolatorTest.ROOT_NestedPing/15:TestParam/LinuxCapabilitiesIsolatorTest.ROOT_NestedPing/16:TestParam/LinuxCapabilitiesIsolatorTest.ROOT_NestedPing/17:TestParam/LinuxCapabilitiesIsolatorTest.ROOT_NestedPing/18:TestParam/LinuxCapabilitiesIsolatorTest.ROOT_NestedPing/19:TestParam/LinuxCapabilitiesIsolatorTest.ROOT_NestedPing/20:TestParam/LinuxCapabilitiesIsolatorTest.ROOT_NestedPing/21:TestParam/LinuxCapabilitiesIsolatorTest.ROOT_NestedPing/22:TestParam/LinuxCapabilitiesIsolatorTest.ROOT_NestedPing/23:TestParam/LinuxCapabilitiesIsolatorTest.ROOT_NestedPing/24:TestParam/LinuxCapabilitiesIsolatorTest.ROOT_NestedPing/25:TestParam/LinuxCapabilitiesIsolatorTest.ROOT_NestedPing/26:TestParam/LinuxCapabilitiesIsolatorTest.ROOT_NestedPing/27:TestParam/LinuxCapabilitiesIsolatorTest.ROOT_NestedPing/28:TestParam/LinuxCapabilitiesIsolatorTest.ROOT_NestedPing/29:TestParam/LinuxCapabilitiesIsolatorTest.ROOT_NestedPing/30:TestParam/LinuxCapabilitiesIsolatorTest.ROOT_NestedPing/31:ExecutorType/VolumeHostPathIsolatorMesosTest.ROOT_ChangeRootFilesystem/CommandExecutor:ExecutorType/VolumeHostPathIsolatorMesosTest.ROOT_ChangeRootFilesystem/DefaultExecutor:Nesting/VolumeImageIsolatorTest.ROOT_ImageInVolumeWithoutRootFilesystem/0:Nesting/VolumeImageIsolatorTest.ROOT_ImageInVolumeWithoutRootFilesystem/1:Nesting/VolumeImageIsolatorTest.ROOT_ImageInVolumeWithRootFilesystem/0:Nesting/VolumeImageIsolatorTest.ROOT_ImageInVolumeWithRootFilesystem/1:SecretTestTypeWithoutRootFSRelativePath/VolumeSecretIsolatorTest.ROOT_SecretInVolumeWithRootFilesystem/0:SecretTestTypeWithoutRootFSRelativePath/VolumeSecretIsolatorTest.ROOT_SecretInVolumeWithRootFilesystem/1:SecretTestTypeWithoutRootFSRelativePath/VolumeSecretIsolatorTest.ROOT_SecretInVolumeWithRootFilesystem/2:SecretTestTypeWithoutRootFSRelativePath/VolumeSecretIsolatorTest.ROOT_SecretInVolumeWithRootFilesystem/3:SecretTestTypeWithoutRootFSNonExisitingAbsolutePath/VolumeSecretIsolatorTest.ROOT_SecretInVolumeWithRootFilesystem/0:SecretTestTypeWithoutRootFSNonExisitingAbsolutePath/VolumeSecretIsolatorTest.Rwrite /dev/stdout: resource temporarily unavailable
+ docker rmi mesos-1510618549-32368
Error response from daemon: conflict: unable to remove repository reference "mesos-1510618549-32368" (must force) - container dfacf8ac8f38 is using its referenced image 5a7bf2fa5ccc
Build step 'Execute shell' marked build as failure
Jenkins build is back to normal : Mesos-Buildbot » cmake,gcc,--verbose --disable-libtool-wrappers --enable-libevent --enable-ssl,GLOG_v=1 MESOS_VERBOSE=1,ubuntu:14.04,(ubuntu)&&(!ubuntu-us1)&&(!ubuntu-eu2)&&(!qnode3)&&(!H23) #4455
Posted by Apache Jenkins Server <je...@builds.apache.org>.
See <https://builds.apache.org/job/Mesos-Buildbot/BUILDTOOL=cmake,COMPILER=gcc,CONFIGURATION=--verbose%20--disable-libtool-wrappers%20--enable-libevent%20--enable-ssl,ENVIRONMENT=GLOG_v=1%20MESOS_VERBOSE=1,OS=ubuntu%3A14.04,label_exp=(ubuntu)&&(!ubuntu-us1)&&(!ubuntu-eu2)&&(!qnode3)&&(!H23)/4455/display/redirect?page=changes>
Re: Build failed in Jenkins: Mesos-Buildbot » cmake,gcc,--verbose --disable-libtool-wrappers --enable-libevent --enable-ssl,GLOG_v=1 MESOS_VERBOSE=1,ubuntu:14.04,(ubuntu)&&(!ubuntu-us1)&&(!ubuntu-eu2)&&(!qnode3)&&(!H23) #4452
Posted by Alex R <al...@apache.org>.
I’ve reverted 776bfab969c4df6d1ecea67f8a5aedf1ec3bed83.
On 14 November 2017 at 03:53, Apache Jenkins Server <
jenkins@builds.apache.org> wrote:
> See <https://builds.apache.org/job/Mesos-Buildbot/BUILDTOOL=
> cmake,COMPILER=gcc,CONFIGURATION=--verbose%20--
> disable-libtool-wrappers%20--enable-libevent%20--enable-
> ssl,ENVIRONMENT=GLOG_v=1%20MESOS_VERBOSE=1,OS=ubuntu%
> 3A14.04,label_exp=(ubuntu)&&(!ubuntu-us1)&&(!ubuntu-eu2)&&(!
> qnode3)&&(!H23)/4452/display/redirect>
>
> ------------------------------------------
> [...truncated 27.82 MB...]
> 3: I1114 02:53:06.946594 19961 status_update_manager.cpp:177] Pausing
> sending status updates
> 3: I1114 02:53:06.948072 19964 state.cpp:64] Recovering state from
> '/tmp/ContentType_ResourceProviderManagerHttpApi
> Test_AgentEndpoint_1_f4uH3U/meta'
> 3: I1114 02:53:06.948371 19956 status_update_manager.cpp:203] Recovering
> status update manager
> 3: I1114 02:53:06.948536 19949 containerizer.cpp:662] Recovering
> containerizer
> 3: I1114 02:53:06.950001 19955 provisioner.cpp:416] Provisioner recovery
> complete
> 3: I1114 02:53:06.950423 19953 slave.cpp:6432] Finished recovery
> 3: I1114 02:53:06.951320 19956 status_update_manager.cpp:177] Pausing
> sending status updates
> 3: I1114 02:53:06.951333 19954 slave.cpp:1007] New master detected at
> master@172.17.0.2:33432
> 3: I1114 02:53:06.951396 19954 slave.cpp:1042] Detecting new master
> 3: I1114 02:53:06.955152 19962 process.cpp:3925] Handling HTTP event for
> process 'slave(750)' with path: '/slave(750)/api/v1/resource_provider'
> 3: I1114 02:53:06.957485 19961 http.cpp:1185] HTTP POST for
> /slave(750)/api/v1/resource_provider from 172.17.0.2:58848
> 3: I1114 02:53:06.958020 19947 manager.cpp:381] Subscribing resource
> provider {"name":"test","type":"org.apache.mesos.rp.test"}
> 3: I1114 02:53:06.964301 19945 slave.cpp:883] Agent terminating
> 3: I1114 02:53:06.970345 19945 master.cpp:1151] Master terminating
> 3: [ OK ] ContentType/ResourceProviderManagerHttpApiTest.AgentEndpoint/1
> (53 ms)
> 3: [ RUN ] ContentType/ResourceProviderManagerHttpApi
> Test.ConvertResources/0
> 3: I1114 02:53:06.977787 19945 cluster.cpp:162] Creating default 'local'
> authorizer
> 3: I1114 02:53:06.980988 19969 master.cpp:448] Master
> 56cf5864-f4d1-40e5-90da-a37eaf7646c6 (78aba094e6f9) started on
> 172.17.0.2:33432
> 3: I1114 02:53:06.981014 19969 master.cpp:450] Flags at startup: --acls=""
> --agent_ping_timeout="15secs" --agent_reregister_timeout="10mins"
> --allocation_interval="1secs" --allocator="HierarchicalDRF"
> --authenticate_agents="true" --authenticate_frameworks="true"
> --authenticate_http_frameworks="true" --authenticate_http_readonly="true"
> --authenticate_http_readwrite="true" --authenticators="crammd5"
> --authorizers="local" --credentials="/tmp/EoWqJ5/credentials"
> --filter_gpu_resources="true" --framework_sorter="drf" --help="false"
> --hostname_lookup="true" --http_authenticators="basic" --http_framework_authenticators="basic"
> --initialize_driver_logging="true" --log_auto_initialize="true"
> --logbufsecs="0" --logging_level="INFO" --max_agent_ping_timeouts="5"
> --max_completed_frameworks="50" --max_completed_tasks_per_framework="1000"
> --max_unreachable_tasks_per_framework="1000" --port="5050"
> --quiet="false" --recovery_agent_removal_limit="100%"
> --registry="in_memory" --registry_fetch_timeout="1mins"
> --registry_gc_interval="15mins" --registry_max_agent_age="2weeks"
> --registry_max_agent_count="102400" --registry_store_timeout="100secs"
> --registry_strict="false" --root_submissions="true" --user_sorter="drf"
> --version="false" --webui_dir="/usr/local/share/mesos/webui"
> --work_dir="/tmp/EoWqJ5/master" --zk_session_timeout="10secs"
> 3: I1114 02:53:06.981478 19969 master.cpp:499] Master only allowing
> authenticated frameworks to register
> 3: I1114 02:53:06.981488 19969 master.cpp:505] Master only allowing
> authenticated agents to register
> 3: I1114 02:53:06.981494 19969 master.cpp:511] Master only allowing
> authenticated HTTP frameworks to register
> 3: I1114 02:53:06.981501 19969 credentials.hpp:37] Loading credentials for
> authentication from '/tmp/EoWqJ5/credentials'
> 3: I1114 02:53:06.981861 19969 master.cpp:555] Using default 'crammd5'
> authenticator
> 3: I1114 02:53:06.982045 19969 http.cpp:1045] Creating default 'basic'
> HTTP authenticator for realm 'mesos-master-readonly'
> 3: I1114 02:53:06.982215 19969 http.cpp:1045] Creating default 'basic'
> HTTP authenticator for realm 'mesos-master-readwrite'
> 3: I1114 02:53:06.982373 19969 http.cpp:1045] Creating default 'basic'
> HTTP authenticator for realm 'mesos-master-scheduler'
> 3: I1114 02:53:06.982528 19969 master.cpp:634] Authorization enabled
> 3: I1114 02:53:06.982709 19950 hierarchical.cpp:171] Initialized
> hierarchical allocator process
> 3: I1114 02:53:06.982746 19960 whitelist_watcher.cpp:77] No whitelist given
> 3: I1114 02:53:06.986054 19963 master.cpp:2213] Elected as the leading
> master!
> 3: I1114 02:53:06.986091 19963 master.cpp:1693] Recovering from registrar
> 3: I1114 02:53:06.986253 19955 registrar.cpp:347] Recovering registrar
> 3: I1114 02:53:06.986997 19955 registrar.cpp:391] Successfully fetched the
> registry (0B) in 683776ns
> 3: I1114 02:53:06.987125 19955 registrar.cpp:495] Applied 1 operations in
> 32640ns; attempting to update the registry
> 3: I1114 02:53:06.987735 19955 registrar.cpp:552] Successfully updated the
> registry in 552192ns
> 3: I1114 02:53:06.987848 19955 registrar.cpp:424] Successfully recovered
> registrar
> 3: I1114 02:53:06.988415 19946 master.cpp:1806] Recovered 0 agents from
> the registry (129B); allowing 10mins for agents to re-register
> 3: I1114 02:53:06.988430 19965 hierarchical.cpp:209] Skipping recovery of
> hierarchical allocator: nothing to recover
> 3: W1114 02:53:06.993947 19945 process.cpp:3178] Attempted to spawn
> already running process files@172.17.0.2:33432
> 3: I1114 02:53:06.994899 19945 containerizer.cpp:301] Using isolation {
> environment_secret, posix/cpu, posix/mem, filesystem/posix, network/cni }
> 3: W1114 02:53:06.995415 19945 backend.cpp:76] Failed to create 'aufs'
> backend: AufsBackend requires root privileges
> 3: W1114 02:53:06.995530 19945 backend.cpp:76] Failed to create 'bind'
> backend: BindBackend requires root privileges
> 3: I1114 02:53:06.995563 19945 provisioner.cpp:255] Using default backend
> 'copy'
> 3: I1114 02:53:06.997514 19945 cluster.cpp:448] Creating default 'local'
> authorizer
> 3: I1114 02:53:06.999739 19946 slave.cpp:262] Mesos agent started on (751)@
> 172.17.0.2:33432
> 3: I1114 02:53:06.999754 19946 slave.cpp:263] Flags at startup: --acls=""
> --agent_features="capabilities {
> 3: type: MULTI_ROLE
> 3: }
> 3: capabilities {
> 3: type: HIERARCHICAL_ROLE
> 3: }
> 3: capabilities {
> 3: type: RESERVATION_REFINEMENT
> 3: }
> 3: capabilities {
> 3: type: RESOURCE_PROVIDER
> 3: }
> 3: " --appc_simple_discovery_uri_prefix="http://" --appc_store_dir="/tmp/
> ContentType_ResourceProviderManagerHttpApiTest_ConvertResources_0_Six4Gx/store/appc"
> --authenticate_http_executors="true" --authenticate_http_readonly="true"
> --authenticate_http_readwrite="false" --authenticatee="crammd5"
> --authentication_backoff_factor="1secs" --authorizer="local"
> --cgroups_cpu_enable_pids_and_tids_count="false"
> --cgroups_enable_cfs="false" --cgroups_hierarchy="/sys/fs/cgroup"
> --cgroups_limit_swap="false" --cgroups_root="mesos" --container_disk_watch_interval="15secs"
> --containerizers="mesos" --credential="/tmp/ContentType_
> ResourceProviderManagerHttpApiTest_ConvertResources_0_Six4Gx/credential"
> --default_role="*" --disallow_sharing_agent_pid_namespace="false"
> --disk_watch_interval="1mins" --docker="docker"
> --docker_kill_orphans="true" --docker_registry="https://
> registry-1.docker.io" --docker_remove_delay="6hrs"
> --docker_socket="/var/run/docker.sock" --docker_stop_timeout="0ns"
> --docker_store_dir="/tmp/ContentType_ResourceProviderManagerHttpApi
> Test_ConvertResources_0_Six4Gx/store/docker" --docker_volume_checkpoint_
> dir="/var/run/mesos/isolators/docker/volume" --enforce_container_disk_quota="false"
> --executor_registration_timeout="1mins" --executor_reregistration_timeout="2secs"
> --executor_secret_key="/tmp/ContentType_ResourceProviderManagerHttpApi
> Test_ConvertResources_0_Six4Gx/executor_secret_key"
> --executor_shutdown_grace_period="5secs" --fetcher_cache_dir="/tmp/
> ContentType_ResourceProviderManagerHttpApiTest_ConvertResources_0_Six4Gx/fetch"
> --fetcher_cache_size="2GB" --frameworks_home="" --gc_delay="1weeks"
> --gc_disk_headroom="0.1" --hadoop_home="" --help="false"
> --hostname_lookup="true" --http_command_executor="false"
> --http_credentials="/tmp/ContentType_ResourceProviderManagerHttpApi
> Test_ConvertResources_0_Six4Gx/http_credentials"
> --http_heartbeat_interval="30secs" --initialize_driver_logging="true"
> --isolation="posix/cpu,posix/mem" --launcher="posix"
> --launcher_dir="/mesos/build/src" --logbufsecs="0" --logging_level="INFO"
> --max_completed_executors_per_framework="150" --oversubscribed_resources_interval="15secs"
> --perf_duration="10secs" --perf_interval="1mins" --port="5051"
> --qos_correction_interval_min="0ns" --quiet="false" --recover="reconnect"
> --recovery_timeout="15mins" --registration_backoff_factor="10ms"
> --resources="cpus:2;gpus:0;mem:1024;disk:1024;ports:[31000-32000]"
> --revocable_cpu_low_priority="true" --runtime_dir="/tmp/ContentType_
> ResourceProviderManagerHttpApiTest_ConvertResources_0_Six4Gx"
> --sandbox_directory="/mnt/mesos/sandbox" --strict="true"
> --switch_user="true" --systemd_enable_support="true"
> --systemd_runtime_directory="/run/systemd/system" --version="false"
> --work_dir="/tmp/ContentType_ResourceProviderManagerHttpApi
> Test_ConvertResources_0_b5SeIO" --zk_session_timeout="10secs"
> 3: I1114 02:53:07.000257 19946 credentials.hpp:86] Loading credential for
> authentication from '/tmp/ContentType_ResourceProviderManagerHttpApi
> Test_ConvertResources_0_Six4Gx/credential'
> 3: I1114 02:53:07.000419 19946 slave.cpp:295] Agent using credential for:
> test-principal
> 3: I1114 02:53:07.000437 19946 credentials.hpp:37] Loading credentials for
> authentication from '/tmp/ContentType_ResourceProviderManagerHttpApi
> Test_ConvertResources_0_Six4Gx/http_credentials'
> 3: I1114 02:53:07.000725 19946 http.cpp:1045] Creating default 'basic'
> HTTP authenticator for realm 'mesos-agent-executor'
> 3: I1114 02:53:07.000855 19946 http.cpp:1066] Creating default 'jwt' HTTP
> authenticator for realm 'mesos-agent-executor'
> 3: I1114 02:53:07.001065 19946 http.cpp:1045] Creating default 'basic'
> HTTP authenticator for realm 'mesos-agent-readonly'
> 3: I1114 02:53:07.001165 19946 http.cpp:1066] Creating default 'jwt' HTTP
> authenticator for realm 'mesos-agent-readonly'
> 3: I1114 02:53:07.002676 19946 slave.cpp:593] Agent resources:
> [{"name":"cpus","scalar":{"value":2.0},"type":"SCALAR"},{
> "name":"mem","scalar":{"value":1024.0},"type":"SCALAR"},{"
> name":"disk","scalar":{"value":1024.0},"type":"SCALAR"},{"
> name":"ports","ranges":{"range":[{"begin":31000,"end":
> 32000}]},"type":"RANGES"}]
> 3: I1114 02:53:07.002900 19946 slave.cpp:601] Agent attributes: [ ]
> 3: I1114 02:53:07.002910 19946 slave.cpp:610] Agent hostname: 78aba094e6f9
> 3: I1114 02:53:07.003098 19953 status_update_manager.cpp:177] Pausing
> sending status updates
> 3: I1114 02:53:07.004681 19954 state.cpp:64] Recovering state from
> '/tmp/ContentType_ResourceProviderManagerHttpApiTest_ConvertResources_0_
> b5SeIO/meta'
> 3: I1114 02:53:07.004995 19954 status_update_manager.cpp:203] Recovering
> status update manager
> 3: I1114 02:53:07.005203 19954 containerizer.cpp:662] Recovering
> containerizer
> 3: I1114 02:53:07.006691 19962 provisioner.cpp:416] Provisioner recovery
> complete
> 3: I1114 02:53:07.007083 19951 slave.cpp:6432] Finished recovery
> 3: I1114 02:53:07.007786 19946 status_update_manager.cpp:177] Pausing
> sending status updates
> 3: I1114 02:53:07.007787 19955 slave.cpp:1007] New master detected at
> master@172.17.0.2:33432
> 3: I1114 02:53:07.007875 19955 slave.cpp:1042] Detecting new master
> 3: I1114 02:53:07.014212 19958 slave.cpp:1069] Authenticating with master
> master@172.17.0.2:33432
> 3: I1114 02:53:07.014333 19958 slave.cpp:1078] Using default CRAM-MD5
> authenticatee
> 3: I1114 02:53:07.014644 19959 authenticatee.cpp:121] Creating new client
> SASL connection
> 3: I1114 02:53:07.015040 19967 master.cpp:8285] Authenticating slave(751)@
> 172.17.0.2:33432
> 3: I1114 02:53:07.015202 19949 authenticator.cpp:414] Starting
> authentication session for crammd5-authenticatee(1383)@172.17.0.2:33432
> 3: I1114 02:53:07.015475 19966 authenticator.cpp:98] Creating new server
> SASL connection
> 3: I1114 02:53:07.015750 19969 authenticatee.cpp:213] Received SASL
> authentication mechanisms: CRAM-MD5
> 3: I1114 02:53:07.015779 19969 authenticatee.cpp:239] Attempting to
> authenticate with mechanism 'CRAM-MD5'
> 3: I1114 02:53:07.015897 19950 authenticator.cpp:204] Received SASL
> authentication start
> 3: I1114 02:53:07.015971 19950 authenticator.cpp:326] Authentication
> requires more steps
> 3: I1114 02:53:07.016119 19948 authenticatee.cpp:259] Received SASL
> authentication step
> 3: I1114 02:53:07.016261 19952 authenticator.cpp:232] Received SASL
> authentication step
> 3: I1114 02:53:07.016293 19952 auxprop.cpp:109] Request to lookup
> properties for user: 'test-principal' realm: '78aba094e6f9' server FQDN:
> '78aba094e6f9' SASL_AUXPROP_VERIFY_AGAINST_HASH: false
> SASL_AUXPROP_OVERRIDE: false SASL_AUXPROP_AUTHZID: false
> 3: I1114 02:53:07.016306 19952 auxprop.cpp:181] Looking up auxiliary
> property '*userPassword'
> 3: I1114 02:53:07.016355 19952 auxprop.cpp:181] Looking up auxiliary
> property '*cmusaslsecretCRAM-MD5'
> 3: I1114 02:53:07.016372 19952 auxprop.cpp:109] Request to lookup
> properties for user: 'test-principal' realm: '78aba094e6f9' server FQDN:
> '78aba094e6f9' SASL_AUXPROP_VERIFY_AGAINST_HASH: false
> SASL_AUXPROP_OVERRIDE: false SASL_AUXPROP_AUTHZID: true
> 3: I1114 02:53:07.016379 19952 auxprop.cpp:131] Skipping auxiliary
> property '*userPassword' since SASL_AUXPROP_AUTHZID == true
> 3: I1114 02:53:07.016384 19952 auxprop.cpp:131] Skipping auxiliary
> property '*cmusaslsecretCRAM-MD5' since SASL_AUXPROP_AUTHZID == true
> 3: I1114 02:53:07.016396 19952 authenticator.cpp:318] Authentication
> success
> 3: I1114 02:53:07.016487 19960 authenticatee.cpp:299] Authentication
> success
> 3: I1114 02:53:07.016592 19954 master.cpp:8315] Successfully authenticated
> principal 'test-principal' at slave(751)@172.17.0.2:33432
> 3: I1114 02:53:07.016675 19968 authenticator.cpp:432] Authentication
> session cleanup for crammd5-authenticatee(1383)@172.17.0.2:33432
> 3: I1114 02:53:07.016803 19963 slave.cpp:1161] Successfully authenticated
> with master master@172.17.0.2:33432
> 3: I1114 02:53:07.017132 19963 slave.cpp:1682] Will retry registration in
> 18.870593ms if necessary
> 3: I1114 02:53:07.017354 19953 master.cpp:6032] Received register agent
> message from slave(751)@172.17.0.2:33432 (78aba094e6f9)
> 3: I1114 02:53:07.017491 19953 master.cpp:3870] Authorizing agent with
> principal 'test-principal'
> 3: I1114 02:53:07.018110 19957 master.cpp:6092] Authorized registration of
> agent at slave(751)@172.17.0.2:33432 (78aba094e6f9)
> 3: I1114 02:53:07.018277 19957 master.cpp:6185] Registering agent at
> slave(751)@172.17.0.2:33432 (78aba094e6f9) with id
> 56cf5864-f4d1-40e5-90da-a37eaf7646c6-S0
> 3: I1114 02:53:07.018782 19964 registrar.cpp:495] Applied 1 operations in
> 67922ns; attempting to update the registry
> 3: I1114 02:53:07.019464 19964 registrar.cpp:552] Successfully updated the
> registry in 613888ns
> 3: I1114 02:53:07.019686 19959 master.cpp:6232] Admitted agent
> 56cf5864-f4d1-40e5-90da-a37eaf7646c6-S0 at slave(751)@172.17.0.2:33432
> (78aba094e6f9)
> 3: I1114 02:53:07.020391 19949 slave.cpp:1207] Registered with master
> master@172.17.0.2:33432; given agent ID 56cf5864-f4d1-40e5-90da-
> a37eaf7646c6-S0
> 3: I1114 02:53:07.020484 19950 status_update_manager.cpp:184] Resuming
> sending status updates
> 3: I1114 02:53:07.020277 19959 master.cpp:6263] Registered agent
> 56cf5864-f4d1-40e5-90da-a37eaf7646c6-S0 at slave(751)@172.17.0.2:33432
> (78aba094e6f9) with [{"name":"cpus","scalar":{"
> value":2.0},"type":"SCALAR"},{"name":"mem","scalar":{"value"
> :1024.0},"type":"SCALAR"},{"name":"disk","scalar":{"value"
> :1024.0},"type":"SCALAR"},{"name":"ports","ranges":{"
> range":[{"begin":31000,"end":32000}]},"type":"RANGES"}]
> 3: I1114 02:53:07.020619 19966 hierarchical.cpp:593] Added agent
> 56cf5864-f4d1-40e5-90da-a37eaf7646c6-S0 (78aba094e6f9) with cpus:2;
> mem:1024; disk:1024; ports:[31000-32000] (allocated: {})
> 3: I1114 02:53:07.020727 19949 slave.cpp:1227] Checkpointing SlaveInfo to
> '/tmp/ContentType_ResourceProviderManagerHttpApiTest_ConvertResources_0_
> b5SeIO/meta/slaves/56cf5864-f4d1-40e5-90da-a37eaf7646c6-S0/slave.info'
> 3: I1114 02:53:07.020927 19966 hierarchical.cpp:1450] Performed allocation
> for 1 agents in 141181ns
> 3: I1114 02:53:07.021145 19949 slave.cpp:1285] Forwarding total resources
> cpus:2; mem:1024; disk:1024; ports:[31000-32000]
> 3: I1114 02:53:07.021217 19949 slave.cpp:1295] Forwarding total
> oversubscribed resources {}
> 3: I1114 02:53:07.021803 19949 master.cpp:7051] Received update of agent
> 56cf5864-f4d1-40e5-90da-a37eaf7646c6-S0 at slave(751)@172.17.0.2:33432
> (78aba094e6f9) with total resources cpus:2; mem:1024; disk:1024;
> ports:[31000-32000]
> 3: I1114 02:53:07.021860 19949 master.cpp:7064] Received update of agent
> 56cf5864-f4d1-40e5-90da-a37eaf7646c6-S0 at slave(751)@172.17.0.2:33432
> (78aba094e6f9) with total oversubscribed resources {}
> 3: I1114 02:53:07.022055 19949 master.cpp:7082] Ignoring update on agent
> 56cf5864-f4d1-40e5-90da-a37eaf7646c6-S0 at slave(751)@172.17.0.2:33432
> (78aba094e6f9) as it reports no changes
> 3: I1114 02:53:07.022234 19947 http_connection.hpp:221] New endpoint
> detected at http://172.17.0.2:33432/slave(751)/api/v1/resource_provider
> 3: I1114 02:53:07.024454 19955 http_connection.hpp:277] Connected with the
> remote endpoint at http://172.17.0.2:33432/slave(
> 751)/api/v1/resource_provider
> 3: I1114 02:53:07.025409 19948 http_connection.hpp:129] Sending 1 call to
> http://172.17.0.2:33432/slave(751)/api/v1/resource_provider
> 3: I1114 02:53:07.026854 19968 process.cpp:3925] Handling HTTP event for
> process 'slave(751)' with path: '/slave(751)/api/v1/resource_provider'
> 3: I1114 02:53:07.028084 19963 http.cpp:1185] HTTP POST for
> /slave(751)/api/v1/resource_provider from 172.17.0.2:58852
> 3: I1114 02:53:07.028414 19951 manager.cpp:381] Subscribing resource
> provider {"name":"test","type":"org.apache.mesos.rp.test"}
> 3: I1114 02:53:07.031831 19947 http_connection.hpp:129] Sending 3 call to
> http://172.17.0.2:33432/slave(751)/api/v1/resource_provider
> 3: I1114 02:53:07.033026 19958 process.cpp:3925] Handling HTTP event for
> process 'slave(751)' with path: '/slave(751)/api/v1/resource_provider'
> 3: I1114 02:53:07.034543 19969 http.cpp:1185] HTTP POST for
> /slave(751)/api/v1/resource_provider from 172.17.0.2:58850
> 3: I1114 02:53:07.035089 19967 slave.cpp:6719] Handling resource provider
> message 'UPDATE_TOTAL_RESOURCES: 737fa65c-a99a-443b-a7da-66ca74923908
> disk[RAW]:200'
> 3: I1114 02:53:07.035246 19967 slave.cpp:6764] Forwarding new total
> resources cpus:2; mem:1024; disk:1024; ports:[31000-32000]; disk[RAW]:200
> 3: I1114 02:53:07.036166 19960 master.cpp:7051] Received update of agent
> 56cf5864-f4d1-40e5-90da-a37eaf7646c6-S0 at slave(751)@172.17.0.2:33432
> (78aba094e6f9) with total resources cpus:2; mem:1024; disk:1024;
> ports:[31000-32000]; disk[RAW]:200
> 3: I1114 02:53:07.037621 19945 scheduler.cpp:190] Version: 1.5.0
> 3: I1114 02:53:07.037796 19949 hierarchical.cpp:660] Agent
> 56cf5864-f4d1-40e5-90da-a37eaf7646c6-S0 (78aba094e6f9) updated with total
> resources cpus:2; mem:1024; disk:1024; ports:[31000-32000]; disk[RAW]:200
> 3: I1114 02:53:07.037957 19951 scheduler.cpp:313] Using default 'basic'
> HTTP authenticatee
> 3: I1114 02:53:07.038141 19949 hierarchical.cpp:1450] Performed allocation
> for 1 agents in 151824ns
> 3: I1114 02:53:07.038491 19965 scheduler.cpp:496] New master detected at
> master@172.17.0.2:33432
> 3: I1114 02:53:07.038542 19965 scheduler.cpp:505] Waiting for 0ns before
> initiating a re-(connection) attempt with the master
> 3: I1114 02:53:07.041494 19967 scheduler.cpp:387] Connected with the
> master at http://172.17.0.2:33432/master/api/v1/scheduler
> 3: I1114 02:53:07.042599 19964 scheduler.cpp:249] Sending SUBSCRIBE call
> to http://172.17.0.2:33432/master/api/v1/scheduler
> 3: I1114 02:53:07.044898 19946 process.cpp:3925] Handling HTTP event for
> process 'master' with path: '/master/api/v1/scheduler'
> 3: I1114 02:53:07.046114 19948 http.cpp:1185] HTTP POST for
> /master/api/v1/scheduler from 172.17.0.2:58856
> 3: I1114 02:53:07.046371 19948 master.cpp:2613] Received subscription
> request for HTTP framework 'default'
> 3: I1114 02:53:07.046479 19948 master.cpp:2278] Authorizing framework
> principal 'test-principal' to receive offers for roles '{ * }'
> 3: I1114 02:53:07.047006 19952 master.cpp:2748] Subscribing framework
> 'default' with checkpointing disabled and capabilities [
> RESERVATION_REFINEMENT ]
> 3: I1114 02:53:07.047770 19963 hierarchical.cpp:303] Added framework
> 56cf5864-f4d1-40e5-90da-a37eaf7646c6-0000
> 3: I1114 02:53:07.048667 19950 scheduler.cpp:741] Enqueuing event
> SUBSCRIBED received from http://172.17.0.2:33432/master/api/v1/scheduler
> 3: I1114 02:53:07.049100 19950 scheduler.cpp:741] Enqueuing event
> HEARTBEAT received from http://172.17.0.2:33432/master/api/v1/scheduler
> 3: I1114 02:53:07.049335 19963 hierarchical.cpp:1450] Performed allocation
> for 1 agents in 1.402777ms
> 3: I1114 02:53:07.050079 19954 master.cpp:8115] Sending 1 offers to
> framework 56cf5864-f4d1-40e5-90da-a37eaf7646c6-0000 (default)
> 3: I1114 02:53:07.051934 19957 scheduler.cpp:741] Enqueuing event OFFERS
> received from http://172.17.0.2:33432/master/api/v1/scheduler
> 3: I1114 02:53:07.053679 19961 scheduler.cpp:249] Sending ACCEPT call to
> http://172.17.0.2:33432/master/api/v1/scheduler
> 3: I1114 02:53:07.055368 19966 process.cpp:3925] Handling HTTP event for
> process 'master' with path: '/master/api/v1/scheduler'
> 3: I1114 02:53:07.056813 19952 http.cpp:1185] HTTP POST for
> /master/api/v1/scheduler from 172.17.0.2:58854
> 3: I1114 02:53:07.057857 19952 master.cpp:10017] Removing offer
> 56cf5864-f4d1-40e5-90da-a37eaf7646c6-O0
> 3: I1114 02:53:07.057960 19952 master.cpp:4228] Processing ACCEPT call for
> offers: [ 56cf5864-f4d1-40e5-90da-a37eaf7646c6-O0 ] on agent
> 56cf5864-f4d1-40e5-90da-a37eaf7646c6-S0 at slave(751)@172.17.0.2:33432
> (78aba094e6f9) for framework 56cf5864-f4d1-40e5-90da-a37eaf7646c6-0000
> (default)
> 3: I1114 02:53:07.058682 19952 master.cpp:5293] Processing CREATE_BLOCK
> operation with source disk(allocated: *)[RAW]:200 from framework
> 56cf5864-f4d1-40e5-90da-a37eaf7646c6-0000 (default) to agent
> 56cf5864-f4d1-40e5-90da-a37eaf7646c6-S0 at slave(751)@172.17.0.2:33432
> (78aba094e6f9)
> 3: I1114 02:53:07.059255 19952 master.cpp:9900] Sending offer operation
> r2Í; µF3‡¬”y±‡¨¤ to agent 56cf5864-f4d1-40e5-90da-a37eaf7646c6-S0 at
> slave(751)@172.17.0.2:33432 (78aba094e6f9)
> 3: I1114 02:53:07.060523 19957 hierarchical.cpp:1125] Recovered
> cpus(allocated: *):2; mem(allocated: *):1024; disk(allocated: *):1024;
> ports(allocated: *):[31000-32000] (total: cpus:2; mem:1024; disk:1024;
> ports:[31000-32000]; disk[RAW]:200, allocated: disk(allocated: *)[RAW]:200)
> on agent 56cf5864-f4d1-40e5-90da-a37eaf7646c6-S0 from framework
> 56cf5864-f4d1-40e5-90da-a37eaf7646c6-0000
> 3: I1114 02:53:07.060608 19957 hierarchical.cpp:1171] Framework
> 56cf5864-f4d1-40e5-90da-a37eaf7646c6-0000 filtered agent
> 56cf5864-f4d1-40e5-90da-a37eaf7646c6-S0 for 5secs
> 3: I1114 02:53:07.062851 19966 http_connection.hpp:129] Sending 2 call to
> http://172.17.0.2:33432/slave(751)/api/v1/resource_provider
> 3: I1114 02:53:07.063822 19951 process.cpp:3925] Handling HTTP event for
> process 'slave(751)' with path: '/slave(751)/api/v1/resource_provider'
> 3: I1114 02:53:07.107501 19953 http.cpp:1185] HTTP POST for
> /slave(751)/api/v1/resource_provider from 172.17.0.2:58850
> 3: I1114 02:53:07.108409 19955 slave.cpp:6719] Handling resource provider
> message 'UPDATE_OFFER_OPERATION_STATUS: {"framework_id":{"value":"
> 56cf5864-f4d1-40e5-90da-a37eaf7646c6-0000"},"status":{
> "state":"OFFER_OPERATION_FINISHED","converted_
> resources":[{"provider_id":{"value":"737fa65c-a99a-443b-
> a7da-66ca74923908"},"name":"disk","type":"SCALAR","scalar"
> :{"value":200.0},"allocation_info":{"role":"*"},"disk":{"
> source":{"type":"BLOCK"}}}]},"latest_status":{"state":"
> OFFER_OPERATION_FINISHED","converted_resources":[{"provider_id":{"value":"
> 737fa65c-a99a-443b-a7da-66ca74923908"},"name":"disk","
> type":"SCALAR","scalar":{"value":200.0},"allocation_
> info":{"role":"*"},"disk":{"source":{"type":"BLOCK"}}}]},"
> operation_uuid":"cjLNO4+1RjOHrJR5sYeopA=="}'
> 3: I1114 02:53:07.108831 19955 slave.cpp:6893] Updating the state of offer
> operation '' (uuid: r2Í; µF3‡¬”y±‡¨¤) of framework 56cf5864-f4d1-40e5-90da-a37eaf7646c6-0000
> (latest state: OFFER_OPERATION_FINISHED, status update state:
> OFFER_OPERATION_FINISHED)
> 3: I1114 02:53:07.109284 19955 slave.cpp:6817] Forwarding status update of
> offer operation '' (uuid: 7232cd3b-8fb5-4633-87ac-9479b187a8a4) for
> framework 56cf5864-f4d1-40e5-90da-a37eaf7646c6-0000
> 3: I1114 02:53:07.109923 19957 master.cpp:9698] Updating the state of
> offer operation '' (uuid: 7232cd3b-8fb5-4633-87ac-9479b187a8a4) of
> framework 56cf5864-f4d1-40e5-90da-a37eaf7646c6-0000 (latest state:
> OFFER_OPERATION_FINISHED, status update state: OFFER_OPERATION_FINISHED)
> 3: F1114 02:53:07.110375 19957 master.cpp:11027] CHECK_SOME(resources):
> cpus:2; mem:1024; disk:1024; ports:[31000-32000]; disk[RAW]:200 does not
> contain disk(allocated: *)[RAW]:200
> 3: *** Check failure stack trace: ***
> 3: @ 0x2ba43f3dc9fd google::LogMessage::Fail()
> 3: @ 0x2ba43f3de89d google::LogMessage::SendToLog()
> 3: @ 0x2ba43f3dc5ec google::LogMessage::Flush()
> 3: @ 0x2ba43f3df1be google::LogMessageFatal::~LogMessageFatal()
> 3: I1114 02:53:07.112073 19965 hierarchical.cpp:849] Updated allocation of
> framework 56cf5864-f4d1-40e5-90da-a37eaf7646c6-0000 on agent
> 56cf5864-f4d1-40e5-90da-a37eaf7646c6-S0 from disk(allocated: *)[RAW]:200
> to disk(allocated: *)[BLOCK]:200
> 3: I1114 02:53:07.112476 19965 hierarchical.cpp:1125] Recovered
> disk(allocated: *)[BLOCK]:200 (total: cpus:2; mem:1024; disk:1024;
> ports:[31000-32000]; disk[BLOCK]:200, allocated: {}) on agent
> 56cf5864-f4d1-40e5-90da-a37eaf7646c6-S0 from framework
> 56cf5864-f4d1-40e5-90da-a37eaf7646c6-0000
> 3: I1114 02:53:07.117007 19959 hierarchical.cpp:1450] Performed allocation
> for 1 agents in 1.96546ms
> 3: @ 0xc98678 _CheckFatal::~_CheckFatal()
> 3: @ 0x2ba43c7413d1 mesos::internal::master::Slave::apply()
> 3: @ 0x2ba43c737394 mesos::internal::master::
> Master::updateOfferOperation()
> 3: @ 0x2ba43c7223a7 mesos::internal::master::Master::
> offerOperationStatusUpdate()
> 3: @ 0x2ba43c786b45 ProtobufProcess<>::_handlerM<>()
> 3: @ 0x2ba43c840b0f _ZNSt5_BindIFPFvPN5mesos8internal6mas
> ter6MasterEMS3_FvRKNS1_26OfferOperationStatusUpdateEE
> RKN7process4UPIDERKSsES4_S9_St12_PlaceholderILi1EESI_
> ILi2EEEE6__callIvJSD_SF_EJLm0ELm1ELm2ELm3EEEET_
> OSt5tupleIJDpT0_EESt12_Index_tupleIJXspT1_EEE
> 3: @ 0x2ba43c81ed46 _ZNSt5_BindIFPFvPN5mesos8internal6mas
> ter6MasterEMS3_FvRKNS1_26OfferOperationStatusUpdateEE
> RKN7process4UPIDERKSsES4_S9_St12_PlaceholderILi1EESI_
> ILi2EEEEclIJSD_SF_EvEET0_DpOT_
> 3: @ 0x2ba43c7f3c82 std::_Function_handler<>::_M_invoke()
> 3: @ 0xe84ae3 std::function<>::operator()()
> 3: @ 0x2ba43c76811c ProtobufProcess<>::visit()
> 3: @ 0x2ba43c6f81c0 mesos::internal::master::Master::_visit()
> 3: @ 0x2ba43c6f78d2 mesos::internal::master::Master::visit()
> 3: @ 0x2ba43c74cf68 process::MessageEvent::visit()
> 3: @ 0xcb24d2 process::ProcessBase::serve()
> 3: @ 0x2ba43ee23c7d process::ProcessManager::resume()
> 3: @ 0x2ba43ee200dc _ZZN7process14ProcessManager12i
> nit_threadsEvENKUlvE_clEv
> 3: @ 0x2ba43ee32404 _ZNSt12_Bind_simpleIFZN7process14ProcessMan
> ager12init_threadsEvEUlvE_vEE9_M_invokeIIEEEvSt12_Index_tupleIIXspT_EEE
> 3: @ 0x2ba43ee3235b _ZNSt12_Bind_simpleIFZN7process14ProcessMan
> ager12init_threadsEvEUlvE_vEEclEv
> 3: @ 0x2ba43ee322f4 _ZNSt6thread5_ImplISt12_Bind_
> simpleIFZN7process14ProcessManager12init_threadsEvEUlvE_vEEE6_M_runEv
> 3: @ 0x2ba441e12a60 (unknown)
> 3: @ 0x2ba43f608184 start_thread
> 3: @ 0x2ba44267effd (unknown)
> 3/3 Test #3: MesosTests .......................***Exception: Other471.04
> sec
>
> 67% tests passed, 1 tests failed out of 3
>
> Total Test time (real) = 514.37 sec
>
> The following tests FAILED:
> 3 - MesosTests (OTHER_FAULT)
> Errors while running CTest
> make[3]: *** [CMakeFiles/check] Error 8
> make[3]: Leaving directory `/mesos/build'
> make[2]: *** [CMakeFiles/check.dir/all] Error 2
> make[2]: Leaving directory `/mesos/build'
> make[1]: *** [CMakeFiles/check.dir/rule] Error 2
> make[1]: Leaving directory `/mesos/build'
> make: *** [check] Error 2
> + docker rmi mesos-1510625256-18842
> Untagged: mesos-1510625256-18842:latest
> Deleted: sha256:d1892b9f5c403516c58ff845e2b270
> 7161a4c3611cdad47730bc75c558de84e2
> Deleted: sha256:6c4f2871cbe8448899913bbaeb47a8
> cd4742efbcde5673431eace14e7e57b239
> Deleted: sha256:99de6899a2a171a85034acfed5a4ac
> e68b629d5f45ed0dabee29b2031f356adf
> Deleted: sha256:327d5d20b026ecec5eebbf621c1a31
> fd6d26416e2a088bd28632dba576ed4dcb
> Deleted: sha256:4fe943add9fdd4f321ff846706c39f
> 137501ad41f310b2638fb2657efa8841ca
> Deleted: sha256:945727d116337ce65f3fcef7ceb858
> 9076d2633e447f855b404d45a0e7c06fb1
> Deleted: sha256:c46e68e2a7dc3ddc5f7c6466b96b4c
> 24cde4abb2bf52eadc2caf83866f4f3434
> Deleted: sha256:3b13cf80f255be0b45495a0874165c
> 02db855d5b5b84afdfde48e81a760742ef
> Deleted: sha256:be8391fd1d3884568ce0097c4ee3a1
> 8bc103baeb77472c4c9ce0833652fa6f04
> Deleted: sha256:4973213dd35afd755f2a7867b35c6b
> 2442e4a2c5fec8ec9ba908b4140753a8ff
> Deleted: sha256:873340b1d0e2f0c62e49761447a478
> 9bb87202963766c6148c7afef94dfdaa09
> Deleted: sha256:ad89a637bd87f107f84beceac20d2b
> 88da6dedec807f0ae4ff7de0829e025421
> Deleted: sha256:419f03c6c4e98ed6b8b5359716b6af
> 6e3432a259ea4cce91be06ae6e482a2b7e
> Deleted: sha256:2a455152552f8a2f8f9b7871a74834
> 235f9d894497931c3e67b3a6470b4ed01a
> Deleted: sha256:626aadc8ec2d50dd27ca1845fd63bb
> d8380b303fba7d0ca1bbac559ecdc07846
> Deleted: sha256:744d0f652cb14b258e93c5e8fc9b0f
> 4db3fc91132edd66076c4c709803b6cee1
> Deleted: sha256:7009d6d382c25f0e628f4d2bc2218d
> f70ca0e6a6e1026046972c852694dc9e0f
> Deleted: sha256:6a38d234edebe52410678d6f9fd04a
> 421a52f32b6bb10a65512ff8215fc115d9
> Deleted: sha256:402ab624987e19031cb39173254a39
> 275cfe38242f8f0650ca9ae57a542b6248
> Deleted: sha256:9eae2be8af28d803e3b013d19a719a
> 699a214361d7debbef94fff905741f9bbd
> Deleted: sha256:68d764c2d6ef62285b8aef3c6a16e0
> f213c58644194af49985a9b0591affe0f8
> Deleted: sha256:f49e951e96eb61ca38cb75b20533f4
> d6d27534ed9fcb4bf4d86bd1dad9a2a9e0
> Deleted: sha256:22a4192227177fbc6a2e51401c51c5
> 389d2f639be274c51104e8e5f41793a7c4
> Deleted: sha256:e7ec732d07c9b806b9a5f6d34cc288
> 9026f1913da069796f596d030e12dd5f17
> Deleted: sha256:4d36b376f85e6c23cbe82fa2813eee
> 1ecb7ae84d574d0d5f1584efc7bf7613f3
> Deleted: sha256:00863748d409fefe5e0db6c12ee9b8
> e600da6f0780c784748f628a9ef878df87
> Deleted: sha256:937bb55093f04770d26c8c9df63cfc
> f984e42b0e14ab598e03a80a224717ef99
> Deleted: sha256:c6604f1e3909a5de4b6718f077dfe0
> acbfe2013bdcfa5d8e3e630a0c7f84ba87
> Deleted: sha256:429369ba654b02f981aed437542d65
> 625544c5000f511aa25f46110cfb8a1138
> Deleted: sha256:29ea2892fc686f856bf342706ae8a6
> 43c3714f809b320ee0a06f7403c4a19f64
> Build step 'Execute shell' marked build as failure
> Not sending mail to unregistered user songzihao1990@gmail.com
> Not sending mail to unregistered user yujie.jay@gmail.com
>
Build failed in Jenkins: Mesos-Buildbot » cmake,gcc,--verbose --disable-libtool-wrappers --enable-libevent --enable-ssl,GLOG_v=1 MESOS_VERBOSE=1,ubuntu:14.04,(ubuntu)&&(!ubuntu-us1)&&(!ubuntu-eu2)&&(!qnode3)&&(!H23) #4452
Posted by Apache Jenkins Server <je...@builds.apache.org>.
See <https://builds.apache.org/job/Mesos-Buildbot/BUILDTOOL=cmake,COMPILER=gcc,CONFIGURATION=--verbose%20--disable-libtool-wrappers%20--enable-libevent%20--enable-ssl,ENVIRONMENT=GLOG_v=1%20MESOS_VERBOSE=1,OS=ubuntu%3A14.04,label_exp=(ubuntu)&&(!ubuntu-us1)&&(!ubuntu-eu2)&&(!qnode3)&&(!H23)/4452/display/redirect>
------------------------------------------
[...truncated 27.82 MB...]
3: I1114 02:53:06.946594 19961 status_update_manager.cpp:177] Pausing sending status updates
3: I1114 02:53:06.948072 19964 state.cpp:64] Recovering state from '/tmp/ContentType_ResourceProviderManagerHttpApiTest_AgentEndpoint_1_f4uH3U/meta'
3: I1114 02:53:06.948371 19956 status_update_manager.cpp:203] Recovering status update manager
3: I1114 02:53:06.948536 19949 containerizer.cpp:662] Recovering containerizer
3: I1114 02:53:06.950001 19955 provisioner.cpp:416] Provisioner recovery complete
3: I1114 02:53:06.950423 19953 slave.cpp:6432] Finished recovery
3: I1114 02:53:06.951320 19956 status_update_manager.cpp:177] Pausing sending status updates
3: I1114 02:53:06.951333 19954 slave.cpp:1007] New master detected at master@172.17.0.2:33432
3: I1114 02:53:06.951396 19954 slave.cpp:1042] Detecting new master
3: I1114 02:53:06.955152 19962 process.cpp:3925] Handling HTTP event for process 'slave(750)' with path: '/slave(750)/api/v1/resource_provider'
3: I1114 02:53:06.957485 19961 http.cpp:1185] HTTP POST for /slave(750)/api/v1/resource_provider from 172.17.0.2:58848
3: I1114 02:53:06.958020 19947 manager.cpp:381] Subscribing resource provider {"name":"test","type":"org.apache.mesos.rp.test"}
3: I1114 02:53:06.964301 19945 slave.cpp:883] Agent terminating
3: I1114 02:53:06.970345 19945 master.cpp:1151] Master terminating
3: [ OK ] ContentType/ResourceProviderManagerHttpApiTest.AgentEndpoint/1 (53 ms)
3: [ RUN ] ContentType/ResourceProviderManagerHttpApiTest.ConvertResources/0
3: I1114 02:53:06.977787 19945 cluster.cpp:162] Creating default 'local' authorizer
3: I1114 02:53:06.980988 19969 master.cpp:448] Master 56cf5864-f4d1-40e5-90da-a37eaf7646c6 (78aba094e6f9) started on 172.17.0.2:33432
3: I1114 02:53:06.981014 19969 master.cpp:450] Flags at startup: --acls="" --agent_ping_timeout="15secs" --agent_reregister_timeout="10mins" --allocation_interval="1secs" --allocator="HierarchicalDRF" --authenticate_agents="true" --authenticate_frameworks="true" --authenticate_http_frameworks="true" --authenticate_http_readonly="true" --authenticate_http_readwrite="true" --authenticators="crammd5" --authorizers="local" --credentials="/tmp/EoWqJ5/credentials" --filter_gpu_resources="true" --framework_sorter="drf" --help="false" --hostname_lookup="true" --http_authenticators="basic" --http_framework_authenticators="basic" --initialize_driver_logging="true" --log_auto_initialize="true" --logbufsecs="0" --logging_level="INFO" --max_agent_ping_timeouts="5" --max_completed_frameworks="50" --max_completed_tasks_per_framework="1000" --max_unreachable_tasks_per_framework="1000" --port="5050" --quiet="false" --recovery_agent_removal_limit="100%" --registry="in_memory" --registry_fetch_timeout="1mins" --registry_gc_interval="15mins" --registry_max_agent_age="2weeks" --registry_max_agent_count="102400" --registry_store_timeout="100secs" --registry_strict="false" --root_submissions="true" --user_sorter="drf" --version="false" --webui_dir="/usr/local/share/mesos/webui" --work_dir="/tmp/EoWqJ5/master" --zk_session_timeout="10secs"
3: I1114 02:53:06.981478 19969 master.cpp:499] Master only allowing authenticated frameworks to register
3: I1114 02:53:06.981488 19969 master.cpp:505] Master only allowing authenticated agents to register
3: I1114 02:53:06.981494 19969 master.cpp:511] Master only allowing authenticated HTTP frameworks to register
3: I1114 02:53:06.981501 19969 credentials.hpp:37] Loading credentials for authentication from '/tmp/EoWqJ5/credentials'
3: I1114 02:53:06.981861 19969 master.cpp:555] Using default 'crammd5' authenticator
3: I1114 02:53:06.982045 19969 http.cpp:1045] Creating default 'basic' HTTP authenticator for realm 'mesos-master-readonly'
3: I1114 02:53:06.982215 19969 http.cpp:1045] Creating default 'basic' HTTP authenticator for realm 'mesos-master-readwrite'
3: I1114 02:53:06.982373 19969 http.cpp:1045] Creating default 'basic' HTTP authenticator for realm 'mesos-master-scheduler'
3: I1114 02:53:06.982528 19969 master.cpp:634] Authorization enabled
3: I1114 02:53:06.982709 19950 hierarchical.cpp:171] Initialized hierarchical allocator process
3: I1114 02:53:06.982746 19960 whitelist_watcher.cpp:77] No whitelist given
3: I1114 02:53:06.986054 19963 master.cpp:2213] Elected as the leading master!
3: I1114 02:53:06.986091 19963 master.cpp:1693] Recovering from registrar
3: I1114 02:53:06.986253 19955 registrar.cpp:347] Recovering registrar
3: I1114 02:53:06.986997 19955 registrar.cpp:391] Successfully fetched the registry (0B) in 683776ns
3: I1114 02:53:06.987125 19955 registrar.cpp:495] Applied 1 operations in 32640ns; attempting to update the registry
3: I1114 02:53:06.987735 19955 registrar.cpp:552] Successfully updated the registry in 552192ns
3: I1114 02:53:06.987848 19955 registrar.cpp:424] Successfully recovered registrar
3: I1114 02:53:06.988415 19946 master.cpp:1806] Recovered 0 agents from the registry (129B); allowing 10mins for agents to re-register
3: I1114 02:53:06.988430 19965 hierarchical.cpp:209] Skipping recovery of hierarchical allocator: nothing to recover
3: W1114 02:53:06.993947 19945 process.cpp:3178] Attempted to spawn already running process files@172.17.0.2:33432
3: I1114 02:53:06.994899 19945 containerizer.cpp:301] Using isolation { environment_secret, posix/cpu, posix/mem, filesystem/posix, network/cni }
3: W1114 02:53:06.995415 19945 backend.cpp:76] Failed to create 'aufs' backend: AufsBackend requires root privileges
3: W1114 02:53:06.995530 19945 backend.cpp:76] Failed to create 'bind' backend: BindBackend requires root privileges
3: I1114 02:53:06.995563 19945 provisioner.cpp:255] Using default backend 'copy'
3: I1114 02:53:06.997514 19945 cluster.cpp:448] Creating default 'local' authorizer
3: I1114 02:53:06.999739 19946 slave.cpp:262] Mesos agent started on (751)@172.17.0.2:33432
3: I1114 02:53:06.999754 19946 slave.cpp:263] Flags at startup: --acls="" --agent_features="capabilities {
3: type: MULTI_ROLE
3: }
3: capabilities {
3: type: HIERARCHICAL_ROLE
3: }
3: capabilities {
3: type: RESERVATION_REFINEMENT
3: }
3: capabilities {
3: type: RESOURCE_PROVIDER
3: }
3: " --appc_simple_discovery_uri_prefix="http://" --appc_store_dir="/tmp/ContentType_ResourceProviderManagerHttpApiTest_ConvertResources_0_Six4Gx/store/appc" --authenticate_http_executors="true" --authenticate_http_readonly="true" --authenticate_http_readwrite="false" --authenticatee="crammd5" --authentication_backoff_factor="1secs" --authorizer="local" --cgroups_cpu_enable_pids_and_tids_count="false" --cgroups_enable_cfs="false" --cgroups_hierarchy="/sys/fs/cgroup" --cgroups_limit_swap="false" --cgroups_root="mesos" --container_disk_watch_interval="15secs" --containerizers="mesos" --credential="/tmp/ContentType_ResourceProviderManagerHttpApiTest_ConvertResources_0_Six4Gx/credential" --default_role="*" --disallow_sharing_agent_pid_namespace="false" --disk_watch_interval="1mins" --docker="docker" --docker_kill_orphans="true" --docker_registry="https://registry-1.docker.io" --docker_remove_delay="6hrs" --docker_socket="/var/run/docker.sock" --docker_stop_timeout="0ns" --docker_store_dir="/tmp/ContentType_ResourceProviderManagerHttpApiTest_ConvertResources_0_Six4Gx/store/docker" --docker_volume_checkpoint_dir="/var/run/mesos/isolators/docker/volume" --enforce_container_disk_quota="false" --executor_registration_timeout="1mins" --executor_reregistration_timeout="2secs" --executor_secret_key="/tmp/ContentType_ResourceProviderManagerHttpApiTest_ConvertResources_0_Six4Gx/executor_secret_key" --executor_shutdown_grace_period="5secs" --fetcher_cache_dir="/tmp/ContentType_ResourceProviderManagerHttpApiTest_ConvertResources_0_Six4Gx/fetch" --fetcher_cache_size="2GB" --frameworks_home="" --gc_delay="1weeks" --gc_disk_headroom="0.1" --hadoop_home="" --help="false" --hostname_lookup="true" --http_command_executor="false" --http_credentials="/tmp/ContentType_ResourceProviderManagerHttpApiTest_ConvertResources_0_Six4Gx/http_credentials" --http_heartbeat_interval="30secs" --initialize_driver_logging="true" --isolation="posix/cpu,posix/mem" --launcher="posix" --launcher_dir="/mesos/build/src" --logbufsecs="0" --logging_level="INFO" --max_completed_executors_per_framework="150" --oversubscribed_resources_interval="15secs" --perf_duration="10secs" --perf_interval="1mins" --port="5051" --qos_correction_interval_min="0ns" --quiet="false" --recover="reconnect" --recovery_timeout="15mins" --registration_backoff_factor="10ms" --resources="cpus:2;gpus:0;mem:1024;disk:1024;ports:[31000-32000]" --revocable_cpu_low_priority="true" --runtime_dir="/tmp/ContentType_ResourceProviderManagerHttpApiTest_ConvertResources_0_Six4Gx" --sandbox_directory="/mnt/mesos/sandbox" --strict="true" --switch_user="true" --systemd_enable_support="true" --systemd_runtime_directory="/run/systemd/system" --version="false" --work_dir="/tmp/ContentType_ResourceProviderManagerHttpApiTest_ConvertResources_0_b5SeIO" --zk_session_timeout="10secs"
3: I1114 02:53:07.000257 19946 credentials.hpp:86] Loading credential for authentication from '/tmp/ContentType_ResourceProviderManagerHttpApiTest_ConvertResources_0_Six4Gx/credential'
3: I1114 02:53:07.000419 19946 slave.cpp:295] Agent using credential for: test-principal
3: I1114 02:53:07.000437 19946 credentials.hpp:37] Loading credentials for authentication from '/tmp/ContentType_ResourceProviderManagerHttpApiTest_ConvertResources_0_Six4Gx/http_credentials'
3: I1114 02:53:07.000725 19946 http.cpp:1045] Creating default 'basic' HTTP authenticator for realm 'mesos-agent-executor'
3: I1114 02:53:07.000855 19946 http.cpp:1066] Creating default 'jwt' HTTP authenticator for realm 'mesos-agent-executor'
3: I1114 02:53:07.001065 19946 http.cpp:1045] Creating default 'basic' HTTP authenticator for realm 'mesos-agent-readonly'
3: I1114 02:53:07.001165 19946 http.cpp:1066] Creating default 'jwt' HTTP authenticator for realm 'mesos-agent-readonly'
3: I1114 02:53:07.002676 19946 slave.cpp:593] Agent resources: [{"name":"cpus","scalar":{"value":2.0},"type":"SCALAR"},{"name":"mem","scalar":{"value":1024.0},"type":"SCALAR"},{"name":"disk","scalar":{"value":1024.0},"type":"SCALAR"},{"name":"ports","ranges":{"range":[{"begin":31000,"end":32000}]},"type":"RANGES"}]
3: I1114 02:53:07.002900 19946 slave.cpp:601] Agent attributes: [ ]
3: I1114 02:53:07.002910 19946 slave.cpp:610] Agent hostname: 78aba094e6f9
3: I1114 02:53:07.003098 19953 status_update_manager.cpp:177] Pausing sending status updates
3: I1114 02:53:07.004681 19954 state.cpp:64] Recovering state from '/tmp/ContentType_ResourceProviderManagerHttpApiTest_ConvertResources_0_b5SeIO/meta'
3: I1114 02:53:07.004995 19954 status_update_manager.cpp:203] Recovering status update manager
3: I1114 02:53:07.005203 19954 containerizer.cpp:662] Recovering containerizer
3: I1114 02:53:07.006691 19962 provisioner.cpp:416] Provisioner recovery complete
3: I1114 02:53:07.007083 19951 slave.cpp:6432] Finished recovery
3: I1114 02:53:07.007786 19946 status_update_manager.cpp:177] Pausing sending status updates
3: I1114 02:53:07.007787 19955 slave.cpp:1007] New master detected at master@172.17.0.2:33432
3: I1114 02:53:07.007875 19955 slave.cpp:1042] Detecting new master
3: I1114 02:53:07.014212 19958 slave.cpp:1069] Authenticating with master master@172.17.0.2:33432
3: I1114 02:53:07.014333 19958 slave.cpp:1078] Using default CRAM-MD5 authenticatee
3: I1114 02:53:07.014644 19959 authenticatee.cpp:121] Creating new client SASL connection
3: I1114 02:53:07.015040 19967 master.cpp:8285] Authenticating slave(751)@172.17.0.2:33432
3: I1114 02:53:07.015202 19949 authenticator.cpp:414] Starting authentication session for crammd5-authenticatee(1383)@172.17.0.2:33432
3: I1114 02:53:07.015475 19966 authenticator.cpp:98] Creating new server SASL connection
3: I1114 02:53:07.015750 19969 authenticatee.cpp:213] Received SASL authentication mechanisms: CRAM-MD5
3: I1114 02:53:07.015779 19969 authenticatee.cpp:239] Attempting to authenticate with mechanism 'CRAM-MD5'
3: I1114 02:53:07.015897 19950 authenticator.cpp:204] Received SASL authentication start
3: I1114 02:53:07.015971 19950 authenticator.cpp:326] Authentication requires more steps
3: I1114 02:53:07.016119 19948 authenticatee.cpp:259] Received SASL authentication step
3: I1114 02:53:07.016261 19952 authenticator.cpp:232] Received SASL authentication step
3: I1114 02:53:07.016293 19952 auxprop.cpp:109] Request to lookup properties for user: 'test-principal' realm: '78aba094e6f9' server FQDN: '78aba094e6f9' SASL_AUXPROP_VERIFY_AGAINST_HASH: false SASL_AUXPROP_OVERRIDE: false SASL_AUXPROP_AUTHZID: false
3: I1114 02:53:07.016306 19952 auxprop.cpp:181] Looking up auxiliary property '*userPassword'
3: I1114 02:53:07.016355 19952 auxprop.cpp:181] Looking up auxiliary property '*cmusaslsecretCRAM-MD5'
3: I1114 02:53:07.016372 19952 auxprop.cpp:109] Request to lookup properties for user: 'test-principal' realm: '78aba094e6f9' server FQDN: '78aba094e6f9' SASL_AUXPROP_VERIFY_AGAINST_HASH: false SASL_AUXPROP_OVERRIDE: false SASL_AUXPROP_AUTHZID: true
3: I1114 02:53:07.016379 19952 auxprop.cpp:131] Skipping auxiliary property '*userPassword' since SASL_AUXPROP_AUTHZID == true
3: I1114 02:53:07.016384 19952 auxprop.cpp:131] Skipping auxiliary property '*cmusaslsecretCRAM-MD5' since SASL_AUXPROP_AUTHZID == true
3: I1114 02:53:07.016396 19952 authenticator.cpp:318] Authentication success
3: I1114 02:53:07.016487 19960 authenticatee.cpp:299] Authentication success
3: I1114 02:53:07.016592 19954 master.cpp:8315] Successfully authenticated principal 'test-principal' at slave(751)@172.17.0.2:33432
3: I1114 02:53:07.016675 19968 authenticator.cpp:432] Authentication session cleanup for crammd5-authenticatee(1383)@172.17.0.2:33432
3: I1114 02:53:07.016803 19963 slave.cpp:1161] Successfully authenticated with master master@172.17.0.2:33432
3: I1114 02:53:07.017132 19963 slave.cpp:1682] Will retry registration in 18.870593ms if necessary
3: I1114 02:53:07.017354 19953 master.cpp:6032] Received register agent message from slave(751)@172.17.0.2:33432 (78aba094e6f9)
3: I1114 02:53:07.017491 19953 master.cpp:3870] Authorizing agent with principal 'test-principal'
3: I1114 02:53:07.018110 19957 master.cpp:6092] Authorized registration of agent at slave(751)@172.17.0.2:33432 (78aba094e6f9)
3: I1114 02:53:07.018277 19957 master.cpp:6185] Registering agent at slave(751)@172.17.0.2:33432 (78aba094e6f9) with id 56cf5864-f4d1-40e5-90da-a37eaf7646c6-S0
3: I1114 02:53:07.018782 19964 registrar.cpp:495] Applied 1 operations in 67922ns; attempting to update the registry
3: I1114 02:53:07.019464 19964 registrar.cpp:552] Successfully updated the registry in 613888ns
3: I1114 02:53:07.019686 19959 master.cpp:6232] Admitted agent 56cf5864-f4d1-40e5-90da-a37eaf7646c6-S0 at slave(751)@172.17.0.2:33432 (78aba094e6f9)
3: I1114 02:53:07.020391 19949 slave.cpp:1207] Registered with master master@172.17.0.2:33432; given agent ID 56cf5864-f4d1-40e5-90da-a37eaf7646c6-S0
3: I1114 02:53:07.020484 19950 status_update_manager.cpp:184] Resuming sending status updates
3: I1114 02:53:07.020277 19959 master.cpp:6263] Registered agent 56cf5864-f4d1-40e5-90da-a37eaf7646c6-S0 at slave(751)@172.17.0.2:33432 (78aba094e6f9) with [{"name":"cpus","scalar":{"value":2.0},"type":"SCALAR"},{"name":"mem","scalar":{"value":1024.0},"type":"SCALAR"},{"name":"disk","scalar":{"value":1024.0},"type":"SCALAR"},{"name":"ports","ranges":{"range":[{"begin":31000,"end":32000}]},"type":"RANGES"}]
3: I1114 02:53:07.020619 19966 hierarchical.cpp:593] Added agent 56cf5864-f4d1-40e5-90da-a37eaf7646c6-S0 (78aba094e6f9) with cpus:2; mem:1024; disk:1024; ports:[31000-32000] (allocated: {})
3: I1114 02:53:07.020727 19949 slave.cpp:1227] Checkpointing SlaveInfo to '/tmp/ContentType_ResourceProviderManagerHttpApiTest_ConvertResources_0_b5SeIO/meta/slaves/56cf5864-f4d1-40e5-90da-a37eaf7646c6-S0/slave.info'
3: I1114 02:53:07.020927 19966 hierarchical.cpp:1450] Performed allocation for 1 agents in 141181ns
3: I1114 02:53:07.021145 19949 slave.cpp:1285] Forwarding total resources cpus:2; mem:1024; disk:1024; ports:[31000-32000]
3: I1114 02:53:07.021217 19949 slave.cpp:1295] Forwarding total oversubscribed resources {}
3: I1114 02:53:07.021803 19949 master.cpp:7051] Received update of agent 56cf5864-f4d1-40e5-90da-a37eaf7646c6-S0 at slave(751)@172.17.0.2:33432 (78aba094e6f9) with total resources cpus:2; mem:1024; disk:1024; ports:[31000-32000]
3: I1114 02:53:07.021860 19949 master.cpp:7064] Received update of agent 56cf5864-f4d1-40e5-90da-a37eaf7646c6-S0 at slave(751)@172.17.0.2:33432 (78aba094e6f9) with total oversubscribed resources {}
3: I1114 02:53:07.022055 19949 master.cpp:7082] Ignoring update on agent 56cf5864-f4d1-40e5-90da-a37eaf7646c6-S0 at slave(751)@172.17.0.2:33432 (78aba094e6f9) as it reports no changes
3: I1114 02:53:07.022234 19947 http_connection.hpp:221] New endpoint detected at http://172.17.0.2:33432/slave(751)/api/v1/resource_provider
3: I1114 02:53:07.024454 19955 http_connection.hpp:277] Connected with the remote endpoint at http://172.17.0.2:33432/slave(751)/api/v1/resource_provider
3: I1114 02:53:07.025409 19948 http_connection.hpp:129] Sending 1 call to http://172.17.0.2:33432/slave(751)/api/v1/resource_provider
3: I1114 02:53:07.026854 19968 process.cpp:3925] Handling HTTP event for process 'slave(751)' with path: '/slave(751)/api/v1/resource_provider'
3: I1114 02:53:07.028084 19963 http.cpp:1185] HTTP POST for /slave(751)/api/v1/resource_provider from 172.17.0.2:58852
3: I1114 02:53:07.028414 19951 manager.cpp:381] Subscribing resource provider {"name":"test","type":"org.apache.mesos.rp.test"}
3: I1114 02:53:07.031831 19947 http_connection.hpp:129] Sending 3 call to http://172.17.0.2:33432/slave(751)/api/v1/resource_provider
3: I1114 02:53:07.033026 19958 process.cpp:3925] Handling HTTP event for process 'slave(751)' with path: '/slave(751)/api/v1/resource_provider'
3: I1114 02:53:07.034543 19969 http.cpp:1185] HTTP POST for /slave(751)/api/v1/resource_provider from 172.17.0.2:58850
3: I1114 02:53:07.035089 19967 slave.cpp:6719] Handling resource provider message 'UPDATE_TOTAL_RESOURCES: 737fa65c-a99a-443b-a7da-66ca74923908 disk[RAW]:200'
3: I1114 02:53:07.035246 19967 slave.cpp:6764] Forwarding new total resources cpus:2; mem:1024; disk:1024; ports:[31000-32000]; disk[RAW]:200
3: I1114 02:53:07.036166 19960 master.cpp:7051] Received update of agent 56cf5864-f4d1-40e5-90da-a37eaf7646c6-S0 at slave(751)@172.17.0.2:33432 (78aba094e6f9) with total resources cpus:2; mem:1024; disk:1024; ports:[31000-32000]; disk[RAW]:200
3: I1114 02:53:07.037621 19945 scheduler.cpp:190] Version: 1.5.0
3: I1114 02:53:07.037796 19949 hierarchical.cpp:660] Agent 56cf5864-f4d1-40e5-90da-a37eaf7646c6-S0 (78aba094e6f9) updated with total resources cpus:2; mem:1024; disk:1024; ports:[31000-32000]; disk[RAW]:200
3: I1114 02:53:07.037957 19951 scheduler.cpp:313] Using default 'basic' HTTP authenticatee
3: I1114 02:53:07.038141 19949 hierarchical.cpp:1450] Performed allocation for 1 agents in 151824ns
3: I1114 02:53:07.038491 19965 scheduler.cpp:496] New master detected at master@172.17.0.2:33432
3: I1114 02:53:07.038542 19965 scheduler.cpp:505] Waiting for 0ns before initiating a re-(connection) attempt with the master
3: I1114 02:53:07.041494 19967 scheduler.cpp:387] Connected with the master at http://172.17.0.2:33432/master/api/v1/scheduler
3: I1114 02:53:07.042599 19964 scheduler.cpp:249] Sending SUBSCRIBE call to http://172.17.0.2:33432/master/api/v1/scheduler
3: I1114 02:53:07.044898 19946 process.cpp:3925] Handling HTTP event for process 'master' with path: '/master/api/v1/scheduler'
3: I1114 02:53:07.046114 19948 http.cpp:1185] HTTP POST for /master/api/v1/scheduler from 172.17.0.2:58856
3: I1114 02:53:07.046371 19948 master.cpp:2613] Received subscription request for HTTP framework 'default'
3: I1114 02:53:07.046479 19948 master.cpp:2278] Authorizing framework principal 'test-principal' to receive offers for roles '{ * }'
3: I1114 02:53:07.047006 19952 master.cpp:2748] Subscribing framework 'default' with checkpointing disabled and capabilities [ RESERVATION_REFINEMENT ]
3: I1114 02:53:07.047770 19963 hierarchical.cpp:303] Added framework 56cf5864-f4d1-40e5-90da-a37eaf7646c6-0000
3: I1114 02:53:07.048667 19950 scheduler.cpp:741] Enqueuing event SUBSCRIBED received from http://172.17.0.2:33432/master/api/v1/scheduler
3: I1114 02:53:07.049100 19950 scheduler.cpp:741] Enqueuing event HEARTBEAT received from http://172.17.0.2:33432/master/api/v1/scheduler
3: I1114 02:53:07.049335 19963 hierarchical.cpp:1450] Performed allocation for 1 agents in 1.402777ms
3: I1114 02:53:07.050079 19954 master.cpp:8115] Sending 1 offers to framework 56cf5864-f4d1-40e5-90da-a37eaf7646c6-0000 (default)
3: I1114 02:53:07.051934 19957 scheduler.cpp:741] Enqueuing event OFFERS received from http://172.17.0.2:33432/master/api/v1/scheduler
3: I1114 02:53:07.053679 19961 scheduler.cpp:249] Sending ACCEPT call to http://172.17.0.2:33432/master/api/v1/scheduler
3: I1114 02:53:07.055368 19966 process.cpp:3925] Handling HTTP event for process 'master' with path: '/master/api/v1/scheduler'
3: I1114 02:53:07.056813 19952 http.cpp:1185] HTTP POST for /master/api/v1/scheduler from 172.17.0.2:58854
3: I1114 02:53:07.057857 19952 master.cpp:10017] Removing offer 56cf5864-f4d1-40e5-90da-a37eaf7646c6-O0
3: I1114 02:53:07.057960 19952 master.cpp:4228] Processing ACCEPT call for offers: [ 56cf5864-f4d1-40e5-90da-a37eaf7646c6-O0 ] on agent 56cf5864-f4d1-40e5-90da-a37eaf7646c6-S0 at slave(751)@172.17.0.2:33432 (78aba094e6f9) for framework 56cf5864-f4d1-40e5-90da-a37eaf7646c6-0000 (default)
3: I1114 02:53:07.058682 19952 master.cpp:5293] Processing CREATE_BLOCK operation with source disk(allocated: *)[RAW]:200 from framework 56cf5864-f4d1-40e5-90da-a37eaf7646c6-0000 (default) to agent 56cf5864-f4d1-40e5-90da-a37eaf7646c6-S0 at slave(751)@172.17.0.2:33432 (78aba094e6f9)
3: I1114 02:53:07.059255 19952 master.cpp:9900] Sending offer operation r2Í;µF3¬y±¨¤ to agent 56cf5864-f4d1-40e5-90da-a37eaf7646c6-S0 at slave(751)@172.17.0.2:33432 (78aba094e6f9)
3: I1114 02:53:07.060523 19957 hierarchical.cpp:1125] Recovered cpus(allocated: *):2; mem(allocated: *):1024; disk(allocated: *):1024; ports(allocated: *):[31000-32000] (total: cpus:2; mem:1024; disk:1024; ports:[31000-32000]; disk[RAW]:200, allocated: disk(allocated: *)[RAW]:200) on agent 56cf5864-f4d1-40e5-90da-a37eaf7646c6-S0 from framework 56cf5864-f4d1-40e5-90da-a37eaf7646c6-0000
3: I1114 02:53:07.060608 19957 hierarchical.cpp:1171] Framework 56cf5864-f4d1-40e5-90da-a37eaf7646c6-0000 filtered agent 56cf5864-f4d1-40e5-90da-a37eaf7646c6-S0 for 5secs
3: I1114 02:53:07.062851 19966 http_connection.hpp:129] Sending 2 call to http://172.17.0.2:33432/slave(751)/api/v1/resource_provider
3: I1114 02:53:07.063822 19951 process.cpp:3925] Handling HTTP event for process 'slave(751)' with path: '/slave(751)/api/v1/resource_provider'
3: I1114 02:53:07.107501 19953 http.cpp:1185] HTTP POST for /slave(751)/api/v1/resource_provider from 172.17.0.2:58850
3: I1114 02:53:07.108409 19955 slave.cpp:6719] Handling resource provider message 'UPDATE_OFFER_OPERATION_STATUS: {"framework_id":{"value":"56cf5864-f4d1-40e5-90da-a37eaf7646c6-0000"},"status":{"state":"OFFER_OPERATION_FINISHED","converted_resources":[{"provider_id":{"value":"737fa65c-a99a-443b-a7da-66ca74923908"},"name":"disk","type":"SCALAR","scalar":{"value":200.0},"allocation_info":{"role":"*"},"disk":{"source":{"type":"BLOCK"}}}]},"latest_status":{"state":"OFFER_OPERATION_FINISHED","converted_resources":[{"provider_id":{"value":"737fa65c-a99a-443b-a7da-66ca74923908"},"name":"disk","type":"SCALAR","scalar":{"value":200.0},"allocation_info":{"role":"*"},"disk":{"source":{"type":"BLOCK"}}}]},"operation_uuid":"cjLNO4+1RjOHrJR5sYeopA=="}'
3: I1114 02:53:07.108831 19955 slave.cpp:6893] Updating the state of offer operation '' (uuid: r2Í;µF3¬y±¨¤) of framework 56cf5864-f4d1-40e5-90da-a37eaf7646c6-0000 (latest state: OFFER_OPERATION_FINISHED, status update state: OFFER_OPERATION_FINISHED)
3: I1114 02:53:07.109284 19955 slave.cpp:6817] Forwarding status update of offer operation '' (uuid: 7232cd3b-8fb5-4633-87ac-9479b187a8a4) for framework 56cf5864-f4d1-40e5-90da-a37eaf7646c6-0000
3: I1114 02:53:07.109923 19957 master.cpp:9698] Updating the state of offer operation '' (uuid: 7232cd3b-8fb5-4633-87ac-9479b187a8a4) of framework 56cf5864-f4d1-40e5-90da-a37eaf7646c6-0000 (latest state: OFFER_OPERATION_FINISHED, status update state: OFFER_OPERATION_FINISHED)
3: F1114 02:53:07.110375 19957 master.cpp:11027] CHECK_SOME(resources): cpus:2; mem:1024; disk:1024; ports:[31000-32000]; disk[RAW]:200 does not contain disk(allocated: *)[RAW]:200
3: *** Check failure stack trace: ***
3: @ 0x2ba43f3dc9fd google::LogMessage::Fail()
3: @ 0x2ba43f3de89d google::LogMessage::SendToLog()
3: @ 0x2ba43f3dc5ec google::LogMessage::Flush()
3: @ 0x2ba43f3df1be google::LogMessageFatal::~LogMessageFatal()
3: I1114 02:53:07.112073 19965 hierarchical.cpp:849] Updated allocation of framework 56cf5864-f4d1-40e5-90da-a37eaf7646c6-0000 on agent 56cf5864-f4d1-40e5-90da-a37eaf7646c6-S0 from disk(allocated: *)[RAW]:200 to disk(allocated: *)[BLOCK]:200
3: I1114 02:53:07.112476 19965 hierarchical.cpp:1125] Recovered disk(allocated: *)[BLOCK]:200 (total: cpus:2; mem:1024; disk:1024; ports:[31000-32000]; disk[BLOCK]:200, allocated: {}) on agent 56cf5864-f4d1-40e5-90da-a37eaf7646c6-S0 from framework 56cf5864-f4d1-40e5-90da-a37eaf7646c6-0000
3: I1114 02:53:07.117007 19959 hierarchical.cpp:1450] Performed allocation for 1 agents in 1.96546ms
3: @ 0xc98678 _CheckFatal::~_CheckFatal()
3: @ 0x2ba43c7413d1 mesos::internal::master::Slave::apply()
3: @ 0x2ba43c737394 mesos::internal::master::Master::updateOfferOperation()
3: @ 0x2ba43c7223a7 mesos::internal::master::Master::offerOperationStatusUpdate()
3: @ 0x2ba43c786b45 ProtobufProcess<>::_handlerM<>()
3: @ 0x2ba43c840b0f _ZNSt5_BindIFPFvPN5mesos8internal6master6MasterEMS3_FvRKNS1_26OfferOperationStatusUpdateEERKN7process4UPIDERKSsES4_S9_St12_PlaceholderILi1EESI_ILi2EEEE6__callIvJSD_SF_EJLm0ELm1ELm2ELm3EEEET_OSt5tupleIJDpT0_EESt12_Index_tupleIJXspT1_EEE
3: @ 0x2ba43c81ed46 _ZNSt5_BindIFPFvPN5mesos8internal6master6MasterEMS3_FvRKNS1_26OfferOperationStatusUpdateEERKN7process4UPIDERKSsES4_S9_St12_PlaceholderILi1EESI_ILi2EEEEclIJSD_SF_EvEET0_DpOT_
3: @ 0x2ba43c7f3c82 std::_Function_handler<>::_M_invoke()
3: @ 0xe84ae3 std::function<>::operator()()
3: @ 0x2ba43c76811c ProtobufProcess<>::visit()
3: @ 0x2ba43c6f81c0 mesos::internal::master::Master::_visit()
3: @ 0x2ba43c6f78d2 mesos::internal::master::Master::visit()
3: @ 0x2ba43c74cf68 process::MessageEvent::visit()
3: @ 0xcb24d2 process::ProcessBase::serve()
3: @ 0x2ba43ee23c7d process::ProcessManager::resume()
3: @ 0x2ba43ee200dc _ZZN7process14ProcessManager12init_threadsEvENKUlvE_clEv
3: @ 0x2ba43ee32404 _ZNSt12_Bind_simpleIFZN7process14ProcessManager12init_threadsEvEUlvE_vEE9_M_invokeIIEEEvSt12_Index_tupleIIXspT_EEE
3: @ 0x2ba43ee3235b _ZNSt12_Bind_simpleIFZN7process14ProcessManager12init_threadsEvEUlvE_vEEclEv
3: @ 0x2ba43ee322f4 _ZNSt6thread5_ImplISt12_Bind_simpleIFZN7process14ProcessManager12init_threadsEvEUlvE_vEEE6_M_runEv
3: @ 0x2ba441e12a60 (unknown)
3: @ 0x2ba43f608184 start_thread
3: @ 0x2ba44267effd (unknown)
3/3 Test #3: MesosTests .......................***Exception: Other471.04 sec
67% tests passed, 1 tests failed out of 3
Total Test time (real) = 514.37 sec
The following tests FAILED:
3 - MesosTests (OTHER_FAULT)
Errors while running CTest
make[3]: *** [CMakeFiles/check] Error 8
make[3]: Leaving directory `/mesos/build'
make[2]: *** [CMakeFiles/check.dir/all] Error 2
make[2]: Leaving directory `/mesos/build'
make[1]: *** [CMakeFiles/check.dir/rule] Error 2
make[1]: Leaving directory `/mesos/build'
make: *** [check] Error 2
+ docker rmi mesos-1510625256-18842
Untagged: mesos-1510625256-18842:latest
Deleted: sha256:d1892b9f5c403516c58ff845e2b2707161a4c3611cdad47730bc75c558de84e2
Deleted: sha256:6c4f2871cbe8448899913bbaeb47a8cd4742efbcde5673431eace14e7e57b239
Deleted: sha256:99de6899a2a171a85034acfed5a4ace68b629d5f45ed0dabee29b2031f356adf
Deleted: sha256:327d5d20b026ecec5eebbf621c1a31fd6d26416e2a088bd28632dba576ed4dcb
Deleted: sha256:4fe943add9fdd4f321ff846706c39f137501ad41f310b2638fb2657efa8841ca
Deleted: sha256:945727d116337ce65f3fcef7ceb8589076d2633e447f855b404d45a0e7c06fb1
Deleted: sha256:c46e68e2a7dc3ddc5f7c6466b96b4c24cde4abb2bf52eadc2caf83866f4f3434
Deleted: sha256:3b13cf80f255be0b45495a0874165c02db855d5b5b84afdfde48e81a760742ef
Deleted: sha256:be8391fd1d3884568ce0097c4ee3a18bc103baeb77472c4c9ce0833652fa6f04
Deleted: sha256:4973213dd35afd755f2a7867b35c6b2442e4a2c5fec8ec9ba908b4140753a8ff
Deleted: sha256:873340b1d0e2f0c62e49761447a4789bb87202963766c6148c7afef94dfdaa09
Deleted: sha256:ad89a637bd87f107f84beceac20d2b88da6dedec807f0ae4ff7de0829e025421
Deleted: sha256:419f03c6c4e98ed6b8b5359716b6af6e3432a259ea4cce91be06ae6e482a2b7e
Deleted: sha256:2a455152552f8a2f8f9b7871a74834235f9d894497931c3e67b3a6470b4ed01a
Deleted: sha256:626aadc8ec2d50dd27ca1845fd63bbd8380b303fba7d0ca1bbac559ecdc07846
Deleted: sha256:744d0f652cb14b258e93c5e8fc9b0f4db3fc91132edd66076c4c709803b6cee1
Deleted: sha256:7009d6d382c25f0e628f4d2bc2218df70ca0e6a6e1026046972c852694dc9e0f
Deleted: sha256:6a38d234edebe52410678d6f9fd04a421a52f32b6bb10a65512ff8215fc115d9
Deleted: sha256:402ab624987e19031cb39173254a39275cfe38242f8f0650ca9ae57a542b6248
Deleted: sha256:9eae2be8af28d803e3b013d19a719a699a214361d7debbef94fff905741f9bbd
Deleted: sha256:68d764c2d6ef62285b8aef3c6a16e0f213c58644194af49985a9b0591affe0f8
Deleted: sha256:f49e951e96eb61ca38cb75b20533f4d6d27534ed9fcb4bf4d86bd1dad9a2a9e0
Deleted: sha256:22a4192227177fbc6a2e51401c51c5389d2f639be274c51104e8e5f41793a7c4
Deleted: sha256:e7ec732d07c9b806b9a5f6d34cc2889026f1913da069796f596d030e12dd5f17
Deleted: sha256:4d36b376f85e6c23cbe82fa2813eee1ecb7ae84d574d0d5f1584efc7bf7613f3
Deleted: sha256:00863748d409fefe5e0db6c12ee9b8e600da6f0780c784748f628a9ef878df87
Deleted: sha256:937bb55093f04770d26c8c9df63cfcf984e42b0e14ab598e03a80a224717ef99
Deleted: sha256:c6604f1e3909a5de4b6718f077dfe0acbfe2013bdcfa5d8e3e630a0c7f84ba87
Deleted: sha256:429369ba654b02f981aed437542d65625544c5000f511aa25f46110cfb8a1138
Deleted: sha256:29ea2892fc686f856bf342706ae8a643c3714f809b320ee0a06f7403c4a19f64
Build step 'Execute shell' marked build as failure
Not sending mail to unregistered user songzihao1990@gmail.com
Not sending mail to unregistered user yujie.jay@gmail.com
Build failed in Jenkins: Mesos-Buildbot » cmake,gcc,--verbose --disable-libtool-wrappers --enable-libevent --enable-ssl,GLOG_v=1 MESOS_VERBOSE=1,ubuntu:14.04,(ubuntu)&&(!ubuntu-us1)&&(!ubuntu-eu2)&&(!qnode3)&&(!H23) #4451
Posted by Apache Jenkins Server <je...@builds.apache.org>.
See <https://builds.apache.org/job/Mesos-Buildbot/BUILDTOOL=cmake,COMPILER=gcc,CONFIGURATION=--verbose%20--disable-libtool-wrappers%20--enable-libevent%20--enable-ssl,ENVIRONMENT=GLOG_v=1%20MESOS_VERBOSE=1,OS=ubuntu%3A14.04,label_exp=(ubuntu)&&(!ubuntu-us1)&&(!ubuntu-eu2)&&(!qnode3)&&(!H23)/4451/display/redirect?page=changes>
Changes:
[yujie.jay] Handled the resource conversion for new operations in master.
[songzihao1990] Added a test `CgroupsIsolatorTest.ROOT_CGROUPS_BlkioUsage`.
------------------------------------------
[...truncated 27.83 MB...]
3: I1114 01:44:29.187314 19962 status_update_manager.cpp:177] Pausing sending status updates
3: I1114 01:44:29.189595 19956 state.cpp:64] Recovering state from '/tmp/ContentType_ResourceProviderManagerHttpApiTest_AgentEndpoint_1_IJQKYf/meta'
3: I1114 01:44:29.190078 19948 status_update_manager.cpp:203] Recovering status update manager
3: I1114 01:44:29.190379 19942 containerizer.cpp:662] Recovering containerizer
3: I1114 01:44:29.191932 19965 provisioner.cpp:416] Provisioner recovery complete
3: I1114 01:44:29.192266 19954 slave.cpp:6432] Finished recovery
3: I1114 01:44:29.192991 19963 status_update_manager.cpp:177] Pausing sending status updates
3: I1114 01:44:29.193025 19950 slave.cpp:1007] New master detected at master@172.17.0.9:41258
3: I1114 01:44:29.193114 19950 slave.cpp:1042] Detecting new master
3: I1114 01:44:29.195739 19944 process.cpp:3925] Handling HTTP event for process 'slave(750)' with path: '/slave(750)/api/v1/resource_provider'
3: I1114 01:44:29.198395 19946 http.cpp:1185] HTTP POST for /slave(750)/api/v1/resource_provider from 172.17.0.9:53008
3: I1114 01:44:29.198834 19962 manager.cpp:381] Subscribing resource provider {"name":"test","type":"org.apache.mesos.rp.test"}
3: I1114 01:44:29.205705 19941 slave.cpp:883] Agent terminating
3: I1114 01:44:29.214551 19941 master.cpp:1151] Master terminating
3: [ OK ] ContentType/ResourceProviderManagerHttpApiTest.AgentEndpoint/1 (60 ms)
3: [ RUN ] ContentType/ResourceProviderManagerHttpApiTest.ConvertResources/0
3: I1114 01:44:29.223004 19941 cluster.cpp:162] Creating default 'local' authorizer
3: I1114 01:44:29.227275 19965 master.cpp:448] Master d2a0bf50-f25a-4a49-b17c-b8cbcd228032 (105641e656fc) started on 172.17.0.9:41258
3: I1114 01:44:29.227293 19965 master.cpp:450] Flags at startup: --acls="" --agent_ping_timeout="15secs" --agent_reregister_timeout="10mins" --allocation_interval="1secs" --allocator="HierarchicalDRF" --authenticate_agents="true" --authenticate_frameworks="true" --authenticate_http_frameworks="true" --authenticate_http_readonly="true" --authenticate_http_readwrite="true" --authenticators="crammd5" --authorizers="local" --credentials="/tmp/RCChkC/credentials" --filter_gpu_resources="true" --framework_sorter="drf" --help="false" --hostname_lookup="true" --http_authenticators="basic" --http_framework_authenticators="basic" --initialize_driver_logging="true" --log_auto_initialize="true" --logbufsecs="0" --logging_level="INFO" --max_agent_ping_timeouts="5" --max_completed_frameworks="50" --max_completed_tasks_per_framework="1000" --max_unreachable_tasks_per_framework="1000" --port="5050" --quiet="false" --recovery_agent_removal_limit="100%" --registry="in_memory" --registry_fetch_timeout="1mins" --registry_gc_interval="15mins" --registry_max_agent_age="2weeks" --registry_max_agent_count="102400" --registry_store_timeout="100secs" --registry_strict="false" --root_submissions="true" --user_sorter="drf" --version="false" --webui_dir="/usr/local/share/mesos/webui" --work_dir="/tmp/RCChkC/master" --zk_session_timeout="10secs"
3: I1114 01:44:29.227607 19965 master.cpp:499] Master only allowing authenticated frameworks to register
3: I1114 01:44:29.227613 19965 master.cpp:505] Master only allowing authenticated agents to register
3: I1114 01:44:29.227617 19965 master.cpp:511] Master only allowing authenticated HTTP frameworks to register
3: I1114 01:44:29.227622 19965 credentials.hpp:37] Loading credentials for authentication from '/tmp/RCChkC/credentials'
3: I1114 01:44:29.227864 19965 master.cpp:555] Using default 'crammd5' authenticator
3: I1114 01:44:29.228010 19965 http.cpp:1045] Creating default 'basic' HTTP authenticator for realm 'mesos-master-readonly'
3: I1114 01:44:29.228133 19965 http.cpp:1045] Creating default 'basic' HTTP authenticator for realm 'mesos-master-readwrite'
3: I1114 01:44:29.228265 19965 http.cpp:1045] Creating default 'basic' HTTP authenticator for realm 'mesos-master-scheduler'
3: I1114 01:44:29.228373 19965 master.cpp:634] Authorization enabled
3: I1114 01:44:29.228565 19943 whitelist_watcher.cpp:77] No whitelist given
3: I1114 01:44:29.228605 19963 hierarchical.cpp:171] Initialized hierarchical allocator process
3: I1114 01:44:29.231273 19950 master.cpp:2213] Elected as the leading master!
3: I1114 01:44:29.231303 19950 master.cpp:1693] Recovering from registrar
3: I1114 01:44:29.231457 19949 registrar.cpp:347] Recovering registrar
3: I1114 01:44:29.232230 19949 registrar.cpp:391] Successfully fetched the registry (0B) in 709888ns
3: I1114 01:44:29.232395 19949 registrar.cpp:495] Applied 1 operations in 51447ns; attempting to update the registry
3: I1114 01:44:29.233088 19949 registrar.cpp:552] Successfully updated the registry in 591104ns
3: I1114 01:44:29.233283 19949 registrar.cpp:424] Successfully recovered registrar
3: I1114 01:44:29.233772 19959 master.cpp:1806] Recovered 0 agents from the registry (129B); allowing 10mins for agents to re-register
3: I1114 01:44:29.233989 19956 hierarchical.cpp:209] Skipping recovery of hierarchical allocator: nothing to recover
3: W1114 01:44:29.240334 19941 process.cpp:3178] Attempted to spawn already running process files@172.17.0.9:41258
3: I1114 01:44:29.241632 19941 containerizer.cpp:301] Using isolation { environment_secret, posix/cpu, posix/mem, filesystem/posix, network/cni }
3: W1114 01:44:29.242388 19941 backend.cpp:76] Failed to create 'aufs' backend: AufsBackend requires root privileges
3: W1114 01:44:29.242560 19941 backend.cpp:76] Failed to create 'bind' backend: BindBackend requires root privileges
3: I1114 01:44:29.242610 19941 provisioner.cpp:255] Using default backend 'copy'
3: I1114 01:44:29.245019 19941 cluster.cpp:448] Creating default 'local' authorizer
3: I1114 01:44:29.247846 19943 slave.cpp:262] Mesos agent started on (751)@172.17.0.9:41258
3: I1114 01:44:29.247886 19943 slave.cpp:263] Flags at startup: --acls="" --agent_features="capabilities {
3: type: MULTI_ROLE
3: }
3: capabilities {
3: type: HIERARCHICAL_ROLE
3: }
3: capabilities {
3: type: RESERVATION_REFINEMENT
3: }
3: capabilities {
3: type: RESOURCE_PROVIDER
3: }
3: " --appc_simple_discovery_uri_prefix="http://" --appc_store_dir="/tmp/ContentType_ResourceProviderManagerHttpApiTest_ConvertResources_0_OgIcqR/store/appc" --authenticate_http_executors="true" --authenticate_http_readonly="true" --authenticate_http_readwrite="false" --authenticatee="crammd5" --authentication_backoff_factor="1secs" --authorizer="local" --cgroups_cpu_enable_pids_and_tids_count="false" --cgroups_enable_cfs="false" --cgroups_hierarchy="/sys/fs/cgroup" --cgroups_limit_swap="false" --cgroups_root="mesos" --container_disk_watch_interval="15secs" --containerizers="mesos" --credential="/tmp/ContentType_ResourceProviderManagerHttpApiTest_ConvertResources_0_OgIcqR/credential" --default_role="*" --disallow_sharing_agent_pid_namespace="false" --disk_watch_interval="1mins" --docker="docker" --docker_kill_orphans="true" --docker_registry="https://registry-1.docker.io" --docker_remove_delay="6hrs" --docker_socket="/var/run/docker.sock" --docker_stop_timeout="0ns" --docker_store_dir="/tmp/ContentType_ResourceProviderManagerHttpApiTest_ConvertResources_0_OgIcqR/store/docker" --docker_volume_checkpoint_dir="/var/run/mesos/isolators/docker/volume" --enforce_container_disk_quota="false" --executor_registration_timeout="1mins" --executor_reregistration_timeout="2secs" --executor_secret_key="/tmp/ContentType_ResourceProviderManagerHttpApiTest_ConvertResources_0_OgIcqR/executor_secret_key" --executor_shutdown_grace_period="5secs" --fetcher_cache_dir="/tmp/ContentType_ResourceProviderManagerHttpApiTest_ConvertResources_0_OgIcqR/fetch" --fetcher_cache_size="2GB" --frameworks_home="" --gc_delay="1weeks" --gc_disk_headroom="0.1" --hadoop_home="" --help="false" --hostname_lookup="true" --http_command_executor="false" --http_credentials="/tmp/ContentType_ResourceProviderManagerHttpApiTest_ConvertResources_0_OgIcqR/http_credentials" --http_heartbeat_interval="30secs" --initialize_driver_logging="true" --isolation="posix/cpu,posix/mem" --launcher="posix" --launcher_dir="/mesos/build/src" --logbufsecs="0" --logging_level="INFO" --max_completed_executors_per_framework="150" --oversubscribed_resources_interval="15secs" --perf_duration="10secs" --perf_interval="1mins" --port="5051" --qos_correction_interval_min="0ns" --quiet="false" --recover="reconnect" --recovery_timeout="15mins" --registration_backoff_factor="10ms" --resources="cpus:2;gpus:0;mem:1024;disk:1024;ports:[31000-32000]" --revocable_cpu_low_priority="true" --runtime_dir="/tmp/ContentType_ResourceProviderManagerHttpApiTest_ConvertResources_0_OgIcqR" --sandbox_directory="/mnt/mesos/sandbox" --strict="true" --switch_user="true" --systemd_enable_support="true" --systemd_runtime_directory="/run/systemd/system" --version="false" --work_dir="/tmp/ContentType_ResourceProviderManagerHttpApiTest_ConvertResources_0_HxfeSJ" --zk_session_timeout="10secs"
3: I1114 01:44:29.248690 19943 credentials.hpp:86] Loading credential for authentication from '/tmp/ContentType_ResourceProviderManagerHttpApiTest_ConvertResources_0_OgIcqR/credential'
3: I1114 01:44:29.248968 19943 slave.cpp:295] Agent using credential for: test-principal
3: I1114 01:44:29.249011 19943 credentials.hpp:37] Loading credentials for authentication from '/tmp/ContentType_ResourceProviderManagerHttpApiTest_ConvertResources_0_OgIcqR/http_credentials'
3: I1114 01:44:29.249377 19943 http.cpp:1045] Creating default 'basic' HTTP authenticator for realm 'mesos-agent-executor'
3: I1114 01:44:29.249511 19943 http.cpp:1066] Creating default 'jwt' HTTP authenticator for realm 'mesos-agent-executor'
3: I1114 01:44:29.249722 19943 http.cpp:1045] Creating default 'basic' HTTP authenticator for realm 'mesos-agent-readonly'
3: I1114 01:44:29.249830 19943 http.cpp:1066] Creating default 'jwt' HTTP authenticator for realm 'mesos-agent-readonly'
3: I1114 01:44:29.251304 19943 slave.cpp:593] Agent resources: [{"name":"cpus","scalar":{"value":2.0},"type":"SCALAR"},{"name":"mem","scalar":{"value":1024.0},"type":"SCALAR"},{"name":"disk","scalar":{"value":1024.0},"type":"SCALAR"},{"name":"ports","ranges":{"range":[{"begin":31000,"end":32000}]},"type":"RANGES"}]
3: I1114 01:44:29.251529 19943 slave.cpp:601] Agent attributes: [ ]
3: I1114 01:44:29.251543 19943 slave.cpp:610] Agent hostname: 105641e656fc
3: I1114 01:44:29.251667 19955 status_update_manager.cpp:177] Pausing sending status updates
3: I1114 01:44:29.253199 19951 state.cpp:64] Recovering state from '/tmp/ContentType_ResourceProviderManagerHttpApiTest_ConvertResources_0_HxfeSJ/meta'
3: I1114 01:44:29.253604 19959 status_update_manager.cpp:203] Recovering status update manager
3: I1114 01:44:29.253917 19954 containerizer.cpp:662] Recovering containerizer
3: I1114 01:44:29.255928 19946 provisioner.cpp:416] Provisioner recovery complete
3: I1114 01:44:29.256384 19961 slave.cpp:6432] Finished recovery
3: I1114 01:44:29.257439 19943 status_update_manager.cpp:177] Pausing sending status updates
3: I1114 01:44:29.257462 19957 slave.cpp:1007] New master detected at master@172.17.0.9:41258
3: I1114 01:44:29.257535 19957 slave.cpp:1042] Detecting new master
3: I1114 01:44:29.265980 19951 slave.cpp:1069] Authenticating with master master@172.17.0.9:41258
3: I1114 01:44:29.266113 19951 slave.cpp:1078] Using default CRAM-MD5 authenticatee
3: I1114 01:44:29.266520 19959 authenticatee.cpp:121] Creating new client SASL connection
3: I1114 01:44:29.266959 19953 master.cpp:8285] Authenticating slave(751)@172.17.0.9:41258
3: I1114 01:44:29.267091 19948 authenticator.cpp:414] Starting authentication session for crammd5-authenticatee(1385)@172.17.0.9:41258
3: I1114 01:44:29.267436 19963 authenticator.cpp:98] Creating new server SASL connection
3: I1114 01:44:29.267835 19958 authenticatee.cpp:213] Received SASL authentication mechanisms: CRAM-MD5
3: I1114 01:44:29.267877 19958 authenticatee.cpp:239] Attempting to authenticate with mechanism 'CRAM-MD5'
3: I1114 01:44:29.268076 19960 authenticator.cpp:204] Received SASL authentication start
3: I1114 01:44:29.268167 19960 authenticator.cpp:326] Authentication requires more steps
3: I1114 01:44:29.268296 19960 authenticatee.cpp:259] Received SASL authentication step
3: I1114 01:44:29.268540 19965 authenticator.cpp:232] Received SASL authentication step
3: I1114 01:44:29.268602 19965 auxprop.cpp:109] Request to lookup properties for user: 'test-principal' realm: '105641e656fc' server FQDN: '105641e656fc' SASL_AUXPROP_VERIFY_AGAINST_HASH: false SASL_AUXPROP_OVERRIDE: false SASL_AUXPROP_AUTHZID: false
3: I1114 01:44:29.268636 19965 auxprop.cpp:181] Looking up auxiliary property '*userPassword'
3: I1114 01:44:29.268667 19965 auxprop.cpp:181] Looking up auxiliary property '*cmusaslsecretCRAM-MD5'
3: I1114 01:44:29.268712 19965 auxprop.cpp:109] Request to lookup properties for user: 'test-principal' realm: '105641e656fc' server FQDN: '105641e656fc' SASL_AUXPROP_VERIFY_AGAINST_HASH: false SASL_AUXPROP_OVERRIDE: false SASL_AUXPROP_AUTHZID: true
3: I1114 01:44:29.268728 19965 auxprop.cpp:131] Skipping auxiliary property '*userPassword' since SASL_AUXPROP_AUTHZID == true
3: I1114 01:44:29.268748 19965 auxprop.cpp:131] Skipping auxiliary property '*cmusaslsecretCRAM-MD5' since SASL_AUXPROP_AUTHZID == true
3: I1114 01:44:29.268761 19965 authenticator.cpp:318] Authentication success
3: I1114 01:44:29.268929 19954 authenticatee.cpp:299] Authentication success
3: I1114 01:44:29.269009 19947 master.cpp:8315] Successfully authenticated principal 'test-principal' at slave(751)@172.17.0.9:41258
3: I1114 01:44:29.269068 19945 authenticator.cpp:432] Authentication session cleanup for crammd5-authenticatee(1385)@172.17.0.9:41258
3: I1114 01:44:29.269248 19950 slave.cpp:1161] Successfully authenticated with master master@172.17.0.9:41258
3: I1114 01:44:29.269469 19950 slave.cpp:1682] Will retry registration in 10.356269ms if necessary
3: I1114 01:44:29.269656 19961 master.cpp:6032] Received register agent message from slave(751)@172.17.0.9:41258 (105641e656fc)
3: I1114 01:44:29.269773 19961 master.cpp:3870] Authorizing agent with principal 'test-principal'
3: I1114 01:44:29.270182 19962 master.cpp:6092] Authorized registration of agent at slave(751)@172.17.0.9:41258 (105641e656fc)
3: I1114 01:44:29.270295 19962 master.cpp:6185] Registering agent at slave(751)@172.17.0.9:41258 (105641e656fc) with id d2a0bf50-f25a-4a49-b17c-b8cbcd228032-S0
3: I1114 01:44:29.270663 19943 registrar.cpp:495] Applied 1 operations in 52718ns; attempting to update the registry
3: I1114 01:44:29.271152 19943 registrar.cpp:552] Successfully updated the registry in 439808ns
3: I1114 01:44:29.271349 19959 master.cpp:6232] Admitted agent d2a0bf50-f25a-4a49-b17c-b8cbcd228032-S0 at slave(751)@172.17.0.9:41258 (105641e656fc)
3: I1114 01:44:29.272315 19948 slave.cpp:1207] Registered with master master@172.17.0.9:41258; given agent ID d2a0bf50-f25a-4a49-b17c-b8cbcd228032-S0
3: I1114 01:44:29.272114 19959 master.cpp:6263] Registered agent d2a0bf50-f25a-4a49-b17c-b8cbcd228032-S0 at slave(751)@172.17.0.9:41258 (105641e656fc) with [{"name":"cpus","scalar":{"value":2.0},"type":"SCALAR"},{"name":"mem","scalar":{"value":1024.0},"type":"SCALAR"},{"name":"disk","scalar":{"value":1024.0},"type":"SCALAR"},{"name":"ports","ranges":{"range":[{"begin":31000,"end":32000}]},"type":"RANGES"}]
3: I1114 01:44:29.272436 19944 status_update_manager.cpp:184] Resuming sending status updates
3: I1114 01:44:29.272531 19963 hierarchical.cpp:593] Added agent d2a0bf50-f25a-4a49-b17c-b8cbcd228032-S0 (105641e656fc) with cpus:2; mem:1024; disk:1024; ports:[31000-32000] (allocated: {})
3: I1114 01:44:29.272626 19948 slave.cpp:1227] Checkpointing SlaveInfo to '/tmp/ContentType_ResourceProviderManagerHttpApiTest_ConvertResources_0_HxfeSJ/meta/slaves/d2a0bf50-f25a-4a49-b17c-b8cbcd228032-S0/slave.info'
3: I1114 01:44:29.272837 19963 hierarchical.cpp:1450] Performed allocation for 1 agents in 141236ns
3: I1114 01:44:29.272992 19948 slave.cpp:1285] Forwarding total resources cpus:2; mem:1024; disk:1024; ports:[31000-32000]
3: I1114 01:44:29.273087 19948 slave.cpp:1295] Forwarding total oversubscribed resources {}
3: I1114 01:44:29.273730 19960 master.cpp:7051] Received update of agent d2a0bf50-f25a-4a49-b17c-b8cbcd228032-S0 at slave(751)@172.17.0.9:41258 (105641e656fc) with total resources cpus:2; mem:1024; disk:1024; ports:[31000-32000]
3: I1114 01:44:29.273790 19960 master.cpp:7064] Received update of agent d2a0bf50-f25a-4a49-b17c-b8cbcd228032-S0 at slave(751)@172.17.0.9:41258 (105641e656fc) with total oversubscribed resources {}
3: I1114 01:44:29.273982 19960 master.cpp:7082] Ignoring update on agent d2a0bf50-f25a-4a49-b17c-b8cbcd228032-S0 at slave(751)@172.17.0.9:41258 (105641e656fc) as it reports no changes
3: I1114 01:44:29.274179 19960 http_connection.hpp:221] New endpoint detected at http://172.17.0.9:41258/slave(751)/api/v1/resource_provider
3: I1114 01:44:29.276432 19956 http_connection.hpp:277] Connected with the remote endpoint at http://172.17.0.9:41258/slave(751)/api/v1/resource_provider
3: I1114 01:44:29.277712 19948 http_connection.hpp:129] Sending 1 call to http://172.17.0.9:41258/slave(751)/api/v1/resource_provider
3: I1114 01:44:29.279109 19946 process.cpp:3925] Handling HTTP event for process 'slave(751)' with path: '/slave(751)/api/v1/resource_provider'
3: I1114 01:44:29.280530 19949 http.cpp:1185] HTTP POST for /slave(751)/api/v1/resource_provider from 172.17.0.9:53012
3: I1114 01:44:29.280936 19962 manager.cpp:381] Subscribing resource provider {"name":"test","type":"org.apache.mesos.rp.test"}
3: I1114 01:44:29.284565 19960 http_connection.hpp:129] Sending 3 call to http://172.17.0.9:41258/slave(751)/api/v1/resource_provider
3: I1114 01:44:29.286666 19943 process.cpp:3925] Handling HTTP event for process 'slave(751)' with path: '/slave(751)/api/v1/resource_provider'
3: I1114 01:44:29.287875 19963 http.cpp:1185] HTTP POST for /slave(751)/api/v1/resource_provider from 172.17.0.9:53010
3: I1114 01:44:29.288434 19957 slave.cpp:6719] Handling resource provider message 'UPDATE_TOTAL_RESOURCES: 36898533-7448-456c-85e8-8e08ddc296d7 disk[RAW]:200'
3: I1114 01:44:29.288671 19957 slave.cpp:6764] Forwarding new total resources cpus:2; mem:1024; disk:1024; ports:[31000-32000]; disk[RAW]:200
3: I1114 01:44:29.289738 19948 master.cpp:7051] Received update of agent d2a0bf50-f25a-4a49-b17c-b8cbcd228032-S0 at slave(751)@172.17.0.9:41258 (105641e656fc) with total resources cpus:2; mem:1024; disk:1024; ports:[31000-32000]; disk[RAW]:200
3: I1114 01:44:29.291210 19941 scheduler.cpp:190] Version: 1.5.0
3: I1114 01:44:29.291218 19942 hierarchical.cpp:660] Agent d2a0bf50-f25a-4a49-b17c-b8cbcd228032-S0 (105641e656fc) updated with total resources cpus:2; mem:1024; disk:1024; ports:[31000-32000]; disk[RAW]:200
3: I1114 01:44:29.291487 19960 scheduler.cpp:313] Using default 'basic' HTTP authenticatee
3: I1114 01:44:29.291502 19942 hierarchical.cpp:1450] Performed allocation for 1 agents in 136110ns
3: I1114 01:44:29.292016 19959 scheduler.cpp:496] New master detected at master@172.17.0.9:41258
3: I1114 01:44:29.292122 19959 scheduler.cpp:505] Waiting for 0ns before initiating a re-(connection) attempt with the master
3: I1114 01:44:29.293927 19956 scheduler.cpp:387] Connected with the master at http://172.17.0.9:41258/master/api/v1/scheduler
3: I1114 01:44:29.295339 19949 scheduler.cpp:249] Sending SUBSCRIBE call to http://172.17.0.9:41258/master/api/v1/scheduler
3: I1114 01:44:29.297857 19959 process.cpp:3925] Handling HTTP event for process 'master' with path: '/master/api/v1/scheduler'
3: I1114 01:44:29.299445 19955 http.cpp:1185] HTTP POST for /master/api/v1/scheduler from 172.17.0.9:53016
3: I1114 01:44:29.299685 19955 master.cpp:2613] Received subscription request for HTTP framework 'default'
3: I1114 01:44:29.299800 19955 master.cpp:2278] Authorizing framework principal 'test-principal' to receive offers for roles '{ * }'
3: I1114 01:44:29.300338 19947 master.cpp:2748] Subscribing framework 'default' with checkpointing disabled and capabilities [ RESERVATION_REFINEMENT ]
3: I1114 01:44:29.301280 19954 hierarchical.cpp:303] Added framework d2a0bf50-f25a-4a49-b17c-b8cbcd228032-0000
3: I1114 01:44:29.301973 19953 scheduler.cpp:741] Enqueuing event SUBSCRIBED received from http://172.17.0.9:41258/master/api/v1/scheduler
3: I1114 01:44:29.302489 19953 scheduler.cpp:741] Enqueuing event HEARTBEAT received from http://172.17.0.9:41258/master/api/v1/scheduler
3: I1114 01:44:29.302845 19954 hierarchical.cpp:1450] Performed allocation for 1 agents in 1.42472ms
3: I1114 01:44:29.303576 19952 master.cpp:8115] Sending 1 offers to framework d2a0bf50-f25a-4a49-b17c-b8cbcd228032-0000 (default)
3: I1114 01:44:29.306180 19960 scheduler.cpp:741] Enqueuing event OFFERS received from http://172.17.0.9:41258/master/api/v1/scheduler
3: I1114 01:44:29.308259 19965 scheduler.cpp:249] Sending ACCEPT call to http://172.17.0.9:41258/master/api/v1/scheduler
3: I1114 01:44:29.309893 19942 process.cpp:3925] Handling HTTP event for process 'master' with path: '/master/api/v1/scheduler'
3: I1114 01:44:29.311262 19945 http.cpp:1185] HTTP POST for /master/api/v1/scheduler from 172.17.0.9:53014
3: I1114 01:44:29.313117 19945 master.cpp:10017] Removing offer d2a0bf50-f25a-4a49-b17c-b8cbcd228032-O0
3: I1114 01:44:29.313302 19945 master.cpp:4228] Processing ACCEPT call for offers: [ d2a0bf50-f25a-4a49-b17c-b8cbcd228032-O0 ] on agent d2a0bf50-f25a-4a49-b17c-b8cbcd228032-S0 at slave(751)@172.17.0.9:41258 (105641e656fc) for framework d2a0bf50-f25a-4a49-b17c-b8cbcd228032-0000 (default)
3: I1114 01:44:29.314383 19945 master.cpp:5293] Processing CREATE_BLOCK operation with source disk(allocated: *)[RAW]:200 from framework d2a0bf50-f25a-4a49-b17c-b8cbcd228032-0000 (default) to agent d2a0bf50-f25a-4a49-b17c-b8cbcd228032-S0 at slave(751)@172.17.0.9:41258 (105641e656fc)
3: I1114 01:44:29.315264 19945 master.cpp:9900] Sending offer operation AO´äAú½bæ£rA to agent d2a0bf50-f25a-4a49-b17c-b8cbcd228032-S0 at slave(751)@172.17.0.9:41258 (105641e656fc)
3: I1114 01:44:29.316747 19943 hierarchical.cpp:1125] Recovered cpus(allocated: *):2; mem(allocated: *):1024; disk(allocated: *):1024; ports(allocated: *):[31000-32000] (total: cpus:2; mem:1024; disk:1024; ports:[31000-32000]; disk[RAW]:200, allocated: disk(allocated: *)[RAW]:200) on agent d2a0bf50-f25a-4a49-b17c-b8cbcd228032-S0 from framework d2a0bf50-f25a-4a49-b17c-b8cbcd228032-0000
3: I1114 01:44:29.316819 19943 hierarchical.cpp:1171] Framework d2a0bf50-f25a-4a49-b17c-b8cbcd228032-0000 filtered agent d2a0bf50-f25a-4a49-b17c-b8cbcd228032-S0 for 5secs
3: I1114 01:44:29.319196 19956 http_connection.hpp:129] Sending 2 call to http://172.17.0.9:41258/slave(751)/api/v1/resource_provider
3: I1114 01:44:29.320287 19947 process.cpp:3925] Handling HTTP event for process 'slave(751)' with path: '/slave(751)/api/v1/resource_provider'
3: I1114 01:44:29.358463 19945 http.cpp:1185] HTTP POST for /slave(751)/api/v1/resource_provider from 172.17.0.9:53010
3: I1114 01:44:29.359478 19964 slave.cpp:6719] Handling resource provider message 'UPDATE_OFFER_OPERATION_STATUS: {"framework_id":{"value":"d2a0bf50-f25a-4a49-b17c-b8cbcd228032-0000"},"status":{"state":"OFFER_OPERATION_FINISHED","converted_resources":[{"provider_id":{"value":"36898533-7448-456c-85e8-8e08ddc296d7"},"name":"disk","type":"SCALAR","scalar":{"value":200.0},"allocation_info":{"role":"*"},"disk":{"source":{"type":"BLOCK"}}}]},"latest_status":{"state":"OFFER_OPERATION_FINISHED","converted_resources":[{"provider_id":{"value":"36898533-7448-456c-85e8-8e08ddc296d7"},"name":"disk","type":"SCALAR","scalar":{"value":200.0},"allocation_info":{"role":"*"},"disk":{"source":{"type":"BLOCK"}}}]},"operation_uuid":"QRtPBLTkQfqTvWLmo3JBFw=="}'
3: I1114 01:44:29.359866 19964 slave.cpp:6893] Updating the state of offer operation '' (uuid: AO´äAú½bæ£rA) of framework d2a0bf50-f25a-4a49-b17c-b8cbcd228032-0000 (latest state: OFFER_OPERATION_FINISHED, status update state: OFFER_OPERATION_FINISHED)
3: I1114 01:44:29.360292 19964 slave.cpp:6817] Forwarding status update of offer operation '' (uuid: 411b4f04-b4e4-41fa-93bd-62e6a3724117) for framework d2a0bf50-f25a-4a49-b17c-b8cbcd228032-0000
3: I1114 01:44:29.360893 19957 master.cpp:9698] Updating the state of offer operation '' (uuid: 411b4f04-b4e4-41fa-93bd-62e6a3724117) of framework d2a0bf50-f25a-4a49-b17c-b8cbcd228032-0000 (latest state: OFFER_OPERATION_FINISHED, status update state: OFFER_OPERATION_FINISHED)
3: F1114 01:44:29.361497 19957 master.cpp:11027] CHECK_SOME(resources): cpus:2; mem:1024; disk:1024; ports:[31000-32000]; disk[RAW]:200 does not contain disk(allocated: *)[RAW]:200
3: *** Check failure stack trace: ***
3: @ 0x2b783de3e9fd google::LogMessage::Fail()
3: @ 0x2b783de4089d google::LogMessage::SendToLog()
3: @ 0x2b783de3e5ec google::LogMessage::Flush()
3: @ 0x2b783de411be google::LogMessageFatal::~LogMessageFatal()
3: I1114 01:44:29.363132 19965 hierarchical.cpp:849] Updated allocation of framework d2a0bf50-f25a-4a49-b17c-b8cbcd228032-0000 on agent d2a0bf50-f25a-4a49-b17c-b8cbcd228032-S0 from disk(allocated: *)[RAW]:200 to disk(allocated: *)[BLOCK]:200
3: I1114 01:44:29.363553 19965 hierarchical.cpp:1125] Recovered disk(allocated: *)[BLOCK]:200 (total: cpus:2; mem:1024; disk:1024; ports:[31000-32000]; disk[BLOCK]:200, allocated: {}) on agent d2a0bf50-f25a-4a49-b17c-b8cbcd228032-S0 from framework d2a0bf50-f25a-4a49-b17c-b8cbcd228032-0000
3: @ 0xc98678 _CheckFatal::~_CheckFatal()
3: I1114 01:44:29.372593 19944 hierarchical.cpp:1450] Performed allocation for 1 agents in 1.396364ms
3: @ 0x2b783b1a33d1 mesos::internal::master::Slave::apply()
3: @ 0x2b783b199394 mesos::internal::master::Master::updateOfferOperation()
3: @ 0x2b783b1843a7 mesos::internal::master::Master::offerOperationStatusUpdate()
3: @ 0x2b783b1e8b45 ProtobufProcess<>::_handlerM<>()
3: @ 0x2b783b2a2b0f _ZNSt5_BindIFPFvPN5mesos8internal6master6MasterEMS3_FvRKNS1_26OfferOperationStatusUpdateEERKN7process4UPIDERKSsES4_S9_St12_PlaceholderILi1EESI_ILi2EEEE6__callIvJSD_SF_EJLm0ELm1ELm2ELm3EEEET_OSt5tupleIJDpT0_EESt12_Index_tupleIJXspT1_EEE
3: @ 0x2b783b280d46 _ZNSt5_BindIFPFvPN5mesos8internal6master6MasterEMS3_FvRKNS1_26OfferOperationStatusUpdateEERKN7process4UPIDERKSsES4_S9_St12_PlaceholderILi1EESI_ILi2EEEEclIJSD_SF_EvEET0_DpOT_
3: @ 0x2b783b255c82 std::_Function_handler<>::_M_invoke()
3: @ 0xe84ae3 std::function<>::operator()()
3: @ 0x2b783b1ca11c ProtobufProcess<>::visit()
3: @ 0x2b783b15a1c0 mesos::internal::master::Master::_visit()
3: @ 0x2b783b1598d2 mesos::internal::master::Master::visit()
3: @ 0x2b783b1aef68 process::MessageEvent::visit()
3: @ 0xcb24d2 process::ProcessBase::serve()
3: @ 0x2b783d885c7d process::ProcessManager::resume()
3: @ 0x2b783d8820dc _ZZN7process14ProcessManager12init_threadsEvENKUlvE_clEv
3: @ 0x2b783d894404 _ZNSt12_Bind_simpleIFZN7process14ProcessManager12init_threadsEvEUlvE_vEE9_M_invokeIIEEEvSt12_Index_tupleIIXspT_EEE
3: @ 0x2b783d89435b _ZNSt12_Bind_simpleIFZN7process14ProcessManager12init_threadsEvEUlvE_vEEclEv
3: @ 0x2b783d8942f4 _ZNSt6thread5_ImplISt12_Bind_simpleIFZN7process14ProcessManager12init_threadsEvEUlvE_vEEE6_M_runEv
3: @ 0x2b7840874a60 (unknown)
3: @ 0x2b783e06a184 start_thread
3: @ 0x2b78410e0ffd (unknown)
3/3 Test #3: MesosTests .......................***Exception: Other325.28 sec
67% tests passed, 1 tests failed out of 3
Total Test time (real) = 366.22 sec
The following tests FAILED:
3 - MesosTests (OTHER_FAULT)
Errors while running CTest
make[3]: *** [CMakeFiles/check] Error 8
make[3]: Leaving directory `/mesos/build'
make[2]: *** [CMakeFiles/check.dir/all] Error 2
make[2]: Leaving directory `/mesos/build'
make[1]: *** [CMakeFiles/check.dir/rule] Error 2
make[1]: Leaving directory `/mesos/build'
make: *** [check] Error 2
+ docker rmi mesos-1510621681-1530
Untagged: mesos-1510621681-1530:latest
Deleted: sha256:e46622552a4c320f34727e4670c1e2996031d019d6565cb04c7101b5765f2bba
Deleted: sha256:5a522119017b515c5b0487d95b53ab2a20f96a293ddbd6182cb2f26968bf4b38
Deleted: sha256:85cc93a70ee8dc051cb2afff55904f077cdc6453f702050a89fdd9ef90d41df4
Deleted: sha256:59d061dc190dc0226b74a4cbe1f7227177f358e34fe07c9dfbcaf2d547525418
Deleted: sha256:6fd6d33b015dabf7aa6951060b372bd3811022ff10966ef3f36bab840d73aa72
Deleted: sha256:b07715b497da147f122fcffd2418688b8e9a13a5b091863d87e4684c2971a55a
Deleted: sha256:391ed38bb3299ecbaf4882c3abd5489199dbf57b89d91e2f1700c5bebdd509a1
Deleted: sha256:58211cad13c985e062c8dfd0b1be345aa4f76ff486059e2b318f5cdb56db39ed
Deleted: sha256:a99242f470a25bbc8b4599001180dfb6705273571106e31aa524553dbe08893d
Deleted: sha256:bacddc90fa1996b8b74865b77d1c9aa6db18fbcf3a655f0e1e744ba37ed2077b
Deleted: sha256:de7e09ba9357571b22a0fc7eb106fa52876e998283bc710ca0b6a86509cb6612
Deleted: sha256:b33545830d8ea731c7a3e222ec4432965eaa73a70d39a170db8abfb892a0af95
Deleted: sha256:865a053b3caa897dbbe3ca394d8b4068674c8836d6074bb93df1e29bfbcd595a
Deleted: sha256:a2d5ef98dbdcbcbbf1d6ea24132931c5956e1a3d18dc4c691516ebe6ea114959
Deleted: sha256:579b7c97f0b66084c113a7355c4d2a75000111aedbb23ea7d0e0319c0fc5cee2
Deleted: sha256:fe9b3135fab8c787564f1f269ffb8848850b266baf5cb1f1e0b467a346de339b
Deleted: sha256:ed5a46335bc2c9f48358bd7fe8dae0eeaf6d123f89537fcd74bcd56014897884
Deleted: sha256:6540cc66a7764b0aac5fe5c81a2a7c9297624e21a969356622cc47645eb23311
Deleted: sha256:5c04b9e491f4ecedc48ccc8a16fc104c9a96fd072bd0a21e99beba72bb16dcba
Deleted: sha256:7ba59fd62106d5a02509ac56160a08f18b8c0e8610d9054bf21c05cf132255c9
Deleted: sha256:d7684a119d9b3d316adb2e4ac7afca20b781b96becf89df9ee5d15acc5dd8c29
Deleted: sha256:87810b397b67785e4f881b434d5ce0424d81a63bf19194ef2d832ab1b336602c
Deleted: sha256:bf276be643fd182f8e0d4bebb41028c4a776b0aff12399bb400ff5e77d2ee541
Deleted: sha256:34e78a32b74d094ce0dacff377082eb7322f4d4cc4d0bbdc3e1ac9fdc3667e56
Deleted: sha256:f384025145cb114181ea904996419556eebce8377e1219b238425b12cae3aaaa
Deleted: sha256:c5b5083bc1d4570ecef82453cd636685e76313301029dd2361829369c519d7a8
Deleted: sha256:44afcb09a799c16be6ee8da26e77ebccdfb10c75a41e86efefa8f54c19f0daa4
Deleted: sha256:5f532cb55eef43cb15c31cac08ee2bdcad5e110bf4c7f23386f9ecde52293b74
Deleted: sha256:928503fabaf5723f2de953e2685d4027cd97858012e6bbe8b09a53ac2938355e
Deleted: sha256:614ac9b4938297b33caa7ae01ef4da4e97ab47ef72d575c415abdc86ea0481f4
Build step 'Execute shell' marked build as failure
Not sending mail to unregistered user songzihao1990@gmail.com
Not sending mail to unregistered user yujie.jay@gmail.com