You are viewing a plain text version of this content. The canonical link for it is here.
Posted to dev@kafka.apache.org by Apache Jenkins Server <je...@builds.apache.org> on 2021/06/28 20:53:24 UTC
Build failed in Jenkins: Kafka » Kafka Branch Builder » trunk #257
See <https://ci-builds.apache.org/job/Kafka/job/kafka/job/trunk/257/display/redirect>
Changes:
------------------------------------------
[...truncated 475662 lines...]
[2021-06-28T19:53:46.208Z]
[2021-06-28T19:53:46.208Z] PlaintextConsumerTest > testPerPartitionLeadMetricsCleanUpWithAssign() PASSED
[2021-06-28T19:53:46.208Z]
[2021-06-28T19:53:46.208Z] PlaintextConsumerTest > testConsumeMessagesWithCreateTime() STARTED
[2021-06-28T19:53:52.559Z]
[2021-06-28T19:53:52.559Z] PlaintextConsumerTest > testConsumeMessagesWithCreateTime() PASSED
[2021-06-28T19:53:52.559Z]
[2021-06-28T19:53:52.559Z] PlaintextConsumerTest > testAsyncCommit() STARTED
[2021-06-28T19:53:58.308Z]
[2021-06-28T19:53:58.308Z] PlaintextConsumerTest > testAsyncCommit() PASSED
[2021-06-28T19:53:58.308Z]
[2021-06-28T19:53:58.308Z] PlaintextConsumerTest > testLowMaxFetchSizeForRequestAndPartition() STARTED
[2021-06-28T19:55:09.400Z]
[2021-06-28T19:55:09.400Z] PlaintextConsumerTest > testLowMaxFetchSizeForRequestAndPartition() PASSED
[2021-06-28T19:55:09.400Z]
[2021-06-28T19:55:09.400Z] PlaintextConsumerTest > testMultiConsumerSessionTimeoutOnStopPolling() STARTED
[2021-06-28T19:55:26.482Z]
[2021-06-28T19:55:26.482Z] PlaintextConsumerTest > testMultiConsumerSessionTimeoutOnStopPolling() PASSED
[2021-06-28T19:55:26.482Z]
[2021-06-28T19:55:26.482Z] PlaintextConsumerTest > testMaxPollIntervalMsDelayInRevocation() STARTED
[2021-06-28T19:55:33.559Z]
[2021-06-28T19:55:33.559Z] PlaintextConsumerTest > testMaxPollIntervalMsDelayInRevocation() PASSED
[2021-06-28T19:55:33.559Z]
[2021-06-28T19:55:33.559Z] PlaintextConsumerTest > testPerPartitionLagMetricsCleanUpWithAssign() STARTED
[2021-06-28T19:55:40.294Z]
[2021-06-28T19:55:40.294Z] PlaintextConsumerTest > testPerPartitionLagMetricsCleanUpWithAssign() PASSED
[2021-06-28T19:55:40.294Z]
[2021-06-28T19:55:40.294Z] PlaintextConsumerTest > testPartitionsForInvalidTopic() STARTED
[2021-06-28T19:55:45.041Z]
[2021-06-28T19:55:45.041Z] PlaintextConsumerTest > testPartitionsForInvalidTopic() PASSED
[2021-06-28T19:55:45.041Z]
[2021-06-28T19:55:45.041Z] PlaintextConsumerTest > testMultiConsumerStickyAssignment() STARTED
[2021-06-28T19:56:14.850Z]
[2021-06-28T19:56:14.850Z] PlaintextConsumerTest > testMultiConsumerStickyAssignment() PASSED
[2021-06-28T19:56:14.850Z]
[2021-06-28T19:56:14.850Z] PlaintextConsumerTest > testPauseStateNotPreservedByRebalance() STARTED
[2021-06-28T19:56:20.236Z]
[2021-06-28T19:56:20.236Z] PlaintextConsumerTest > testPauseStateNotPreservedByRebalance() PASSED
[2021-06-28T19:56:20.236Z]
[2021-06-28T19:56:20.236Z] PlaintextConsumerTest > testFetchHonoursFetchSizeIfLargeRecordNotFirst() STARTED
[2021-06-28T19:56:27.309Z]
[2021-06-28T19:56:27.309Z] PlaintextConsumerTest > testFetchHonoursFetchSizeIfLargeRecordNotFirst() PASSED
[2021-06-28T19:56:27.309Z]
[2021-06-28T19:56:27.309Z] PlaintextConsumerTest > testSeek() STARTED
[2021-06-28T19:56:35.557Z]
[2021-06-28T19:56:35.557Z] PlaintextConsumerTest > testSeek() PASSED
[2021-06-28T19:56:35.557Z]
[2021-06-28T19:56:35.557Z] PlaintextConsumerTest > testConsumingWithNullGroupId() STARTED
[2021-06-28T19:56:45.955Z]
[2021-06-28T19:56:45.955Z] PlaintextConsumerTest > testConsumingWithNullGroupId() PASSED
[2021-06-28T19:56:45.955Z]
[2021-06-28T19:56:45.955Z] PlaintextConsumerTest > testPositionAndCommit() STARTED
[2021-06-28T19:56:51.412Z]
[2021-06-28T19:56:51.412Z] PlaintextConsumerTest > testPositionAndCommit() PASSED
[2021-06-28T19:56:51.412Z]
[2021-06-28T19:56:51.412Z] PlaintextConsumerTest > testFetchRecordLargerThanMaxPartitionFetchBytes() STARTED
[2021-06-28T19:56:57.043Z]
[2021-06-28T19:56:57.043Z] PlaintextConsumerTest > testFetchRecordLargerThanMaxPartitionFetchBytes() PASSED
[2021-06-28T19:56:57.043Z]
[2021-06-28T19:56:57.043Z] PlaintextConsumerTest > testUnsubscribeTopic() STARTED
[2021-06-28T19:57:02.450Z]
[2021-06-28T19:57:02.450Z] PlaintextConsumerTest > testUnsubscribeTopic() PASSED
[2021-06-28T19:57:02.450Z]
[2021-06-28T19:57:02.450Z] PlaintextConsumerTest > testMultiConsumerSessionTimeoutOnClose() STARTED
[2021-06-28T19:57:14.925Z]
[2021-06-28T19:57:14.925Z] PlaintextConsumerTest > testMultiConsumerSessionTimeoutOnClose() PASSED
[2021-06-28T19:57:14.925Z]
[2021-06-28T19:57:14.925Z] PlaintextConsumerTest > testFetchRecordLargerThanFetchMaxBytes() STARTED
[2021-06-28T19:57:18.482Z]
[2021-06-28T19:57:18.482Z] PlaintextConsumerTest > testFetchRecordLargerThanFetchMaxBytes() PASSED
[2021-06-28T19:57:18.482Z]
[2021-06-28T19:57:18.482Z] PlaintextConsumerTest > testMultiConsumerDefaultAssignment() STARTED
[2021-06-28T19:57:35.458Z]
[2021-06-28T19:57:35.458Z] PlaintextConsumerTest > testMultiConsumerDefaultAssignment() PASSED
[2021-06-28T19:57:35.458Z]
[2021-06-28T19:57:35.458Z] PlaintextConsumerTest > testAutoCommitOnClose() STARTED
[2021-06-28T19:57:41.487Z]
[2021-06-28T19:57:41.487Z] PlaintextConsumerTest > testAutoCommitOnClose() PASSED
[2021-06-28T19:57:41.487Z]
[2021-06-28T19:57:41.487Z] PlaintextConsumerTest > testListTopics() STARTED
[2021-06-28T19:57:47.624Z]
[2021-06-28T19:57:47.624Z] PlaintextConsumerTest > testListTopics() PASSED
[2021-06-28T19:57:47.624Z]
[2021-06-28T19:57:47.624Z] PlaintextConsumerTest > testExpandingTopicSubscriptions() STARTED
[2021-06-28T19:57:52.321Z]
[2021-06-28T19:57:52.321Z] PlaintextConsumerTest > testExpandingTopicSubscriptions() PASSED
[2021-06-28T19:57:52.321Z]
[2021-06-28T19:57:52.321Z] PlaintextConsumerTest > testInterceptors() STARTED
[2021-06-28T19:57:59.489Z]
[2021-06-28T19:57:59.489Z] PlaintextConsumerTest > testInterceptors() PASSED
[2021-06-28T19:57:59.489Z]
[2021-06-28T19:57:59.489Z] PlaintextConsumerTest > testConsumingWithEmptyGroupId() STARTED
[2021-06-28T19:58:04.257Z]
[2021-06-28T19:58:04.257Z] PlaintextConsumerTest > testConsumingWithEmptyGroupId() PASSED
[2021-06-28T19:58:04.257Z]
[2021-06-28T19:58:04.257Z] PlaintextConsumerTest > testPatternUnsubscription() STARTED
[2021-06-28T19:58:11.923Z]
[2021-06-28T19:58:11.923Z] PlaintextConsumerTest > testPatternUnsubscription() PASSED
[2021-06-28T19:58:11.923Z]
[2021-06-28T19:58:11.923Z] PlaintextConsumerTest > testGroupConsumption() STARTED
[2021-06-28T19:58:18.344Z]
[2021-06-28T19:58:18.344Z] PlaintextConsumerTest > testGroupConsumption() PASSED
[2021-06-28T19:58:18.344Z]
[2021-06-28T19:58:18.344Z] PlaintextConsumerTest > testPartitionsFor() STARTED
[2021-06-28T19:58:22.770Z]
[2021-06-28T19:58:22.770Z] PlaintextConsumerTest > testPartitionsFor() PASSED
[2021-06-28T19:58:22.771Z]
[2021-06-28T19:58:22.771Z] PlaintextConsumerTest > testAutoCommitOnRebalance() STARTED
[2021-06-28T19:58:33.556Z]
[2021-06-28T19:58:33.556Z] PlaintextConsumerTest > testAutoCommitOnRebalance() PASSED
[2021-06-28T19:58:33.556Z]
[2021-06-28T19:58:33.556Z] PlaintextConsumerTest > testInterceptorsWithWrongKeyValue() STARTED
[2021-06-28T19:58:38.272Z]
[2021-06-28T19:58:38.272Z] PlaintextConsumerTest > testInterceptorsWithWrongKeyValue() PASSED
[2021-06-28T19:58:38.272Z]
[2021-06-28T19:58:38.272Z] PlaintextConsumerTest > testPerPartitionLeadWithMaxPollRecords() STARTED
[2021-06-28T19:58:44.044Z]
[2021-06-28T19:58:44.044Z] PlaintextConsumerTest > testPerPartitionLeadWithMaxPollRecords() PASSED
[2021-06-28T19:58:44.044Z]
[2021-06-28T19:58:44.044Z] PlaintextConsumerTest > testHeaders() STARTED
[2021-06-28T19:58:47.786Z]
[2021-06-28T19:58:47.786Z] PlaintextConsumerTest > testHeaders() PASSED
[2021-06-28T19:58:47.786Z]
[2021-06-28T19:58:47.786Z] PlaintextConsumerTest > testMaxPollIntervalMsDelayInAssignment() STARTED
[2021-06-28T19:58:55.938Z]
[2021-06-28T19:58:55.938Z] PlaintextConsumerTest > testMaxPollIntervalMsDelayInAssignment() PASSED
[2021-06-28T19:58:55.938Z]
[2021-06-28T19:58:55.938Z] PlaintextConsumerTest > testHeadersSerializerDeserializer() STARTED
[2021-06-28T19:59:01.792Z]
[2021-06-28T19:59:01.792Z] PlaintextConsumerTest > testHeadersSerializerDeserializer() PASSED
[2021-06-28T19:59:01.792Z]
[2021-06-28T19:59:01.792Z] PlaintextConsumerTest > testDeprecatedPollBlocksForAssignment() STARTED
[2021-06-28T19:59:06.033Z]
[2021-06-28T19:59:06.033Z] PlaintextConsumerTest > testDeprecatedPollBlocksForAssignment() PASSED
[2021-06-28T19:59:06.033Z]
[2021-06-28T19:59:06.033Z] PlaintextConsumerTest > testMultiConsumerRoundRobinAssignment() STARTED
[2021-06-28T19:59:20.743Z]
[2021-06-28T19:59:20.743Z] PlaintextConsumerTest > testMultiConsumerRoundRobinAssignment() PASSED
[2021-06-28T19:59:20.743Z]
[2021-06-28T19:59:20.743Z] PlaintextConsumerTest > testPartitionPauseAndResume() STARTED
[2021-06-28T19:59:27.770Z]
[2021-06-28T19:59:27.770Z] PlaintextConsumerTest > testPartitionPauseAndResume() PASSED
[2021-06-28T19:59:27.770Z]
[2021-06-28T19:59:27.770Z] PlaintextConsumerTest > testQuotaMetricsNotCreatedIfNoQuotasConfigured() STARTED
[2021-06-28T19:59:33.364Z]
[2021-06-28T19:59:33.364Z] PlaintextConsumerTest > testQuotaMetricsNotCreatedIfNoQuotasConfigured() PASSED
[2021-06-28T19:59:33.364Z]
[2021-06-28T19:59:33.364Z] PlaintextConsumerTest > testPerPartitionLagMetricsCleanUpWithSubscribe() STARTED
[2021-06-28T19:59:37.021Z]
[2021-06-28T19:59:37.021Z] PlaintextConsumerTest > testPerPartitionLagMetricsCleanUpWithSubscribe() PASSED
[2021-06-28T19:59:37.021Z]
[2021-06-28T19:59:37.021Z] PlaintextConsumerTest > testConsumeMessagesWithLogAppendTime() STARTED
[2021-06-28T19:59:43.301Z]
[2021-06-28T19:59:43.301Z] PlaintextConsumerTest > testConsumeMessagesWithLogAppendTime() PASSED
[2021-06-28T19:59:43.301Z]
[2021-06-28T19:59:43.301Z] PlaintextConsumerTest > testPerPartitionLagMetricsWhenReadCommitted() STARTED
[2021-06-28T19:59:48.479Z]
[2021-06-28T19:59:48.479Z] PlaintextConsumerTest > testPerPartitionLagMetricsWhenReadCommitted() PASSED
[2021-06-28T19:59:48.479Z]
[2021-06-28T19:59:48.479Z] PlaintextConsumerTest > testAutoCommitOnCloseAfterWakeup() STARTED
[2021-06-28T19:59:54.218Z]
[2021-06-28T19:59:54.219Z] PlaintextConsumerTest > testAutoCommitOnCloseAfterWakeup() PASSED
[2021-06-28T19:59:54.219Z]
[2021-06-28T19:59:54.219Z] PlaintextConsumerTest > testMaxPollRecords() STARTED
[2021-06-28T19:59:58.452Z]
[2021-06-28T19:59:58.452Z] PlaintextConsumerTest > testMaxPollRecords() PASSED
[2021-06-28T19:59:58.452Z]
[2021-06-28T19:59:58.452Z] PlaintextConsumerTest > testAutoOffsetReset() STARTED
[2021-06-28T20:00:03.999Z]
[2021-06-28T20:00:03.999Z] PlaintextConsumerTest > testAutoOffsetReset() PASSED
[2021-06-28T20:00:03.999Z]
[2021-06-28T20:00:03.999Z] PlaintextConsumerTest > testPerPartitionLagWithMaxPollRecords() STARTED
[2021-06-28T20:00:09.833Z]
[2021-06-28T20:00:09.833Z] PlaintextConsumerTest > testPerPartitionLagWithMaxPollRecords() PASSED
[2021-06-28T20:00:09.833Z]
[2021-06-28T20:00:09.833Z] PlaintextConsumerTest > testFetchInvalidOffset() STARTED
[2021-06-28T20:00:17.652Z]
[2021-06-28T20:00:17.652Z] PlaintextConsumerTest > testFetchInvalidOffset() PASSED
[2021-06-28T20:00:17.652Z]
[2021-06-28T20:00:17.652Z] PlaintextConsumerTest > testAutoCommitIntercept() STARTED
[2021-06-28T20:00:23.373Z]
[2021-06-28T20:00:23.373Z] PlaintextConsumerTest > testAutoCommitIntercept() PASSED
[2021-06-28T20:00:23.373Z]
[2021-06-28T20:00:23.373Z] PlaintextConsumerTest > testFetchHonoursMaxPartitionFetchBytesIfLargeRecordNotFirst() STARTED
[2021-06-28T20:00:30.446Z]
[2021-06-28T20:00:30.446Z] PlaintextConsumerTest > testFetchHonoursMaxPartitionFetchBytesIfLargeRecordNotFirst() PASSED
[2021-06-28T20:00:30.446Z]
[2021-06-28T20:00:30.446Z] PlaintextConsumerTest > testCommitSpecifiedOffsets() STARTED
[2021-06-28T20:00:36.221Z]
[2021-06-28T20:00:36.221Z] PlaintextConsumerTest > testCommitSpecifiedOffsets() PASSED
[2021-06-28T20:00:36.221Z]
[2021-06-28T20:00:36.221Z] PlaintextConsumerTest > testPerPartitionLeadMetricsCleanUpWithSubscribe() STARTED
[2021-06-28T20:00:42.822Z]
[2021-06-28T20:00:42.822Z] PlaintextConsumerTest > testPerPartitionLeadMetricsCleanUpWithSubscribe() PASSED
[2021-06-28T20:00:42.822Z]
[2021-06-28T20:00:42.822Z] PlaintextConsumerTest > testCommitMetadata() STARTED
[2021-06-28T20:00:48.437Z]
[2021-06-28T20:00:48.437Z] PlaintextConsumerTest > testCommitMetadata() PASSED
[2021-06-28T20:00:48.437Z]
[2021-06-28T20:00:48.437Z] PlaintextConsumerTest > testRoundRobinAssignment() STARTED
[2021-06-28T20:00:58.897Z]
[2021-06-28T20:00:58.897Z] PlaintextConsumerTest > testRoundRobinAssignment() PASSED
[2021-06-28T20:00:58.897Z]
[2021-06-28T20:00:58.897Z] PlaintextConsumerTest > testPatternSubscription() STARTED
[2021-06-28T20:01:13.035Z]
[2021-06-28T20:01:13.035Z] PlaintextConsumerTest > testPatternSubscription() PASSED
[2021-06-28T20:01:15.384Z]
[2021-06-28T20:01:15.384Z] Deprecated Gradle features were used in this build, making it incompatible with Gradle 8.0.
[2021-06-28T20:01:15.384Z] Use '--warning-mode all' to show the individual deprecation warnings.
[2021-06-28T20:01:15.384Z] See https://docs.gradle.org/7.0.2/userguide/command_line_interface.html#sec:command_line_warnings
[2021-06-28T20:01:15.384Z]
[2021-06-28T20:01:15.384Z] BUILD SUCCESSFUL in 2h 30m 57s
[2021-06-28T20:01:15.384Z] 199 actionable tasks: 107 executed, 92 up-to-date
[2021-06-28T20:01:15.384Z]
[2021-06-28T20:01:15.384Z] See the profiling report at: file:///home/jenkins/jenkins-agent/workspace/Kafka_kafka_trunk/build/reports/profile/profile-2021-06-28-17-30-21.html
[2021-06-28T20:01:15.384Z] A fine-grained performance profile is available: use the --scan option.
[Pipeline] junit
[2021-06-28T20:01:16.371Z] Recording test results
[2021-06-28T20:01:38.204Z] [Checks API] No suitable checks publisher found.
[Pipeline] echo
[2021-06-28T20:01:38.206Z] Skipping Kafka Streams archetype test for Java 11
[Pipeline] }
[Pipeline] // withEnv
[Pipeline] }
[Pipeline] // withEnv
[Pipeline] }
[Pipeline] // withEnv
[Pipeline] }
[Pipeline] // node
[Pipeline] }
[Pipeline] // timestamps
[Pipeline] }
[Pipeline] // timeout
[Pipeline] }
[Pipeline] // stage
[Pipeline] }
[Pipeline] // parallel
[Pipeline] }
[Pipeline] // stage
[Pipeline] stage
[Pipeline] { (Declarative: Post Actions)
[Pipeline] node
Still waiting to schedule task
Waiting for next available executor on ‘ubuntu’
Running on H24 in /home/jenkins/jenkins-agent/workspace/Kafka_kafka_trunk
[Pipeline] {
[Pipeline] script
[Pipeline] {
[Pipeline] step
Build failed in Jenkins: Kafka » Kafka Branch Builder » trunk #273
Posted by Apache Jenkins Server <je...@builds.apache.org>.
See <https://ci-builds.apache.org/job/Kafka/job/kafka/job/trunk/273/display/redirect>
Changes:
------------------------------------------
[...truncated 543743 lines...]
[2021-07-01T04:44:25.829Z]
[2021-07-01T04:44:25.829Z] TopicCommandIntegrationTest > testDescribeReportOverriddenConfigs() STARTED
[2021-07-01T04:44:30.416Z]
[2021-07-01T04:44:30.416Z] TopicCommandIntegrationTest > testDescribeReportOverriddenConfigs() PASSED
[2021-07-01T04:44:30.416Z]
[2021-07-01T04:44:30.416Z] TopicCommandIntegrationTest > testDescribeWhenTopicDoesntExist() STARTED
[2021-07-01T04:44:33.507Z]
[2021-07-01T04:44:33.507Z] TopicCommandIntegrationTest > testDescribeWhenTopicDoesntExist() PASSED
[2021-07-01T04:44:33.507Z]
[2021-07-01T04:44:33.507Z] TopicCommandIntegrationTest > testDescribeDoesNotFailWhenListingReassignmentIsUnauthorized() STARTED
[2021-07-01T04:44:37.917Z]
[2021-07-01T04:44:37.917Z] TopicCommandIntegrationTest > testDescribeDoesNotFailWhenListingReassignmentIsUnauthorized() PASSED
[2021-07-01T04:44:37.917Z]
[2021-07-01T04:44:37.917Z] TopicCommandIntegrationTest > testAlterAssignmentWithMoreAssignmentThanPartitions() STARTED
[2021-07-01T04:44:42.087Z]
[2021-07-01T04:44:42.087Z] TopicCommandIntegrationTest > testAlterAssignmentWithMoreAssignmentThanPartitions() PASSED
[2021-07-01T04:44:42.087Z]
[2021-07-01T04:44:42.087Z] TopicCommandIntegrationTest > testDescribeWhenTopicDoesntExistWithIfExists() STARTED
[2021-07-01T04:44:45.556Z]
[2021-07-01T04:44:45.556Z] TopicCommandIntegrationTest > testDescribeWhenTopicDoesntExistWithIfExists() PASSED
[2021-07-01T04:44:45.556Z]
[2021-07-01T04:44:45.556Z] TopicCommandIntegrationTest > testCreateWithDefaultPartitions() STARTED
[2021-07-01T04:44:49.025Z]
[2021-07-01T04:44:49.025Z] TopicCommandIntegrationTest > testCreateWithDefaultPartitions() PASSED
[2021-07-01T04:44:49.025Z]
[2021-07-01T04:44:49.025Z] TopicCommandIntegrationTest > testListTopics() STARTED
[2021-07-01T04:44:52.207Z]
[2021-07-01T04:44:52.207Z] TopicCommandIntegrationTest > testListTopics() PASSED
[2021-07-01T04:44:52.207Z]
[2021-07-01T04:44:52.207Z] TopicCommandIntegrationTest > testDeleteWhenTopicDoesntExistWithIfExists() STARTED
[2021-07-01T04:44:56.645Z]
[2021-07-01T04:44:56.645Z] TopicCommandIntegrationTest > testDeleteWhenTopicDoesntExistWithIfExists() PASSED
[2021-07-01T04:44:56.645Z]
[2021-07-01T04:44:56.645Z] TopicCommandIntegrationTest > testCreateWhenAlreadyExistsWithIfNotExists() STARTED
[2021-07-01T04:45:00.391Z]
[2021-07-01T04:45:00.391Z] TopicCommandIntegrationTest > testCreateWhenAlreadyExistsWithIfNotExists() PASSED
[2021-07-01T04:45:00.391Z]
[2021-07-01T04:45:00.391Z] TopicCommandIntegrationTest > testDeleteInternalTopic() STARTED
[2021-07-01T04:45:04.599Z]
[2021-07-01T04:45:04.599Z] TopicCommandIntegrationTest > testDeleteInternalTopic() PASSED
[2021-07-01T04:45:04.599Z]
[2021-07-01T04:45:04.599Z] TopicCommandIntegrationTest > testInvalidTopicLevelConfig() STARTED
[2021-07-01T04:45:07.860Z]
[2021-07-01T04:45:07.860Z] TopicCommandIntegrationTest > testInvalidTopicLevelConfig() PASSED
[2021-07-01T04:45:07.860Z]
[2021-07-01T04:45:07.860Z] TopicCommandIntegrationTest > testAlterAssignmentWithMorePartitionsThanAssignment() STARTED
[2021-07-01T04:45:13.071Z]
[2021-07-01T04:45:13.071Z] TopicCommandIntegrationTest > testAlterAssignmentWithMorePartitionsThanAssignment() PASSED
[2021-07-01T04:45:13.071Z]
[2021-07-01T04:45:13.071Z] TopicCommandIntegrationTest > testConfigPreservationAcrossPartitionAlteration() STARTED
[2021-07-01T04:45:16.541Z]
[2021-07-01T04:45:16.541Z] TopicCommandIntegrationTest > testConfigPreservationAcrossPartitionAlteration() PASSED
[2021-07-01T04:45:16.541Z]
[2021-07-01T04:45:16.541Z] TopicCommandIntegrationTest > testCreateWithConfigs() STARTED
[2021-07-01T04:45:23.512Z]
[2021-07-01T04:45:23.512Z] TopicCommandIntegrationTest > testCreateWithConfigs() PASSED
[2021-07-01T04:45:23.512Z]
[2021-07-01T04:45:23.512Z] TopicCommandIntegrationTest > testDescribeUnderReplicatedPartitions() STARTED
[2021-07-01T04:45:31.506Z]
[2021-07-01T04:45:31.507Z] TopicCommandIntegrationTest > testDescribeUnderReplicatedPartitions() PASSED
[2021-07-01T04:45:31.507Z]
[2021-07-01T04:45:31.507Z] TopicCommandIntegrationTest > testDescribeUnderMinIsrPartitions() STARTED
[2021-07-01T04:45:37.826Z]
[2021-07-01T04:45:37.826Z] TopicCommandIntegrationTest > testDescribeUnderMinIsrPartitions() PASSED
[2021-07-01T04:45:37.826Z]
[2021-07-01T04:45:37.826Z] TopicCommandIntegrationTest > testDeleteWhenTopicDoesntExist() STARTED
[2021-07-01T04:45:42.137Z]
[2021-07-01T04:45:42.137Z] TopicCommandIntegrationTest > testDeleteWhenTopicDoesntExist() PASSED
[2021-07-01T04:45:42.137Z]
[2021-07-01T04:45:42.137Z] TopicCommandIntegrationTest > testDescribeAndListTopicsWithoutInternalTopics() STARTED
[2021-07-01T04:45:46.251Z]
[2021-07-01T04:45:46.251Z] TopicCommandIntegrationTest > testDescribeAndListTopicsWithoutInternalTopics() PASSED
[2021-07-01T04:45:46.251Z]
[2021-07-01T04:45:46.251Z] TopicCommandIntegrationTest > testDescribeUnavailablePartitions() STARTED
[2021-07-01T04:45:52.897Z]
[2021-07-01T04:45:52.897Z] TopicCommandIntegrationTest > testDescribeUnavailablePartitions() PASSED
[2021-07-01T04:45:52.897Z]
[2021-07-01T04:45:52.897Z] TopicCommandIntegrationTest > testCreateTopicDoesNotRetryThrottlingQuotaExceededException() STARTED
[2021-07-01T04:45:56.138Z]
[2021-07-01T04:45:56.138Z] TopicCommandIntegrationTest > testCreateTopicDoesNotRetryThrottlingQuotaExceededException() PASSED
[2021-07-01T04:45:56.138Z]
[2021-07-01T04:45:56.138Z] TopicCommandIntegrationTest > testCreateWithReplicaAssignment() STARTED
[2021-07-01T04:46:00.612Z]
[2021-07-01T04:46:00.612Z] TopicCommandIntegrationTest > testCreateWithReplicaAssignment() PASSED
[2021-07-01T04:46:00.612Z]
[2021-07-01T04:46:00.612Z] TopicCommandIntegrationTest > testAlterWithInvalidPartitionCount() STARTED
[2021-07-01T04:46:05.365Z]
[2021-07-01T04:46:05.365Z] TopicCommandIntegrationTest > testAlterWithInvalidPartitionCount() PASSED
[2021-07-01T04:46:05.365Z]
[2021-07-01T04:46:05.365Z] TopicCommandIntegrationTest > testCreate() STARTED
[2021-07-01T04:46:09.775Z]
[2021-07-01T04:46:09.775Z] TopicCommandIntegrationTest > testCreate() PASSED
[2021-07-01T04:46:09.775Z]
[2021-07-01T04:46:09.775Z] TopicCommandIntegrationTest > testDescribeUnderMinIsrPartitionsMixed() STARTED
[2021-07-01T04:46:16.566Z]
[2021-07-01T04:46:16.566Z] TopicCommandIntegrationTest > testDescribeUnderMinIsrPartitionsMixed() PASSED
[2021-07-01T04:46:16.566Z]
[2021-07-01T04:46:16.566Z] TopicCommandIntegrationTest > testCreateWhenAlreadyExists() STARTED
[2021-07-01T04:46:21.153Z]
[2021-07-01T04:46:21.153Z] TopicCommandIntegrationTest > testCreateWhenAlreadyExists() PASSED
[2021-07-01T04:46:21.153Z]
[2021-07-01T04:46:21.153Z] TopicCommandIntegrationTest > testDescribe() STARTED
[2021-07-01T04:46:25.538Z]
[2021-07-01T04:46:25.538Z] TopicCommandIntegrationTest > testDescribe() PASSED
[2021-07-01T04:46:25.538Z]
[2021-07-01T04:46:25.538Z] TopicCommandIntegrationTest > testAlterAssignment() STARTED
[2021-07-01T04:46:28.763Z]
[2021-07-01T04:46:28.763Z] TopicCommandIntegrationTest > testAlterAssignment() PASSED
[2021-07-01T04:46:28.763Z]
[2021-07-01T04:46:28.763Z] DynamicConnectionQuotaTest > testDynamicConnectionQuota() STARTED
[2021-07-01T04:46:32.860Z]
[2021-07-01T04:46:32.860Z] DynamicConnectionQuotaTest > testDynamicConnectionQuota() PASSED
[2021-07-01T04:46:32.860Z]
[2021-07-01T04:46:32.860Z] DynamicConnectionQuotaTest > testDynamicListenerConnectionQuota() STARTED
[2021-07-01T04:46:41.499Z]
[2021-07-01T04:46:41.499Z] DynamicConnectionQuotaTest > testDynamicListenerConnectionQuota() PASSED
[2021-07-01T04:46:41.499Z]
[2021-07-01T04:46:41.499Z] DynamicConnectionQuotaTest > testDynamicListenerConnectionCreationRateQuota() STARTED
[2021-07-01T04:47:42.644Z]
[2021-07-01T04:47:42.644Z] DynamicConnectionQuotaTest > testDynamicListenerConnectionCreationRateQuota() PASSED
[2021-07-01T04:47:42.644Z]
[2021-07-01T04:47:42.644Z] DynamicConnectionQuotaTest > testDynamicIpConnectionRateQuota() STARTED
[2021-07-01T04:48:28.806Z]
[2021-07-01T04:48:28.806Z] DynamicConnectionQuotaTest > testDynamicIpConnectionRateQuota() PASSED
[2021-07-01T04:48:28.806Z]
[2021-07-01T04:48:28.806Z] Deprecated Gradle features were used in this build, making it incompatible with Gradle 8.0.
[2021-07-01T04:48:28.806Z] Use '--warning-mode all' to show the individual deprecation warnings.
[2021-07-01T04:48:28.806Z] See https://docs.gradle.org/7.0.2/userguide/command_line_interface.html#sec:command_line_warnings
[2021-07-01T04:48:28.806Z]
[2021-07-01T04:48:28.806Z] BUILD SUCCESSFUL in 2h 12m 10s
[2021-07-01T04:48:28.806Z] 199 actionable tasks: 107 executed, 92 up-to-date
[2021-07-01T04:48:28.806Z]
[2021-07-01T04:48:28.806Z] See the profiling report at: file:///home/jenkins/jenkins-agent/workspace/Kafka_kafka_trunk/build/reports/profile/profile-2021-07-01-02-36-21.html
[2021-07-01T04:48:28.806Z] A fine-grained performance profile is available: use the --scan option.
[Pipeline] junit
[2021-07-01T04:48:29.661Z] Recording test results
[2021-07-01T04:48:43.352Z] [Checks API] No suitable checks publisher found.
[Pipeline] echo
[2021-07-01T04:48:43.354Z] Skipping Kafka Streams archetype test for Java 11
[Pipeline] }
[Pipeline] // withEnv
[Pipeline] }
[Pipeline] // withEnv
[Pipeline] }
[Pipeline] // withEnv
[Pipeline] }
[Pipeline] // node
[Pipeline] }
[Pipeline] // timestamps
[Pipeline] }
[Pipeline] // timeout
[Pipeline] }
[Pipeline] // stage
[Pipeline] }
Cancelling nested steps due to timeout
[2021-07-01T10:30:03.899Z] Sending interrupt signal to process
[2021-07-01T10:30:07.088Z]
[2021-07-01T10:30:07.088Z] ZooKeeperClientTest > testBlockOnRequestCompletionFromStateChangeHandler() SKIPPED
[2021-07-01T10:30:07.088Z]
[2021-07-01T10:30:07.088Z] > Task :core:integrationTest FAILED
[2021-07-01T10:30:07.088Z]
[2021-07-01T10:30:07.088Z] FAILURE: Build failed with an exception.
[2021-07-01T10:30:07.088Z]
[2021-07-01T10:30:07.088Z] * What went wrong:
[2021-07-01T10:30:07.088Z] Execution failed for task ':core:integrationTest'.
[2021-07-01T10:30:07.088Z] > Process 'Gradle Test Executor 129' finished with non-zero exit value 143
[2021-07-01T10:30:07.088Z] This problem might be caused by incorrect test process configuration.
[2021-07-01T10:30:07.088Z] Please refer to the test execution section in the User Manual at https://docs.gradle.org/7.0.2/userguide/java_testing.html#sec:test_execution
[2021-07-01T10:30:07.088Z]
[2021-07-01T10:30:07.088Z] * Try:
[2021-07-01T10:30:07.088Z] Run with --stacktrace option to get the stack trace. Run with --info or --debug option to get more log output. Run with --scan to get full insights.
[2021-07-01T10:30:07.088Z]
[2021-07-01T10:30:07.088Z] * Get more help at https://help.gradle.org
[2021-07-01T10:30:07.088Z]
[2021-07-01T10:30:07.088Z] Deprecated Gradle features were used in this build, making it incompatible with Gradle 8.0.
[2021-07-01T10:30:07.088Z] Use '--warning-mode all' to show the individual deprecation warnings.
[2021-07-01T10:30:07.088Z] See https://docs.gradle.org/7.0.2/userguide/command_line_interface.html#sec:command_line_warnings
[2021-07-01T10:30:07.088Z]
[2021-07-01T10:30:07.088Z] BUILD FAILED in 7h 53m 19s
[2021-07-01T10:30:07.088Z] 199 actionable tasks: 107 executed, 92 up-to-date
[2021-07-01T10:30:07.088Z]
[2021-07-01T10:30:07.088Z] See the profiling report at: file:///home/jenkins/workspace/Kafka_kafka_trunk/build/reports/profile/profile-2021-07-01-02-36-49.html
[2021-07-01T10:30:07.088Z] A fine-grained performance profile is available: use the --scan option.
[2021-07-01T10:30:07.088Z] The message received from the daemon indicates that the daemon has disappeared.
[2021-07-01T10:30:07.088Z] Build request sent: Build{id=436b6e63-db35-4417-b567-4cfbf924704b, currentDir=/home/jenkins/workspace/Kafka_kafka_trunk}
[2021-07-01T10:30:07.088Z] Attempting to read last messages from the daemon log...
[2021-07-01T10:30:07.088Z] Daemon pid: 24177
[2021-07-01T10:30:07.088Z] log file: /home/jenkins/.gradle/daemon/7.0.2/daemon-24177.out.log
[2021-07-01T10:30:07.088Z] ----- Last 20 lines from daemon log file - daemon-24177.out.log -----
[2021-07-01T10:30:07.088Z] * Try:
[2021-07-01T10:30:07.088Z] Run with --stacktrace option to get the stack trace. Run with --info or --debug option to get more log output. Run with --scan to get full insights.
[2021-07-01T10:30:07.088Z]
[2021-07-01T10:30:07.088Z] * Get more help at https://help.gradle.org
[2021-07-01T10:30:07.088Z]
[2021-07-01T10:30:07.088Z] Deprecated Gradle features were used in this build, making it incompatible with Gradle 8.0.
[2021-07-01T10:30:07.088Z] Use '--warning-mode all' to show the individual deprecation warnings.
[2021-07-01T10:30:07.088Z] See https://docs.gradle.org/7.0.2/userguide/command_line_interface.html#sec:command_line_warnings
[2021-07-01T10:30:07.088Z]
[2021-07-01T10:30:07.088Z] BUILD FAILED in 7h 53m 19s
[2021-07-01T10:30:07.088Z] 199 actionable tasks: 107 executed, 92 up-to-date
[2021-07-01T10:30:07.088Z]
[2021-07-01T10:30:07.088Z] See the profiling report at: file:///home/jenkins/workspace/Kafka_kafka_trunk/build/reports/profile/profile-2021-07-01-02-36-49.html
[2021-07-01T10:30:07.088Z] A fine-grained performance profile is available: use the --scan option.
[2021-07-01T10:30:07.088Z] 2021-07-01T10:30:05.405+0000 [DEBUG] [org.gradle.launcher.daemon.server.exec.ExecuteBuild] The daemon has finished executing the build.
[2021-07-01T10:30:07.088Z] Daemon vm is shutting down... The daemon has exited normally or was terminated in response to a user interrupt.
[2021-07-01T10:30:07.088Z] 2021-07-01T10:30:05.407+0000 [DEBUG] [org.gradle.launcher.daemon.registry.PersistentDaemonRegistry] Removing daemon address: [da5d7d1c-76b3-48f2-abe3-700f8f4cd579 port:37183, addresses:[localhost/127.0.0.1]]
[2021-07-01T10:30:07.088Z] 2021-07-01T10:30:05.408+0000 [DEBUG] [org.gradle.cache.internal.DefaultFileLockManager] Waiting to acquire exclusive lock on daemon addresses registry.
[2021-07-01T10:30:07.088Z] 2021-07-01T10:30:05.408+0000 [DEBUG] [org.gradle.cache.internal.DefaultFileLockManager] Lock acquired on daemon addresses registry.
[2021-07-01T10:30:07.088Z] 2021-07-01T10:30:05.409+0000 [DEBUG] [org.gradle.cache.internal.DefaultFileLockManager] Releasing lock on daemon addresses registry.
[2021-07-01T10:30:07.088Z] ----- End of the daemon log -----
[2021-07-01T10:30:07.088Z]
[2021-07-01T10:30:07.088Z]
[2021-07-01T10:30:07.088Z] FAILURE: Build failed with an exception.
[2021-07-01T10:30:07.088Z]
[2021-07-01T10:30:07.088Z] * What went wrong:
[2021-07-01T10:30:07.088Z] Gradle build daemon disappeared unexpectedly (it may have been killed or may have crashed)
[2021-07-01T10:30:07.088Z]
[2021-07-01T10:30:07.088Z] * Try:
[2021-07-01T10:30:07.088Z] Run with --stacktrace option to get the stack trace. Run with --info or --debug option to get more log output. Run with --scan to get full insights.
[2021-07-01T10:30:07.088Z]
[2021-07-01T10:30:07.088Z] * Get more help at https://help.gradle.org
[2021-07-01T10:30:07.605Z] script returned exit code 1
[Pipeline] }
[Pipeline] // withEnv
[Pipeline] }
[Pipeline] // withEnv
[Pipeline] }
[Pipeline] // withEnv
[Pipeline] }
[Pipeline] // node
[Pipeline] }
[Pipeline] // timestamps
[Pipeline] }
[Pipeline] // timeout
[Pipeline] }
[Pipeline] // stage
[Pipeline] }
Failed in branch JDK 8 and Scala 2.12
[Pipeline] // parallel
[Pipeline] }
[Pipeline] // stage
[Pipeline] stage
[Pipeline] { (Declarative: Post Actions)
[Pipeline] node
Running on H28 in /home/jenkins/jenkins-agent/workspace/Kafka_kafka_trunk
[Pipeline] {
[Pipeline] script
[Pipeline] {
[Pipeline] step
Jenkins build is still unstable: Kafka » Kafka Branch Builder » trunk #272
Posted by Apache Jenkins Server <je...@builds.apache.org>.
See <https://ci-builds.apache.org/job/Kafka/job/kafka/job/trunk/272/display/redirect>
Jenkins build is still unstable: Kafka » Kafka Branch Builder » trunk #271
Posted by Apache Jenkins Server <je...@builds.apache.org>.
See <https://ci-builds.apache.org/job/Kafka/job/kafka/job/trunk/271/display/redirect>
Jenkins build is still unstable: Kafka » Kafka Branch Builder » trunk #270
Posted by Apache Jenkins Server <je...@builds.apache.org>.
See <https://ci-builds.apache.org/job/Kafka/job/kafka/job/trunk/270/display/redirect>
Jenkins build is still unstable: Kafka » Kafka Branch Builder » trunk #269
Posted by Apache Jenkins Server <je...@builds.apache.org>.
See <https://ci-builds.apache.org/job/Kafka/job/kafka/job/trunk/269/display/redirect>
Jenkins build is still unstable: Kafka » Kafka Branch Builder » trunk #268
Posted by Apache Jenkins Server <je...@builds.apache.org>.
See <https://ci-builds.apache.org/job/Kafka/job/kafka/job/trunk/268/display/redirect>
Jenkins build is still unstable: Kafka » Kafka Branch Builder » trunk #267
Posted by Apache Jenkins Server <je...@builds.apache.org>.
See <https://ci-builds.apache.org/job/Kafka/job/kafka/job/trunk/267/display/redirect>
Jenkins build is still unstable: Kafka » Kafka Branch Builder » trunk #266
Posted by Apache Jenkins Server <je...@builds.apache.org>.
See <https://ci-builds.apache.org/job/Kafka/job/kafka/job/trunk/266/display/redirect>
Jenkins build is unstable: Kafka » Kafka Branch Builder » trunk #265
Posted by Apache Jenkins Server <je...@builds.apache.org>.
See <https://ci-builds.apache.org/job/Kafka/job/kafka/job/trunk/265/display/redirect>
Build failed in Jenkins: Kafka » Kafka Branch Builder » trunk #264
Posted by Apache Jenkins Server <je...@builds.apache.org>.
See <https://ci-builds.apache.org/job/Kafka/job/kafka/job/trunk/264/display/redirect>
Changes:
------------------------------------------
[...truncated 545665 lines...]
[2021-06-29T20:05:22.654Z] MultipleListenersWithDefaultJaasContextTest > testProduceConsume() STARTED
[2021-06-29T20:05:41.381Z] [Checks API] No suitable checks publisher found.
[Pipeline] echo
[2021-06-29T20:05:41.382Z] Skipping Kafka Streams archetype test for Java 16
[Pipeline] }
[Pipeline] // withEnv
[Pipeline] }
[Pipeline] // withEnv
[Pipeline] }
[Pipeline] // withEnv
[Pipeline] }
[Pipeline] // node
[Pipeline] }
[Pipeline] // timestamps
[Pipeline] }
[Pipeline] // timeout
[Pipeline] }
[Pipeline] // stage
[Pipeline] }
[2021-06-29T20:06:01.057Z]
[2021-06-29T20:06:01.057Z] MultipleListenersWithDefaultJaasContextTest > testProduceConsume() PASSED
[2021-06-29T20:06:01.057Z]
[2021-06-29T20:06:01.057Z] Deprecated Gradle features were used in this build, making it incompatible with Gradle 8.0.
[2021-06-29T20:06:01.057Z] Use '--warning-mode all' to show the individual deprecation warnings.
[2021-06-29T20:06:01.057Z] See https://docs.gradle.org/7.0.2/userguide/command_line_interface.html#sec:command_line_warnings
[2021-06-29T20:06:01.057Z]
[2021-06-29T20:06:01.057Z] BUILD SUCCESSFUL in 2h 3m 4s
[2021-06-29T20:06:01.057Z] 199 actionable tasks: 107 executed, 92 up-to-date
[2021-06-29T20:06:01.057Z]
[2021-06-29T20:06:01.057Z] See the profiling report at: file:///home/jenkins/workspace/Kafka_kafka_trunk/build/reports/profile/profile-2021-06-29-18-02-57.html
[2021-06-29T20:06:01.057Z] A fine-grained performance profile is available: use the --scan option.
[Pipeline] junit
[2021-06-29T20:06:01.945Z] Recording test results
[2021-06-29T20:06:06.343Z] > Task :core:classes
[2021-06-29T20:06:06.343Z] > Task :core:compileTestJava NO-SOURCE
[2021-06-29T20:06:22.230Z] [Checks API] No suitable checks publisher found.
[Pipeline] echo
[2021-06-29T20:06:22.231Z] Skipping Kafka Streams archetype test for Java 16
[Pipeline] }
[Pipeline] // withEnv
[Pipeline] }
[Pipeline] // withEnv
[Pipeline] }
[Pipeline] // withEnv
[Pipeline] }
[Pipeline] // node
[Pipeline] }
[Pipeline] // timestamps
[Pipeline] }
[Pipeline] // timeout
[Pipeline] }
[Pipeline] // stage
[Pipeline] }
[2021-06-29T20:06:36.656Z] > Task :core:compileTestScala
[2021-06-29T20:07:22.955Z] > Task :core:testClasses
[2021-06-29T20:07:52.195Z] > Task :streams:compileTestJava
[2021-06-29T20:08:46.718Z] > Task :streams:testClasses
[2021-06-29T20:08:46.718Z] > Task :streams:testJar
[2021-06-29T20:08:46.718Z] > Task :streams:testSrcJar
[2021-06-29T20:08:46.718Z] > Task :streams:publishMavenJavaPublicationToMavenLocal
[2021-06-29T20:08:46.718Z] > Task :streams:publishToMavenLocal
[2021-06-29T20:08:46.718Z]
[2021-06-29T20:08:46.718Z] Deprecated Gradle features were used in this build, making it incompatible with Gradle 8.0.
[2021-06-29T20:08:46.718Z] Use '--warning-mode all' to show the individual deprecation warnings.
[2021-06-29T20:08:46.718Z] See https://docs.gradle.org/7.0.2/userguide/command_line_interface.html#sec:command_line_warnings
[2021-06-29T20:08:46.718Z]
[2021-06-29T20:08:46.718Z] Execution optimizations have been disabled for 2 invalid unit(s) of work during this build to ensure correctness.
[2021-06-29T20:08:46.718Z] Please consult deprecation warnings for more details.
[2021-06-29T20:08:46.718Z]
[2021-06-29T20:08:46.718Z] BUILD SUCCESSFUL in 5m 29s
[2021-06-29T20:08:46.718Z] 71 actionable tasks: 37 executed, 34 up-to-date
[Pipeline] sh
[2021-06-29T20:08:50.300Z] + grep ^version= gradle.properties
[2021-06-29T20:08:50.300Z] + cut -d= -f 2
[Pipeline] dir
[2021-06-29T20:08:51.177Z] Running in /home/jenkins/workspace/Kafka_kafka_trunk/streams/quickstart
[Pipeline] {
[Pipeline] sh
[2021-06-29T20:08:54.148Z] + mvn clean install -Dgpg.skip
[2021-06-29T20:08:55.197Z] [INFO] Scanning for projects...
[2021-06-29T20:08:55.197Z] [INFO] ------------------------------------------------------------------------
[2021-06-29T20:08:55.197Z] [INFO] Reactor Build Order:
[2021-06-29T20:08:55.197Z] [INFO]
[2021-06-29T20:08:55.197Z] [INFO] Kafka Streams :: Quickstart [pom]
[2021-06-29T20:08:55.197Z] [INFO] streams-quickstart-java [maven-archetype]
[2021-06-29T20:08:55.197Z] [INFO]
[2021-06-29T20:08:55.197Z] [INFO] ----------------< org.apache.kafka:streams-quickstart >-----------------
[2021-06-29T20:08:55.197Z] [INFO] Building Kafka Streams :: Quickstart 3.0.0-SNAPSHOT [1/2]
[2021-06-29T20:08:55.197Z] [INFO] --------------------------------[ pom ]---------------------------------
[2021-06-29T20:08:55.197Z] [INFO]
[2021-06-29T20:08:55.197Z] [INFO] --- maven-clean-plugin:3.0.0:clean (default-clean) @ streams-quickstart ---
[2021-06-29T20:08:56.421Z] [INFO]
[2021-06-29T20:08:56.421Z] [INFO] --- maven-remote-resources-plugin:1.5:process (process-resource-bundles) @ streams-quickstart ---
[2021-06-29T20:08:56.421Z] [INFO]
[2021-06-29T20:08:56.421Z] [INFO] --- maven-site-plugin:3.5.1:attach-descriptor (attach-descriptor) @ streams-quickstart ---
[2021-06-29T20:08:57.747Z] [INFO]
[2021-06-29T20:08:57.747Z] [INFO] --- maven-gpg-plugin:1.6:sign (sign-artifacts) @ streams-quickstart ---
[2021-06-29T20:08:57.747Z] [INFO]
[2021-06-29T20:08:57.747Z] [INFO] --- maven-install-plugin:2.5.2:install (default-install) @ streams-quickstart ---
[2021-06-29T20:08:58.980Z] [INFO] Installing /home/jenkins/workspace/Kafka_kafka_trunk/streams/quickstart/pom.xml to /home/jenkins/.m2/repository/org/apache/kafka/streams-quickstart/3.0.0-SNAPSHOT/streams-quickstart-3.0.0-SNAPSHOT.pom
[2021-06-29T20:08:58.980Z] [INFO]
[2021-06-29T20:08:58.980Z] [INFO] --------------< org.apache.kafka:streams-quickstart-java >--------------
[2021-06-29T20:08:58.980Z] [INFO] Building streams-quickstart-java 3.0.0-SNAPSHOT [2/2]
[2021-06-29T20:08:58.980Z] [INFO] --------------------------[ maven-archetype ]---------------------------
[2021-06-29T20:08:58.980Z] [INFO]
[2021-06-29T20:08:58.980Z] [INFO] --- maven-clean-plugin:3.0.0:clean (default-clean) @ streams-quickstart-java ---
[2021-06-29T20:08:58.980Z] [INFO]
[2021-06-29T20:08:58.980Z] [INFO] --- maven-remote-resources-plugin:1.5:process (process-resource-bundles) @ streams-quickstart-java ---
[2021-06-29T20:08:58.980Z] [INFO]
[2021-06-29T20:08:58.980Z] [INFO] --- maven-resources-plugin:2.7:resources (default-resources) @ streams-quickstart-java ---
[2021-06-29T20:08:58.980Z] [INFO] Using 'UTF-8' encoding to copy filtered resources.
[2021-06-29T20:08:58.980Z] [INFO] Copying 6 resources
[2021-06-29T20:08:58.980Z] [INFO] Copying 3 resources
[2021-06-29T20:08:58.980Z] [INFO]
[2021-06-29T20:08:58.980Z] [INFO] --- maven-resources-plugin:2.7:testResources (default-testResources) @ streams-quickstart-java ---
[2021-06-29T20:08:58.980Z] [INFO] Using 'UTF-8' encoding to copy filtered resources.
[2021-06-29T20:08:58.980Z] [INFO] Copying 2 resources
[2021-06-29T20:08:58.980Z] [INFO] Copying 3 resources
[2021-06-29T20:08:58.980Z] [INFO]
[2021-06-29T20:08:58.980Z] [INFO] --- maven-archetype-plugin:2.2:jar (default-jar) @ streams-quickstart-java ---
[2021-06-29T20:09:00.250Z] [INFO] Building archetype jar: /home/jenkins/workspace/Kafka_kafka_trunk/streams/quickstart/java/target/streams-quickstart-java-3.0.0-SNAPSHOT
[2021-06-29T20:09:00.250Z] [INFO]
[2021-06-29T20:09:00.250Z] [INFO] --- maven-site-plugin:3.5.1:attach-descriptor (attach-descriptor) @ streams-quickstart-java ---
[2021-06-29T20:09:00.250Z] [INFO]
[2021-06-29T20:09:00.250Z] [INFO] --- maven-archetype-plugin:2.2:integration-test (default-integration-test) @ streams-quickstart-java ---
[2021-06-29T20:09:00.250Z] [INFO]
[2021-06-29T20:09:00.250Z] [INFO] --- maven-gpg-plugin:1.6:sign (sign-artifacts) @ streams-quickstart-java ---
[2021-06-29T20:09:00.250Z] [INFO]
[2021-06-29T20:09:00.250Z] [INFO] --- maven-install-plugin:2.5.2:install (default-install) @ streams-quickstart-java ---
[2021-06-29T20:09:00.250Z] [INFO] Installing /home/jenkins/workspace/Kafka_kafka_trunk/streams/quickstart/java/target/streams-quickstart-java-3.0.0-SNAPSHOT.jar to /home/jenkins/.m2/repository/org/apache/kafka/streams-quickstart-java/3.0.0-SNAPSHOT/streams-quickstart-java-3.0.0-SNAPSHOT.jar
[2021-06-29T20:09:00.250Z] [INFO] Installing /home/jenkins/workspace/Kafka_kafka_trunk/streams/quickstart/java/pom.xml to /home/jenkins/.m2/repository/org/apache/kafka/streams-quickstart-java/3.0.0-SNAPSHOT/streams-quickstart-java-3.0.0-SNAPSHOT.pom
[2021-06-29T20:09:00.250Z] [INFO]
[2021-06-29T20:09:00.250Z] [INFO] --- maven-archetype-plugin:2.2:update-local-catalog (default-update-local-catalog) @ streams-quickstart-java ---
[2021-06-29T20:09:00.250Z] [INFO] ------------------------------------------------------------------------
[2021-06-29T20:09:00.250Z] [INFO] Reactor Summary for Kafka Streams :: Quickstart 3.0.0-SNAPSHOT:
[2021-06-29T20:09:00.250Z] [INFO]
[2021-06-29T20:09:00.250Z] [INFO] Kafka Streams :: Quickstart ........................ SUCCESS [ 2.943 s]
[2021-06-29T20:09:00.250Z] [INFO] streams-quickstart-java ............................ SUCCESS [ 1.990 s]
[2021-06-29T20:09:00.250Z] [INFO] ------------------------------------------------------------------------
[2021-06-29T20:09:00.250Z] [INFO] BUILD SUCCESS
[2021-06-29T20:09:00.250Z] [INFO] ------------------------------------------------------------------------
[2021-06-29T20:09:00.250Z] [INFO] Total time: 5.396 s
[2021-06-29T20:09:00.250Z] [INFO] Finished at: 2021-06-29T20:08:59Z
[2021-06-29T20:09:00.250Z] [INFO] ------------------------------------------------------------------------
[Pipeline] dir
[2021-06-29T20:09:00.778Z] Running in /home/jenkins/workspace/Kafka_kafka_trunk/streams/quickstart/test-streams-archetype
[Pipeline] {
[Pipeline] sh
[2021-06-29T20:09:03.849Z] + echo Y
[2021-06-29T20:09:03.849Z] + mvn archetype:generate -DarchetypeCatalog=local -DarchetypeGroupId=org.apache.kafka -DarchetypeArtifactId=streams-quickstart-java -DarchetypeVersion=3.0.0-SNAPSHOT -DgroupId=streams.examples -DartifactId=streams.examples -Dversion=0.1 -Dpackage=myapps
[2021-06-29T20:09:04.815Z] [INFO] Scanning for projects...
[2021-06-29T20:09:05.946Z] [INFO]
[2021-06-29T20:09:05.946Z] [INFO] ------------------< org.apache.maven:standalone-pom >-------------------
[2021-06-29T20:09:05.946Z] [INFO] Building Maven Stub Project (No POM) 1
[2021-06-29T20:09:05.946Z] [INFO] --------------------------------[ pom ]---------------------------------
[2021-06-29T20:09:05.946Z] [INFO]
[2021-06-29T20:09:05.946Z] [INFO] >>> maven-archetype-plugin:3.2.0:generate (default-cli) > generate-sources @ standalone-pom >>>
[2021-06-29T20:09:05.946Z] [INFO]
[2021-06-29T20:09:05.946Z] [INFO] <<< maven-archetype-plugin:3.2.0:generate (default-cli) < generate-sources @ standalone-pom <<<
[2021-06-29T20:09:05.946Z] [INFO]
[2021-06-29T20:09:05.946Z] [INFO]
[2021-06-29T20:09:05.946Z] [INFO] --- maven-archetype-plugin:3.2.0:generate (default-cli) @ standalone-pom ---
[2021-06-29T20:09:06.898Z] [INFO] Generating project in Interactive mode
[2021-06-29T20:09:06.898Z] [WARNING] Archetype not found in any catalog. Falling back to central repository.
[2021-06-29T20:09:06.898Z] [WARNING] Add a repository with id 'archetype' in your settings.xml if archetype's repository is elsewhere.
[2021-06-29T20:09:06.898Z] [INFO] Using property: groupId = streams.examples
[2021-06-29T20:09:06.898Z] [INFO] Using property: artifactId = streams.examples
[2021-06-29T20:09:06.898Z] [INFO] Using property: version = 0.1
[2021-06-29T20:09:06.898Z] [INFO] Using property: package = myapps
[2021-06-29T20:09:06.898Z] Confirm properties configuration:
[2021-06-29T20:09:06.898Z] groupId: streams.examples
[2021-06-29T20:09:06.898Z] artifactId: streams.examples
[2021-06-29T20:09:06.898Z] version: 0.1
[2021-06-29T20:09:06.898Z] package: myapps
[2021-06-29T20:09:06.898Z] Y: : [INFO] ----------------------------------------------------------------------------
[2021-06-29T20:09:06.898Z] [INFO] Using following parameters for creating project from Archetype: streams-quickstart-java:3.0.0-SNAPSHOT
[2021-06-29T20:09:06.898Z] [INFO] ----------------------------------------------------------------------------
[2021-06-29T20:09:06.898Z] [INFO] Parameter: groupId, Value: streams.examples
[2021-06-29T20:09:06.898Z] [INFO] Parameter: artifactId, Value: streams.examples
[2021-06-29T20:09:06.898Z] [INFO] Parameter: version, Value: 0.1
[2021-06-29T20:09:06.898Z] [INFO] Parameter: package, Value: myapps
[2021-06-29T20:09:06.898Z] [INFO] Parameter: packageInPathFormat, Value: myapps
[2021-06-29T20:09:06.898Z] [INFO] Parameter: package, Value: myapps
[2021-06-29T20:09:06.898Z] [INFO] Parameter: version, Value: 0.1
[2021-06-29T20:09:06.898Z] [INFO] Parameter: groupId, Value: streams.examples
[2021-06-29T20:09:06.898Z] [INFO] Parameter: artifactId, Value: streams.examples
[2021-06-29T20:09:06.898Z] [INFO] Project created from Archetype in dir: /home/jenkins/workspace/Kafka_kafka_trunk/streams/quickstart/test-streams-archetype/streams.examples
[2021-06-29T20:09:06.898Z] [INFO] ------------------------------------------------------------------------
[2021-06-29T20:09:06.898Z] [INFO] BUILD SUCCESS
[2021-06-29T20:09:06.898Z] [INFO] ------------------------------------------------------------------------
[2021-06-29T20:09:06.898Z] [INFO] Total time: 2.459 s
[2021-06-29T20:09:06.898Z] [INFO] Finished at: 2021-06-29T20:09:06Z
[2021-06-29T20:09:06.898Z] [INFO] ------------------------------------------------------------------------
[Pipeline] dir
[2021-06-29T20:09:07.426Z] Running in /home/jenkins/workspace/Kafka_kafka_trunk/streams/quickstart/test-streams-archetype/streams.examples
[Pipeline] {
[Pipeline] sh
[2021-06-29T20:09:10.306Z] + mvn compile
[2021-06-29T20:09:11.552Z] [INFO] Scanning for projects...
[2021-06-29T20:09:11.552Z] [INFO]
[2021-06-29T20:09:11.552Z] [INFO] -----------------< streams.examples:streams.examples >------------------
[2021-06-29T20:09:11.552Z] [INFO] Building Kafka Streams Quickstart :: Java 0.1
[2021-06-29T20:09:11.552Z] [INFO] --------------------------------[ jar ]---------------------------------
[2021-06-29T20:09:12.528Z] [INFO]
[2021-06-29T20:09:12.528Z] [INFO] --- maven-resources-plugin:2.6:resources (default-resources) @ streams.examples ---
[2021-06-29T20:09:12.528Z] [INFO] Using 'UTF-8' encoding to copy filtered resources.
[2021-06-29T20:09:12.528Z] [INFO] Copying 1 resource
[2021-06-29T20:09:12.528Z] [INFO]
[2021-06-29T20:09:12.528Z] [INFO] --- maven-compiler-plugin:3.1:compile (default-compile) @ streams.examples ---
[2021-06-29T20:09:13.584Z] [INFO] Changes detected - recompiling the module!
[2021-06-29T20:09:13.584Z] [INFO] Compiling 3 source files to /home/jenkins/workspace/Kafka_kafka_trunk/streams/quickstart/test-streams-archetype/streams.examples/target/classes
[2021-06-29T20:09:14.812Z] [INFO] ------------------------------------------------------------------------
[2021-06-29T20:09:14.812Z] [INFO] BUILD SUCCESS
[2021-06-29T20:09:14.812Z] [INFO] ------------------------------------------------------------------------
[2021-06-29T20:09:14.812Z] [INFO] Total time: 3.473 s
[2021-06-29T20:09:14.812Z] [INFO] Finished at: 2021-06-29T20:09:14Z
[2021-06-29T20:09:14.812Z] [INFO] ------------------------------------------------------------------------
[Pipeline] }
[Pipeline] // dir
[Pipeline] }
[Pipeline] // dir
[Pipeline] }
[Pipeline] // dir
[Pipeline] }
[Pipeline] // withEnv
[Pipeline] }
[Pipeline] // withEnv
[Pipeline] }
[Pipeline] // withEnv
[Pipeline] }
[Pipeline] // node
[Pipeline] }
[Pipeline] // timestamps
[Pipeline] }
[Pipeline] // timeout
[Pipeline] }
[Pipeline] // stage
[Pipeline] }
[Pipeline] // parallel
[Pipeline] }
[Pipeline] // stage
[Pipeline] stage
[Pipeline] { (Declarative: Post Actions)
[Pipeline] node
Running on H28 in /home/jenkins/jenkins-agent/workspace/Kafka_kafka_trunk
[Pipeline] {
[Pipeline] script
[Pipeline] {
[Pipeline] step
Jenkins build is still unstable: Kafka » Kafka Branch Builder » trunk #263
Posted by Apache Jenkins Server <je...@builds.apache.org>.
See <https://ci-builds.apache.org/job/Kafka/job/kafka/job/trunk/263/display/redirect>
Jenkins build is still unstable: Kafka » Kafka Branch Builder » trunk #262
Posted by Apache Jenkins Server <je...@builds.apache.org>.
See <https://ci-builds.apache.org/job/Kafka/job/kafka/job/trunk/262/display/redirect>
Jenkins build is unstable: Kafka » Kafka Branch Builder » trunk #261
Posted by Apache Jenkins Server <je...@builds.apache.org>.
See <https://ci-builds.apache.org/job/Kafka/job/kafka/job/trunk/261/display/redirect>
Build failed in Jenkins: Kafka » Kafka Branch Builder » trunk #260
Posted by Apache Jenkins Server <je...@builds.apache.org>.
See <https://ci-builds.apache.org/job/Kafka/job/kafka/job/trunk/260/display/redirect>
Changes:
------------------------------------------
[...truncated 409270 lines...]
[2021-06-29T04:35:50.579Z] > Task :clients:compileTestJava UP-TO-DATE
[2021-06-29T04:35:50.579Z] > Task :clients:testClasses UP-TO-DATE
[2021-06-29T04:35:50.579Z] > Task :streams:test-utils:compileJava UP-TO-DATE
[2021-06-29T04:35:50.579Z] > Task :metadata:compileJava UP-TO-DATE
[2021-06-29T04:35:50.579Z] > Task :core:compileJava NO-SOURCE
[2021-06-29T04:35:50.579Z] > Task :streams:generateMetadataFileForMavenJavaPublication
[2021-06-29T04:35:50.579Z] > Task :connect:json:compileTestJava UP-TO-DATE
[2021-06-29T04:35:50.579Z] > Task :connect:json:testClasses UP-TO-DATE
[2021-06-29T04:35:50.579Z] > Task :connect:json:testJar
[2021-06-29T04:35:50.579Z] > Task :connect:json:testSrcJar
[2021-06-29T04:35:50.579Z] > Task :clients:generateMetadataFileForMavenJavaPublication
[2021-06-29T04:35:51.513Z] > Task :core:compileScala UP-TO-DATE
[2021-06-29T04:35:51.513Z] > Task :core:classes UP-TO-DATE
[2021-06-29T04:35:51.513Z] > Task :core:compileTestJava NO-SOURCE
[2021-06-29T04:35:51.513Z] > Task :core:compileTestScala UP-TO-DATE
[2021-06-29T04:35:51.513Z] > Task :core:testClasses UP-TO-DATE
[2021-06-29T04:35:56.553Z] > Task :connect:api:javadoc
[2021-06-29T04:35:56.553Z] > Task :connect:api:copyDependantLibs UP-TO-DATE
[2021-06-29T04:35:56.553Z] > Task :connect:api:jar UP-TO-DATE
[2021-06-29T04:35:56.553Z] > Task :connect:api:generateMetadataFileForMavenJavaPublication
[2021-06-29T04:35:56.553Z] > Task :connect:json:copyDependantLibs UP-TO-DATE
[2021-06-29T04:35:56.553Z] > Task :connect:json:jar UP-TO-DATE
[2021-06-29T04:35:56.553Z] > Task :connect:json:generateMetadataFileForMavenJavaPublication
[2021-06-29T04:35:56.553Z] > Task :connect:api:javadocJar
[2021-06-29T04:35:56.553Z] > Task :connect:json:publishMavenJavaPublicationToMavenLocal
[2021-06-29T04:35:56.553Z] > Task :connect:json:publishToMavenLocal
[2021-06-29T04:35:56.553Z] > Task :connect:api:compileTestJava UP-TO-DATE
[2021-06-29T04:35:56.553Z] > Task :connect:api:testClasses UP-TO-DATE
[2021-06-29T04:35:56.553Z] > Task :connect:api:testJar
[2021-06-29T04:35:56.553Z] > Task :connect:api:testSrcJar
[2021-06-29T04:35:56.553Z] > Task :connect:api:publishMavenJavaPublicationToMavenLocal
[2021-06-29T04:35:56.553Z] > Task :connect:api:publishToMavenLocal
[2021-06-29T04:35:57.487Z]
[2021-06-29T04:35:57.487Z] > Task :streams:javadoc
[2021-06-29T04:35:57.487Z] /home/jenkins/jenkins-agent/workspace/Kafka_kafka_trunk/streams/src/main/java/org/apache/kafka/streams/KafkaStreams.java:142: warning - Tag @link: reference not found: Processor
[2021-06-29T04:35:57.487Z] /home/jenkins/jenkins-agent/workspace/Kafka_kafka_trunk/streams/src/main/java/org/apache/kafka/streams/ThreadMetadata.java:111: warning - Missing closing '}' character for inline tag: "{@code
[2021-06-29T04:35:57.487Z] Objects.hash(
[2021-06-29T04:35:57.487Z] threadName,
[2021-06-29T04:35:57.487Z] threadState,
[2021-06-29T04:35:57.487Z] activeTasks,
[2021-06-29T04:35:57.487Z] standbyTasks,
[2021-06-29T04:35:57.487Z] mainConsumerClientId,
[2021-06-29T04:35:57.487Z] restoreConsumerClientId,
[2021-06-29T04:35:57.487Z] producerClientIds,
[2021-06-29T04:35:57.487Z] adminClientId);
[2021-06-29T04:35:57.487Z] </pre>"
[2021-06-29T04:35:58.421Z] 2 warnings
[2021-06-29T04:35:59.355Z]
[2021-06-29T04:35:59.355Z] > Task :streams:javadocJar
[2021-06-29T04:35:59.355Z] > Task :streams:compileTestJava UP-TO-DATE
[2021-06-29T04:35:59.355Z] > Task :streams:testClasses UP-TO-DATE
[2021-06-29T04:36:00.289Z] > Task :streams:testJar
[2021-06-29T04:36:00.289Z] > Task :streams:testSrcJar
[2021-06-29T04:36:00.289Z] > Task :streams:publishMavenJavaPublicationToMavenLocal
[2021-06-29T04:36:00.289Z] > Task :streams:publishToMavenLocal
[2021-06-29T04:36:02.037Z] > Task :clients:javadoc
[2021-06-29T04:36:03.137Z] > Task :clients:javadocJar
[2021-06-29T04:36:04.395Z] > Task :clients:testJar
[2021-06-29T04:36:04.395Z] > Task :clients:testSrcJar
[2021-06-29T04:36:04.395Z] > Task :clients:publishMavenJavaPublicationToMavenLocal
[2021-06-29T04:36:04.395Z] > Task :clients:publishToMavenLocal
[2021-06-29T04:36:04.395Z]
[2021-06-29T04:36:04.395Z] Deprecated Gradle features were used in this build, making it incompatible with Gradle 8.0.
[2021-06-29T04:36:04.395Z] Use '--warning-mode all' to show the individual deprecation warnings.
[2021-06-29T04:36:04.395Z] See https://docs.gradle.org/7.0.2/userguide/command_line_interface.html#sec:command_line_warnings
[2021-06-29T04:36:04.395Z]
[2021-06-29T04:36:04.395Z] Execution optimizations have been disabled for 2 invalid unit(s) of work during this build to ensure correctness.
[2021-06-29T04:36:04.395Z] Please consult deprecation warnings for more details.
[2021-06-29T04:36:04.395Z]
[2021-06-29T04:36:04.395Z] BUILD SUCCESSFUL in 38s
[2021-06-29T04:36:04.395Z] 71 actionable tasks: 33 executed, 38 up-to-date
[Pipeline] sh
[2021-06-29T04:36:07.833Z] + grep ^version= gradle.properties
[2021-06-29T04:36:07.833Z] + cut -d= -f 2
[Pipeline] dir
[2021-06-29T04:36:08.521Z] Running in /home/jenkins/jenkins-agent/workspace/Kafka_kafka_trunk/streams/quickstart
[Pipeline] {
[Pipeline] sh
[2021-06-29T04:36:10.819Z] + mvn clean install -Dgpg.skip
[2021-06-29T04:36:12.571Z] [INFO] Scanning for projects...
[2021-06-29T04:36:12.571Z] [INFO] ------------------------------------------------------------------------
[2021-06-29T04:36:12.571Z] [INFO] Reactor Build Order:
[2021-06-29T04:36:12.571Z] [INFO]
[2021-06-29T04:36:12.571Z] [INFO] Kafka Streams :: Quickstart [pom]
[2021-06-29T04:36:12.571Z] [INFO] streams-quickstart-java [maven-archetype]
[2021-06-29T04:36:12.571Z] [INFO]
[2021-06-29T04:36:12.571Z] [INFO] ----------------< org.apache.kafka:streams-quickstart >-----------------
[2021-06-29T04:36:12.571Z] [INFO] Building Kafka Streams :: Quickstart 3.0.0-SNAPSHOT [1/2]
[2021-06-29T04:36:12.571Z] [INFO] --------------------------------[ pom ]---------------------------------
[2021-06-29T04:36:13.505Z] [INFO]
[2021-06-29T04:36:13.505Z] [INFO] --- maven-clean-plugin:3.0.0:clean (default-clean) @ streams-quickstart ---
[2021-06-29T04:36:13.505Z] [INFO]
[2021-06-29T04:36:13.505Z] [INFO] --- maven-remote-resources-plugin:1.5:process (process-resource-bundles) @ streams-quickstart ---
[2021-06-29T04:36:14.607Z] [INFO]
[2021-06-29T04:36:14.607Z] [INFO] --- maven-site-plugin:3.5.1:attach-descriptor (attach-descriptor) @ streams-quickstart ---
[2021-06-29T04:36:15.541Z] [INFO]
[2021-06-29T04:36:15.541Z] [INFO] --- maven-gpg-plugin:1.6:sign (sign-artifacts) @ streams-quickstart ---
[2021-06-29T04:36:15.541Z] [INFO]
[2021-06-29T04:36:15.541Z] [INFO] --- maven-install-plugin:2.5.2:install (default-install) @ streams-quickstart ---
[2021-06-29T04:36:15.541Z] [INFO] Installing /home/jenkins/jenkins-agent/workspace/Kafka_kafka_trunk/streams/quickstart/pom.xml to /home/jenkins/.m2/repository/org/apache/kafka/streams-quickstart/3.0.0-SNAPSHOT/streams-quickstart-3.0.0-SNAPSHOT.pom
[2021-06-29T04:36:15.541Z] [INFO]
[2021-06-29T04:36:15.541Z] [INFO] --------------< org.apache.kafka:streams-quickstart-java >--------------
[2021-06-29T04:36:15.541Z] [INFO] Building streams-quickstart-java 3.0.0-SNAPSHOT [2/2]
[2021-06-29T04:36:15.541Z] [INFO] --------------------------[ maven-archetype ]---------------------------
[2021-06-29T04:36:15.541Z] [INFO]
[2021-06-29T04:36:15.541Z] [INFO] --- maven-clean-plugin:3.0.0:clean (default-clean) @ streams-quickstart-java ---
[2021-06-29T04:36:15.541Z] [INFO]
[2021-06-29T04:36:15.541Z] [INFO] --- maven-remote-resources-plugin:1.5:process (process-resource-bundles) @ streams-quickstart-java ---
[2021-06-29T04:36:15.541Z] [INFO]
[2021-06-29T04:36:15.541Z] [INFO] --- maven-resources-plugin:2.7:resources (default-resources) @ streams-quickstart-java ---
[2021-06-29T04:36:15.541Z] [INFO] Using 'UTF-8' encoding to copy filtered resources.
[2021-06-29T04:36:15.541Z] [INFO] Copying 6 resources
[2021-06-29T04:36:15.541Z] [INFO] Copying 3 resources
[2021-06-29T04:36:15.541Z] [INFO]
[2021-06-29T04:36:15.541Z] [INFO] --- maven-resources-plugin:2.7:testResources (default-testResources) @ streams-quickstart-java ---
[2021-06-29T04:36:15.541Z] [INFO] Using 'UTF-8' encoding to copy filtered resources.
[2021-06-29T04:36:15.541Z] [INFO] Copying 2 resources
[2021-06-29T04:36:15.541Z] [INFO] Copying 3 resources
[2021-06-29T04:36:15.541Z] [INFO]
[2021-06-29T04:36:15.541Z] [INFO] --- maven-archetype-plugin:2.2:jar (default-jar) @ streams-quickstart-java ---
[2021-06-29T04:36:16.474Z] [INFO] Building archetype jar: /home/jenkins/jenkins-agent/workspace/Kafka_kafka_trunk/streams/quickstart/java/target/streams-quickstart-java-3.0.0-SNAPSHOT
[2021-06-29T04:36:16.474Z] [INFO]
[2021-06-29T04:36:16.474Z] [INFO] --- maven-site-plugin:3.5.1:attach-descriptor (attach-descriptor) @ streams-quickstart-java ---
[2021-06-29T04:36:16.474Z] [INFO]
[2021-06-29T04:36:16.474Z] [INFO] --- maven-archetype-plugin:2.2:integration-test (default-integration-test) @ streams-quickstart-java ---
[2021-06-29T04:36:16.474Z] [INFO]
[2021-06-29T04:36:16.474Z] [INFO] --- maven-gpg-plugin:1.6:sign (sign-artifacts) @ streams-quickstart-java ---
[2021-06-29T04:36:16.474Z] [INFO]
[2021-06-29T04:36:16.474Z] [INFO] --- maven-install-plugin:2.5.2:install (default-install) @ streams-quickstart-java ---
[2021-06-29T04:36:16.474Z] [INFO] Installing /home/jenkins/jenkins-agent/workspace/Kafka_kafka_trunk/streams/quickstart/java/target/streams-quickstart-java-3.0.0-SNAPSHOT.jar to /home/jenkins/.m2/repository/org/apache/kafka/streams-quickstart-java/3.0.0-SNAPSHOT/streams-quickstart-java-3.0.0-SNAPSHOT.jar
[2021-06-29T04:36:16.474Z] [INFO] Installing /home/jenkins/jenkins-agent/workspace/Kafka_kafka_trunk/streams/quickstart/java/pom.xml to /home/jenkins/.m2/repository/org/apache/kafka/streams-quickstart-java/3.0.0-SNAPSHOT/streams-quickstart-java-3.0.0-SNAPSHOT.pom
[2021-06-29T04:36:16.474Z] [INFO]
[2021-06-29T04:36:16.474Z] [INFO] --- maven-archetype-plugin:2.2:update-local-catalog (default-update-local-catalog) @ streams-quickstart-java ---
[2021-06-29T04:36:16.474Z] [INFO] ------------------------------------------------------------------------
[2021-06-29T04:36:16.474Z] [INFO] Reactor Summary for Kafka Streams :: Quickstart 3.0.0-SNAPSHOT:
[2021-06-29T04:36:16.474Z] [INFO]
[2021-06-29T04:36:16.474Z] [INFO] Kafka Streams :: Quickstart ........................ SUCCESS [ 2.362 s]
[2021-06-29T04:36:16.474Z] [INFO] streams-quickstart-java ............................ SUCCESS [ 0.969 s]
[2021-06-29T04:36:16.474Z] [INFO] ------------------------------------------------------------------------
[2021-06-29T04:36:16.474Z] [INFO] BUILD SUCCESS
[2021-06-29T04:36:16.474Z] [INFO] ------------------------------------------------------------------------
[2021-06-29T04:36:16.474Z] [INFO] Total time: 3.737 s
[2021-06-29T04:36:16.474Z] [INFO] Finished at: 2021-06-29T04:36:15Z
[2021-06-29T04:36:16.474Z] [INFO] ------------------------------------------------------------------------
[Pipeline] dir
[2021-06-29T04:36:16.984Z] Running in /home/jenkins/jenkins-agent/workspace/Kafka_kafka_trunk/streams/quickstart/test-streams-archetype
[Pipeline] {
[Pipeline] sh
[2021-06-29T04:36:19.122Z] + echo Y
[2021-06-29T04:36:19.122Z] + mvn archetype:generate -DarchetypeCatalog=local -DarchetypeGroupId=org.apache.kafka -DarchetypeArtifactId=streams-quickstart-java -DarchetypeVersion=3.0.0-SNAPSHOT -DgroupId=streams.examples -DartifactId=streams.examples -Dversion=0.1 -Dpackage=myapps
[2021-06-29T04:36:20.874Z] [INFO] Scanning for projects...
[2021-06-29T04:36:21.808Z] [INFO]
[2021-06-29T04:36:21.808Z] [INFO] ------------------< org.apache.maven:standalone-pom >-------------------
[2021-06-29T04:36:21.808Z] [INFO] Building Maven Stub Project (No POM) 1
[2021-06-29T04:36:21.808Z] [INFO] --------------------------------[ pom ]---------------------------------
[2021-06-29T04:36:21.808Z] [INFO]
[2021-06-29T04:36:21.808Z] [INFO] >>> maven-archetype-plugin:3.2.0:generate (default-cli) > generate-sources @ standalone-pom >>>
[2021-06-29T04:36:21.808Z] [INFO]
[2021-06-29T04:36:21.808Z] [INFO] <<< maven-archetype-plugin:3.2.0:generate (default-cli) < generate-sources @ standalone-pom <<<
[2021-06-29T04:36:21.808Z] [INFO]
[2021-06-29T04:36:21.808Z] [INFO]
[2021-06-29T04:36:21.808Z] [INFO] --- maven-archetype-plugin:3.2.0:generate (default-cli) @ standalone-pom ---
[2021-06-29T04:36:22.742Z] [INFO] Generating project in Interactive mode
[2021-06-29T04:36:22.742Z] [WARNING] Archetype not found in any catalog. Falling back to central repository.
[2021-06-29T04:36:22.742Z] [WARNING] Add a repository with id 'archetype' in your settings.xml if archetype's repository is elsewhere.
[2021-06-29T04:36:22.742Z] [INFO] Using property: groupId = streams.examples
[2021-06-29T04:36:22.742Z] [INFO] Using property: artifactId = streams.examples
[2021-06-29T04:36:22.742Z] [INFO] Using property: version = 0.1
[2021-06-29T04:36:22.742Z] [INFO] Using property: package = myapps
[2021-06-29T04:36:22.742Z] Confirm properties configuration:
[2021-06-29T04:36:22.742Z] groupId: streams.examples
[2021-06-29T04:36:22.742Z] artifactId: streams.examples
[2021-06-29T04:36:22.742Z] version: 0.1
[2021-06-29T04:36:22.742Z] package: myapps
[2021-06-29T04:36:22.742Z] Y: : [INFO] ----------------------------------------------------------------------------
[2021-06-29T04:36:22.742Z] [INFO] Using following parameters for creating project from Archetype: streams-quickstart-java:3.0.0-SNAPSHOT
[2021-06-29T04:36:22.742Z] [INFO] ----------------------------------------------------------------------------
[2021-06-29T04:36:22.742Z] [INFO] Parameter: groupId, Value: streams.examples
[2021-06-29T04:36:22.742Z] [INFO] Parameter: artifactId, Value: streams.examples
[2021-06-29T04:36:22.742Z] [INFO] Parameter: version, Value: 0.1
[2021-06-29T04:36:22.742Z] [INFO] Parameter: package, Value: myapps
[2021-06-29T04:36:22.742Z] [INFO] Parameter: packageInPathFormat, Value: myapps
[2021-06-29T04:36:22.742Z] [INFO] Parameter: package, Value: myapps
[2021-06-29T04:36:22.742Z] [INFO] Parameter: version, Value: 0.1
[2021-06-29T04:36:22.742Z] [INFO] Parameter: groupId, Value: streams.examples
[2021-06-29T04:36:22.742Z] [INFO] Parameter: artifactId, Value: streams.examples
[2021-06-29T04:36:22.742Z] [INFO] Project created from Archetype in dir: /home/jenkins/jenkins-agent/workspace/Kafka_kafka_trunk/streams/quickstart/test-streams-archetype/streams.examples
[2021-06-29T04:36:22.742Z] [INFO] ------------------------------------------------------------------------
[2021-06-29T04:36:22.742Z] [INFO] BUILD SUCCESS
[2021-06-29T04:36:22.742Z] [INFO] ------------------------------------------------------------------------
[2021-06-29T04:36:22.742Z] [INFO] Total time: 1.837 s
[2021-06-29T04:36:22.742Z] [INFO] Finished at: 2021-06-29T04:36:22Z
[2021-06-29T04:36:22.742Z] [INFO] ------------------------------------------------------------------------
[Pipeline] dir
[2021-06-29T04:36:23.254Z] Running in /home/jenkins/jenkins-agent/workspace/Kafka_kafka_trunk/streams/quickstart/test-streams-archetype/streams.examples
[Pipeline] {
[Pipeline] sh
[2021-06-29T04:36:25.222Z] + mvn compile
[2021-06-29T04:36:27.250Z] [INFO] Scanning for projects...
[2021-06-29T04:36:27.250Z] [INFO]
[2021-06-29T04:36:27.250Z] [INFO] -----------------< streams.examples:streams.examples >------------------
[2021-06-29T04:36:27.250Z] [INFO] Building Kafka Streams Quickstart :: Java 0.1
[2021-06-29T04:36:27.250Z] [INFO] --------------------------------[ jar ]---------------------------------
[2021-06-29T04:36:27.250Z] [INFO]
[2021-06-29T04:36:27.250Z] [INFO] --- maven-resources-plugin:2.6:resources (default-resources) @ streams.examples ---
[2021-06-29T04:36:28.184Z] [INFO] Using 'UTF-8' encoding to copy filtered resources.
[2021-06-29T04:36:28.184Z] [INFO] Copying 1 resource
[2021-06-29T04:36:28.184Z] [INFO]
[2021-06-29T04:36:28.184Z] [INFO] --- maven-compiler-plugin:3.1:compile (default-compile) @ streams.examples ---
[2021-06-29T04:36:28.184Z] [INFO] Changes detected - recompiling the module!
[2021-06-29T04:36:28.184Z] [INFO] Compiling 3 source files to /home/jenkins/jenkins-agent/workspace/Kafka_kafka_trunk/streams/quickstart/test-streams-archetype/streams.examples/target/classes
[2021-06-29T04:36:29.933Z] [INFO] ------------------------------------------------------------------------
[2021-06-29T04:36:29.933Z] [INFO] BUILD SUCCESS
[2021-06-29T04:36:29.933Z] [INFO] ------------------------------------------------------------------------
[2021-06-29T04:36:29.933Z] [INFO] Total time: 2.763 s
[2021-06-29T04:36:29.933Z] [INFO] Finished at: 2021-06-29T04:36:29Z
[2021-06-29T04:36:29.933Z] [INFO] ------------------------------------------------------------------------
[Pipeline] }
[Pipeline] // dir
[Pipeline] }
[Pipeline] // dir
[Pipeline] }
[Pipeline] // dir
[Pipeline] }
[Pipeline] // withEnv
[Pipeline] }
[Pipeline] // withEnv
[Pipeline] }
[Pipeline] // withEnv
[Pipeline] }
[Pipeline] // node
[Pipeline] }
[Pipeline] // timestamps
[Pipeline] }
[Pipeline] // timeout
[Pipeline] }
[Pipeline] // stage
[Pipeline] }
[Pipeline] // parallel
[Pipeline] }
[Pipeline] // stage
[Pipeline] stage
[Pipeline] { (Declarative: Post Actions)
[Pipeline] node
Running on H28 in /home/jenkins/jenkins-agent/workspace/Kafka_kafka_trunk
[Pipeline] {
[Pipeline] script
[Pipeline] {
[Pipeline] step
Jenkins build is unstable: Kafka » Kafka Branch Builder » trunk #259
Posted by Apache Jenkins Server <je...@builds.apache.org>.
See <https://ci-builds.apache.org/job/Kafka/job/kafka/job/trunk/259/display/redirect>
Build failed in Jenkins: Kafka » Kafka Branch Builder » trunk #258
Posted by Apache Jenkins Server <je...@builds.apache.org>.
See <https://ci-builds.apache.org/job/Kafka/job/kafka/job/trunk/258/display/redirect>
Changes:
------------------------------------------
[...truncated 477582 lines...]
[2021-06-28T23:18:35.228Z] > Task :connect:api:testClasses UP-TO-DATE
[2021-06-28T23:18:35.228Z] > Task :connect:api:testJar
[2021-06-28T23:18:35.228Z] > Task :connect:api:testSrcJar
[2021-06-28T23:18:36.264Z] > Task :connect:json:publishMavenJavaPublicationToMavenLocal
[2021-06-28T23:18:36.264Z] > Task :connect:json:publishToMavenLocal
[2021-06-28T23:18:36.264Z] > Task :connect:api:publishMavenJavaPublicationToMavenLocal
[2021-06-28T23:18:36.264Z] > Task :connect:api:publishToMavenLocal
[2021-06-28T23:18:37.494Z]
[2021-06-28T23:18:37.494Z] > Task :streams:javadoc
[2021-06-28T23:18:37.494Z] /home/jenkins/jenkins-agent/workspace/Kafka_kafka_trunk/streams/src/main/java/org/apache/kafka/streams/KafkaStreams.java:142: warning - Tag @link: reference not found: Processor
[2021-06-28T23:18:37.494Z] /home/jenkins/jenkins-agent/workspace/Kafka_kafka_trunk/streams/src/main/java/org/apache/kafka/streams/ThreadMetadata.java:111: warning - Missing closing '}' character for inline tag: "{@code
[2021-06-28T23:18:37.494Z] Objects.hash(
[2021-06-28T23:18:37.494Z] threadName,
[2021-06-28T23:18:37.494Z] threadState,
[2021-06-28T23:18:37.494Z] activeTasks,
[2021-06-28T23:18:37.494Z] standbyTasks,
[2021-06-28T23:18:37.494Z] mainConsumerClientId,
[2021-06-28T23:18:37.494Z] restoreConsumerClientId,
[2021-06-28T23:18:37.494Z] producerClientIds,
[2021-06-28T23:18:37.494Z] adminClientId);
[2021-06-28T23:18:37.494Z] </pre>"
[2021-06-28T23:18:37.503Z] [Checks API] No suitable checks publisher found.
[Pipeline] echo
[2021-06-28T23:18:37.504Z] Skipping Kafka Streams archetype test for Java 11
[Pipeline] }
[Pipeline] // withEnv
[Pipeline] }
[Pipeline] // withEnv
[Pipeline] }
[Pipeline] // withEnv
[Pipeline] }
[Pipeline] // node
[Pipeline] }
[Pipeline] // timestamps
[Pipeline] }
[Pipeline] // timeout
[Pipeline] }
[Pipeline] // stage
[Pipeline] }
[2021-06-28T23:18:38.588Z] 2 warnings
[2021-06-28T23:18:38.588Z]
[2021-06-28T23:18:38.588Z] > Task :streams:javadocJar
[2021-06-28T23:18:40.768Z] > Task :clients:javadoc
[2021-06-28T23:18:40.768Z] > Task :clients:javadocJar
[2021-06-28T23:18:41.861Z] > Task :clients:testJar
[2021-06-28T23:18:43.801Z] > Task :clients:testSrcJar
[2021-06-28T23:18:43.801Z] > Task :clients:publishMavenJavaPublicationToMavenLocal
[2021-06-28T23:18:43.801Z] > Task :clients:publishToMavenLocal
[2021-06-28T23:19:01.705Z] > Task :core:compileScala
[2021-06-28T23:20:12.974Z] > Task :core:classes
[2021-06-28T23:20:12.974Z] > Task :core:compileTestJava NO-SOURCE
[2021-06-28T23:20:41.350Z] > Task :core:compileTestScala
[2021-06-28T23:21:33.343Z] > Task :core:testClasses
[2021-06-28T23:22:01.604Z] > Task :streams:compileTestJava
[2021-06-28T23:23:13.466Z] > Task :streams:testClasses
[2021-06-28T23:23:13.466Z] > Task :streams:testJar
[2021-06-28T23:23:13.466Z] > Task :streams:testSrcJar
[2021-06-28T23:23:13.467Z] > Task :streams:publishMavenJavaPublicationToMavenLocal
[2021-06-28T23:23:13.467Z] > Task :streams:publishToMavenLocal
[2021-06-28T23:23:13.467Z]
[2021-06-28T23:23:13.467Z] Deprecated Gradle features were used in this build, making it incompatible with Gradle 8.0.
[2021-06-28T23:23:13.467Z] Use '--warning-mode all' to show the individual deprecation warnings.
[2021-06-28T23:23:13.467Z] See https://docs.gradle.org/7.0.2/userguide/command_line_interface.html#sec:command_line_warnings
[2021-06-28T23:23:13.467Z]
[2021-06-28T23:23:13.467Z] Execution optimizations have been disabled for 2 invalid unit(s) of work during this build to ensure correctness.
[2021-06-28T23:23:13.467Z] Please consult deprecation warnings for more details.
[2021-06-28T23:23:13.467Z]
[2021-06-28T23:23:13.467Z] BUILD SUCCESSFUL in 5m 5s
[2021-06-28T23:23:13.467Z] 71 actionable tasks: 37 executed, 34 up-to-date
[Pipeline] sh
[2021-06-28T23:23:16.426Z] + grep ^version= gradle.properties
[2021-06-28T23:23:16.426Z] + cut -d= -f 2
[Pipeline] dir
[2021-06-28T23:23:17.108Z] Running in /home/jenkins/jenkins-agent/workspace/Kafka_kafka_trunk/streams/quickstart
[Pipeline] {
[Pipeline] sh
[2021-06-28T23:23:19.222Z] + mvn clean install -Dgpg.skip
[2021-06-28T23:23:21.553Z] [INFO] Scanning for projects...
[2021-06-28T23:23:21.553Z] [INFO] ------------------------------------------------------------------------
[2021-06-28T23:23:21.553Z] [INFO] Reactor Build Order:
[2021-06-28T23:23:21.553Z] [INFO]
[2021-06-28T23:23:21.553Z] [INFO] Kafka Streams :: Quickstart [pom]
[2021-06-28T23:23:21.553Z] [INFO] streams-quickstart-java [maven-archetype]
[2021-06-28T23:23:21.553Z] [INFO]
[2021-06-28T23:23:21.553Z] [INFO] ----------------< org.apache.kafka:streams-quickstart >-----------------
[2021-06-28T23:23:21.553Z] [INFO] Building Kafka Streams :: Quickstart 3.0.0-SNAPSHOT [1/2]
[2021-06-28T23:23:21.553Z] [INFO] --------------------------------[ pom ]---------------------------------
[2021-06-28T23:23:21.553Z] [INFO]
[2021-06-28T23:23:21.553Z] [INFO] --- maven-clean-plugin:3.0.0:clean (default-clean) @ streams-quickstart ---
[2021-06-28T23:23:22.396Z] [INFO]
[2021-06-28T23:23:22.396Z] [INFO] --- maven-remote-resources-plugin:1.5:process (process-resource-bundles) @ streams-quickstart ---
[2021-06-28T23:23:22.396Z] [INFO]
[2021-06-28T23:23:22.396Z] [INFO] --- maven-site-plugin:3.5.1:attach-descriptor (attach-descriptor) @ streams-quickstart ---
[2021-06-28T23:23:23.408Z] [INFO]
[2021-06-28T23:23:23.409Z] [INFO] --- maven-gpg-plugin:1.6:sign (sign-artifacts) @ streams-quickstart ---
[2021-06-28T23:23:24.421Z] [INFO]
[2021-06-28T23:23:24.421Z] [INFO] --- maven-install-plugin:2.5.2:install (default-install) @ streams-quickstart ---
[2021-06-28T23:23:24.421Z] [INFO] Installing /home/jenkins/jenkins-agent/workspace/Kafka_kafka_trunk/streams/quickstart/pom.xml to /home/jenkins/.m2/repository/org/apache/kafka/streams-quickstart/3.0.0-SNAPSHOT/streams-quickstart-3.0.0-SNAPSHOT.pom
[2021-06-28T23:23:24.421Z] [INFO]
[2021-06-28T23:23:24.421Z] [INFO] --------------< org.apache.kafka:streams-quickstart-java >--------------
[2021-06-28T23:23:24.421Z] [INFO] Building streams-quickstart-java 3.0.0-SNAPSHOT [2/2]
[2021-06-28T23:23:24.421Z] [INFO] --------------------------[ maven-archetype ]---------------------------
[2021-06-28T23:23:24.421Z] [INFO]
[2021-06-28T23:23:24.421Z] [INFO] --- maven-clean-plugin:3.0.0:clean (default-clean) @ streams-quickstart-java ---
[2021-06-28T23:23:24.421Z] [INFO]
[2021-06-28T23:23:24.421Z] [INFO] --- maven-remote-resources-plugin:1.5:process (process-resource-bundles) @ streams-quickstart-java ---
[2021-06-28T23:23:24.421Z] [INFO]
[2021-06-28T23:23:24.421Z] [INFO] --- maven-resources-plugin:2.7:resources (default-resources) @ streams-quickstart-java ---
[2021-06-28T23:23:24.421Z] [INFO] Using 'UTF-8' encoding to copy filtered resources.
[2021-06-28T23:23:24.421Z] [INFO] Copying 6 resources
[2021-06-28T23:23:25.433Z] [INFO] Copying 3 resources
[2021-06-28T23:23:25.433Z] [INFO]
[2021-06-28T23:23:25.433Z] [INFO] --- maven-resources-plugin:2.7:testResources (default-testResources) @ streams-quickstart-java ---
[2021-06-28T23:23:25.433Z] [INFO] Using 'UTF-8' encoding to copy filtered resources.
[2021-06-28T23:23:25.433Z] [INFO] Copying 2 resources
[2021-06-28T23:23:25.433Z] [INFO] Copying 3 resources
[2021-06-28T23:23:25.433Z] [INFO]
[2021-06-28T23:23:25.433Z] [INFO] --- maven-archetype-plugin:2.2:jar (default-jar) @ streams-quickstart-java ---
[2021-06-28T23:23:26.614Z] [INFO] Building archetype jar: /home/jenkins/jenkins-agent/workspace/Kafka_kafka_trunk/streams/quickstart/java/target/streams-quickstart-java-3.0.0-SNAPSHOT
[2021-06-28T23:23:26.614Z] [INFO]
[2021-06-28T23:23:26.614Z] [INFO] --- maven-site-plugin:3.5.1:attach-descriptor (attach-descriptor) @ streams-quickstart-java ---
[2021-06-28T23:23:26.614Z] [INFO]
[2021-06-28T23:23:26.614Z] [INFO] --- maven-archetype-plugin:2.2:integration-test (default-integration-test) @ streams-quickstart-java ---
[2021-06-28T23:23:26.614Z] [INFO]
[2021-06-28T23:23:26.614Z] [INFO] --- maven-gpg-plugin:1.6:sign (sign-artifacts) @ streams-quickstart-java ---
[2021-06-28T23:23:26.614Z] [INFO]
[2021-06-28T23:23:26.614Z] [INFO] --- maven-install-plugin:2.5.2:install (default-install) @ streams-quickstart-java ---
[2021-06-28T23:23:26.614Z] [INFO] Installing /home/jenkins/jenkins-agent/workspace/Kafka_kafka_trunk/streams/quickstart/java/target/streams-quickstart-java-3.0.0-SNAPSHOT.jar to /home/jenkins/.m2/repository/org/apache/kafka/streams-quickstart-java/3.0.0-SNAPSHOT/streams-quickstart-java-3.0.0-SNAPSHOT.jar
[2021-06-28T23:23:26.614Z] [INFO] Installing /home/jenkins/jenkins-agent/workspace/Kafka_kafka_trunk/streams/quickstart/java/pom.xml to /home/jenkins/.m2/repository/org/apache/kafka/streams-quickstart-java/3.0.0-SNAPSHOT/streams-quickstart-java-3.0.0-SNAPSHOT.pom
[2021-06-28T23:23:26.614Z] [INFO]
[2021-06-28T23:23:26.614Z] [INFO] --- maven-archetype-plugin:2.2:update-local-catalog (default-update-local-catalog) @ streams-quickstart-java ---
[2021-06-28T23:23:26.614Z] [INFO] ------------------------------------------------------------------------
[2021-06-28T23:23:26.614Z] [INFO] Reactor Summary for Kafka Streams :: Quickstart 3.0.0-SNAPSHOT:
[2021-06-28T23:23:26.614Z] [INFO]
[2021-06-28T23:23:26.614Z] [INFO] Kafka Streams :: Quickstart ........................ SUCCESS [ 2.764 s]
[2021-06-28T23:23:26.614Z] [INFO] streams-quickstart-java ............................ SUCCESS [ 1.807 s]
[2021-06-28T23:23:26.614Z] [INFO] ------------------------------------------------------------------------
[2021-06-28T23:23:26.614Z] [INFO] BUILD SUCCESS
[2021-06-28T23:23:26.614Z] [INFO] ------------------------------------------------------------------------
[2021-06-28T23:23:26.614Z] [INFO] Total time: 4.923 s
[2021-06-28T23:23:26.614Z] [INFO] Finished at: 2021-06-28T23:23:24Z
[2021-06-28T23:23:26.614Z] [INFO] ------------------------------------------------------------------------
[Pipeline] dir
[2021-06-28T23:23:27.121Z] Running in /home/jenkins/jenkins-agent/workspace/Kafka_kafka_trunk/streams/quickstart/test-streams-archetype
[Pipeline] {
[Pipeline] sh
[2021-06-28T23:23:29.993Z] + echo Y
[2021-06-28T23:23:29.993Z] + mvn archetype:generate -DarchetypeCatalog=local -DarchetypeGroupId=org.apache.kafka -DarchetypeArtifactId=streams-quickstart-java -DarchetypeVersion=3.0.0-SNAPSHOT -DgroupId=streams.examples -DartifactId=streams.examples -Dversion=0.1 -Dpackage=myapps
[2021-06-28T23:23:31.009Z] [INFO] Scanning for projects...
[2021-06-28T23:23:32.021Z] [INFO]
[2021-06-28T23:23:32.021Z] [INFO] ------------------< org.apache.maven:standalone-pom >-------------------
[2021-06-28T23:23:32.021Z] [INFO] Building Maven Stub Project (No POM) 1
[2021-06-28T23:23:32.021Z] [INFO] --------------------------------[ pom ]---------------------------------
[2021-06-28T23:23:32.021Z] [INFO]
[2021-06-28T23:23:32.021Z] [INFO] >>> maven-archetype-plugin:3.2.0:generate (default-cli) > generate-sources @ standalone-pom >>>
[2021-06-28T23:23:32.021Z] [INFO]
[2021-06-28T23:23:32.021Z] [INFO] <<< maven-archetype-plugin:3.2.0:generate (default-cli) < generate-sources @ standalone-pom <<<
[2021-06-28T23:23:32.021Z] [INFO]
[2021-06-28T23:23:32.021Z] [INFO]
[2021-06-28T23:23:32.021Z] [INFO] --- maven-archetype-plugin:3.2.0:generate (default-cli) @ standalone-pom ---
[2021-06-28T23:23:33.035Z] [INFO] Generating project in Interactive mode
[2021-06-28T23:23:33.035Z] [WARNING] Archetype not found in any catalog. Falling back to central repository.
[2021-06-28T23:23:33.035Z] [WARNING] Add a repository with id 'archetype' in your settings.xml if archetype's repository is elsewhere.
[2021-06-28T23:23:33.035Z] [INFO] Using property: groupId = streams.examples
[2021-06-28T23:23:33.035Z] [INFO] Using property: artifactId = streams.examples
[2021-06-28T23:23:33.035Z] [INFO] Using property: version = 0.1
[2021-06-28T23:23:33.035Z] [INFO] Using property: package = myapps
[2021-06-28T23:23:33.035Z] Confirm properties configuration:
[2021-06-28T23:23:33.035Z] groupId: streams.examples
[2021-06-28T23:23:33.035Z] artifactId: streams.examples
[2021-06-28T23:23:33.035Z] version: 0.1
[2021-06-28T23:23:33.035Z] package: myapps
[2021-06-28T23:23:33.035Z] Y: : [INFO] ----------------------------------------------------------------------------
[2021-06-28T23:23:33.035Z] [INFO] Using following parameters for creating project from Archetype: streams-quickstart-java:3.0.0-SNAPSHOT
[2021-06-28T23:23:33.035Z] [INFO] ----------------------------------------------------------------------------
[2021-06-28T23:23:33.035Z] [INFO] Parameter: groupId, Value: streams.examples
[2021-06-28T23:23:33.035Z] [INFO] Parameter: artifactId, Value: streams.examples
[2021-06-28T23:23:33.035Z] [INFO] Parameter: version, Value: 0.1
[2021-06-28T23:23:33.035Z] [INFO] Parameter: package, Value: myapps
[2021-06-28T23:23:33.035Z] [INFO] Parameter: packageInPathFormat, Value: myapps
[2021-06-28T23:23:33.035Z] [INFO] Parameter: package, Value: myapps
[2021-06-28T23:23:33.035Z] [INFO] Parameter: version, Value: 0.1
[2021-06-28T23:23:33.035Z] [INFO] Parameter: groupId, Value: streams.examples
[2021-06-28T23:23:33.035Z] [INFO] Parameter: artifactId, Value: streams.examples
[2021-06-28T23:23:33.035Z] [INFO] Project created from Archetype in dir: /home/jenkins/jenkins-agent/workspace/Kafka_kafka_trunk/streams/quickstart/test-streams-archetype/streams.examples
[2021-06-28T23:23:33.035Z] [INFO] ------------------------------------------------------------------------
[2021-06-28T23:23:33.035Z] [INFO] BUILD SUCCESS
[2021-06-28T23:23:33.035Z] [INFO] ------------------------------------------------------------------------
[2021-06-28T23:23:33.035Z] [INFO] Total time: 2.166 s
[2021-06-28T23:23:33.035Z] [INFO] Finished at: 2021-06-28T23:23:31Z
[2021-06-28T23:23:33.035Z] [INFO] ------------------------------------------------------------------------
[Pipeline] dir
[2021-06-28T23:23:33.542Z] Running in /home/jenkins/jenkins-agent/workspace/Kafka_kafka_trunk/streams/quickstart/test-streams-archetype/streams.examples
[Pipeline] {
[Pipeline] sh
[2021-06-28T23:23:36.322Z] + mvn compile
[2021-06-28T23:23:37.205Z] [INFO] Scanning for projects...
[2021-06-28T23:23:37.205Z] [INFO]
[2021-06-28T23:23:37.205Z] [INFO] -----------------< streams.examples:streams.examples >------------------
[2021-06-28T23:23:37.205Z] [INFO] Building Kafka Streams Quickstart :: Java 0.1
[2021-06-28T23:23:37.205Z] [INFO] --------------------------------[ jar ]---------------------------------
[2021-06-28T23:23:37.205Z] [INFO]
[2021-06-28T23:23:37.205Z] [INFO] --- maven-resources-plugin:2.6:resources (default-resources) @ streams.examples ---
[2021-06-28T23:23:37.205Z] [INFO] Using 'UTF-8' encoding to copy filtered resources.
[2021-06-28T23:23:37.205Z] [INFO] Copying 1 resource
[2021-06-28T23:23:37.205Z] [INFO]
[2021-06-28T23:23:37.205Z] [INFO] --- maven-compiler-plugin:3.1:compile (default-compile) @ streams.examples ---
[2021-06-28T23:23:38.217Z] [INFO] Changes detected - recompiling the module!
[2021-06-28T23:23:38.217Z] [INFO] Compiling 3 source files to /home/jenkins/jenkins-agent/workspace/Kafka_kafka_trunk/streams/quickstart/test-streams-archetype/streams.examples/target/classes
[2021-06-28T23:23:40.284Z] [INFO] ------------------------------------------------------------------------
[2021-06-28T23:23:40.284Z] [INFO] BUILD SUCCESS
[2021-06-28T23:23:40.284Z] [INFO] ------------------------------------------------------------------------
[2021-06-28T23:23:40.284Z] [INFO] Total time: 2.390 s
[2021-06-28T23:23:40.284Z] [INFO] Finished at: 2021-06-28T23:23:37Z
[2021-06-28T23:23:40.284Z] [INFO] ------------------------------------------------------------------------
[Pipeline] }
[Pipeline] // dir
[Pipeline] }
[Pipeline] // dir
[Pipeline] }
[Pipeline] // dir
[Pipeline] }
[Pipeline] // withEnv
[Pipeline] }
[Pipeline] // withEnv
[Pipeline] }
[Pipeline] // withEnv
[Pipeline] }
[Pipeline] // node
[Pipeline] }
[Pipeline] // timestamps
[Pipeline] }
[Pipeline] // timeout
[Pipeline] }
[Pipeline] // stage
[Pipeline] }
[Pipeline] // parallel
[Pipeline] }
[Pipeline] // stage
[Pipeline] stage
[Pipeline] { (Declarative: Post Actions)
[Pipeline] node
Still waiting to schedule task
Waiting for next available executor on ‘ubuntu’
Running on H40 in /home/jenkins/jenkins-agent/workspace/Kafka_kafka_trunk
[Pipeline] {
[Pipeline] script
[Pipeline] {
[Pipeline] step