You are viewing a plain text version of this content. The canonical link for it is here.
Posted to issues@tajo.apache.org by Apache Jenkins Server <je...@builds.apache.org> on 2015/01/05 22:51:00 UTC
Build failed in Jenkins: Tajo-master-CODEGEN-build #173
See <https://builds.apache.org/job/Tajo-master-CODEGEN-build/173/changes>
Changes:
[hyunsik] TAJO-1180: digitValue should throw Exception when char is not in valid range. (DaeMyung Kang via hyunsik)
------------------------------------------
[...truncated 402471 lines...]
UNITED KINGDOM,3,23
IRAN,4,10
PERU,1,17
VIETNAM,2,21
ARGENTINA,1,1
EGYPT,4,4
INDIA,2,8
UNITED STATES,1,24
FRANCE,3,6
ETHIOPIA,0,5]
>
TestWindowQuery.firstValue1:258->QueryTestCaseBase.assertResultSet:359->QueryTestCaseBase.assertResultSet:384->QueryTestCaseBase.verifyResultText:500 Result Verification expected:<[l_orderkey,shipmode_first,linenumber_first,suppkey_first,shipdate_first,commitdate_first,extendedprice_first,discount_first
-------------------------------
1,MAIL,1,7311,1996-03-13,1996-02-12 00:00:00,21168.23,0.04
1,MAIL,1,7311,1996-03-13,1996-02-12 00:00:00,21168.23,0.04
2,RAIL,1,1191,1997-01-28,1997-01-14 00:00:00,44694.46,0.0
3,AIR,1,1798,1993-11-09,1993-12-20 00:00:00,46796.47,0.06
3,AIR,1,1798,1993-11-09,1993-12-20 00:00:00,46796.47,0.06]> but was:<[-------------------------------]>
TestWindowQuery.lastValue1:293->QueryTestCaseBase.assertResultSet:359->QueryTestCaseBase.assertResultSet:384->QueryTestCaseBase.verifyResultText:500 Result Verification expected:<[l_orderkey,shipmode_last,linenumber_last,suppkey_last,shipdate_last,commitdate_last,extendedprice_last,discount_last
-------------------------------
1,TRUCK,2,7706,1996-04-12,1996-02-28 00:00:00,45983.16,0.09
1,TRUCK,2,7706,1996-04-12,1996-02-28 00:00:00,45983.16,0.09
2,RAIL,1,1191,1997-01-28,1997-01-14 00:00:00,44694.46,0.0
3,RAIL,2,6540,1994-02-02,1994-01-04 00:00:00,54058.05,0.1
3,RAIL,2,6540,1994-02-02,1994-01-04 00:00:00,54058.05,0.1]> but was:<[-------------------------------]>
TestCTASQuery.testCtasWithManagedTable:232 null
TestJoinQuery.testLeftOuterJoinWithEmptyTable5:436->QueryTestCaseBase.assertResultSet:359->QueryTestCaseBase.assertResultSet:384->QueryTestCaseBase.verifyResultText:500 Result Verification expected:<[l_linenumber,?sum,?max_1,?max_2,?avg_3,?sum_4
-------------------------------
1,0,,,33.333333333333336,100.0
2,0,,,42.5,85.0]> but was:<[-------------------------------]>
TestJoinQuery.testLeftOuterJoinWithEmptyTable5:436->QueryTestCaseBase.assertResultSet:359->QueryTestCaseBase.assertResultSet:384->QueryTestCaseBase.verifyResultText:500 Result Verification expected:<[l_linenumber,?sum,?max_1,?max_2,?avg_3,?sum_4
-------------------------------
1,0,,,33.333333333333336,100.0
2,0,,,42.5,85.0]> but was:<[-------------------------------]>
TestJoinQuery.testLeftOuterJoinWithEmptyTable5:436->QueryTestCaseBase.assertResultSet:359->QueryTestCaseBase.assertResultSet:384->QueryTestCaseBase.verifyResultText:500 Result Verification expected:<[l_linenumber,?sum,?max_1,?max_2,?avg_3,?sum_4
-------------------------------
1,0,,,33.333333333333336,100.0
2,0,,,42.5,85.0]> but was:<[-------------------------------]>
TestJoinQuery.testLeftOuterJoinWithEmptyTable5:436->QueryTestCaseBase.assertResultSet:359->QueryTestCaseBase.assertResultSet:384->QueryTestCaseBase.verifyResultText:500 Result Verification expected:<[l_linenumber,?sum,?max_1,?max_2,?avg_3,?sum_4
-------------------------------
1,0,,,33.333333333333336,100.0
2,0,,,42.5,85.0]> but was:<[-------------------------------]>
TestGroupByQuery.testDistinctAggregationCasebyCase9:410->QueryTestCaseBase.assertResultSet:370->QueryTestCaseBase.assertResultSet:384->QueryTestCaseBase.verifyResultText:500 Result Verification expected:<[l_orderkey,cnt1,value2,l_partkey,avg1,cnt2
-------------------------------
1,1,28.0,1,26.5,2
2,1,39.0,2,38.0,1
3,1,46.0,2,45.0,1
3,1,51.0,3,49.0,1]> but was:<[-------------------------------]>
TestGroupByQuery.testGroupbyWithJson:581->QueryTestCaseBase.assertResultSet:359->QueryTestCaseBase.assertResultSet:384->QueryTestCaseBase.verifyResultText:500 Result Verification expected:<[l_orderkey,total,num
-------------------------------
3,2.5,3
2,2.0,1
1,1.0,3]> but was:<[-------------------------------]>
TestGroupByQuery.testHavingWithAggFunction:572->QueryTestCaseBase.assertResultSet:359->QueryTestCaseBase.assertResultSet:384->QueryTestCaseBase.verifyResultText:500 Result Verification expected:<[l_orderkey,total,num
-------------------------------
3,2.5,3
2,2.0,1]> but was:<[-------------------------------]>
TestGroupByQuery.testHavingWithNamedTarget:563->QueryTestCaseBase.assertResultSet:359->QueryTestCaseBase.assertResultSet:384->QueryTestCaseBase.verifyResultText:500 Result Verification expected:<[l_orderkey,total,num
-------------------------------
1,1.0,3
2,2.0,1
3,2.5,3]> but was:<[-------------------------------]>
TestGroupByQuery.testDistinctAggregationCasebyCase11:447 expected:<[id,?count_4,?avg_5,?min_6,?max_7,?sum_8,?cast_9,?cast_10,?cast_11,?cast_12
-------------------------------
1,2,4.0,0,5,12,4,0,5,12
2,3,2.0,0,3,6,7,0,8,21]
> but was:<[
-------------------------------]
>
TestGroupByQuery.testDistinctAggregationCasebyCase9:410->QueryTestCaseBase.assertResultSet:370->QueryTestCaseBase.assertResultSet:384->QueryTestCaseBase.verifyResultText:500 Result Verification expected:<[l_orderkey,cnt1,value2,l_partkey,avg1,cnt2
-------------------------------
1,1,28.0,1,26.5,2
2,1,39.0,2,38.0,1
3,1,46.0,2,45.0,1
3,1,51.0,3,49.0,1]> but was:<[-------------------------------]>
TestGroupByQuery.testGroupbyWithJson:581->QueryTestCaseBase.assertResultSet:359->QueryTestCaseBase.assertResultSet:384->QueryTestCaseBase.verifyResultText:500 Result Verification expected:<[l_orderkey,total,num
-------------------------------
3,2.5,3
2,2.0,1
1,1.0,3]> but was:<[-------------------------------]>
TestGroupByQuery.testHavingWithAggFunction:572->QueryTestCaseBase.assertResultSet:359->QueryTestCaseBase.assertResultSet:384->QueryTestCaseBase.verifyResultText:500 Result Verification expected:<[l_orderkey,total,num
-------------------------------
3,2.5,3
2,2.0,1]> but was:<[-------------------------------]>
TestGroupByQuery.testHavingWithNamedTarget:563->QueryTestCaseBase.assertResultSet:359->QueryTestCaseBase.assertResultSet:384->QueryTestCaseBase.verifyResultText:500 Result Verification expected:<[l_orderkey,total,num
-------------------------------
1,1.0,3
2,2.0,1
3,2.5,3]> but was:<[-------------------------------]>
TestSelectQuery.testSimpleQueryWithLimitPartitionedTable:93->QueryTestCaseBase.assertResultSet:359->QueryTestCaseBase.assertResultSet:384->QueryTestCaseBase.verifyResultText:500 Result Verification expected:<...-------------------
[3,Customer#000000003,MG9kdTD2WBHm,11-719-748-3364,7498.12,AUTOMOBILE, deposits eat slyly ironic, even instructions. express foxes detect slyly. blithely even accounts abov,1
3,Customer#000000003,MG9kdTD2WBHm,11-719-748-3364,7498.12,AUTOMOBILE, deposits eat slyly ironic, even instructions. express foxes detect slyly. blithely even accounts abov,1
3,Customer#000000003,MG9kdTD2WBHm,11-719-748-3364,7498.12,AUTOMOBILE, deposits eat slyly ironic, even instructions. express foxes detect slyly. blithely even accounts abov,1
3,Customer#000000003,MG9kdTD2WBHm,11-719-748-3364,7498.12,AUTOMOBILE, deposits eat slyly ironic, even instructions. express foxes detect slyly. blithely even accounts abov,1
3,Customer#000000003,MG9kdTD2WBHm,11-719-748-3364,7498.12,AUTOMOBILE, deposits eat slyly ironic, even instructions. express foxes detect slyly. blithely even accounts abov,1
2,Customer#000000002,XSTf4,NCwDVaWNe6tEgvwfmRchLXak,23-768-687-3665,121.65,AUTOMOBILE,l accounts. blithely ironic theodolites integrate boldly: caref,13
2,Customer#000000002,XSTf4,NCwDVaWNe6tEgvwfmRchLXak,23-768-687-3665,121.65,AUTOMOBILE,l accounts. blithely ironic theodolites integrate boldly: caref,13
2,Customer#000000002,XSTf4,NCwDVaWNe6tEgvwfmRchLXak,23-768-687-3665,121.65,AUTOMOBILE,l accounts. blithely ironic theodolites integrate boldly: caref,13]
2,Customer#00000000...> but was:<...-------------------
[1,Customer#000000001,IVhzIApeRb ot,c,E,25-989-741-2988,711.56,BUILDING,to the even, regular platelets. regular, ironic epitaphs nag e,15
1,Customer#000000001,IVhzIApeRb ot,c,E,25-989-741-2988,711.56,BUILDING,to the even, regular platelets. regular, ironic epitaphs nag e,15
1,Customer#000000001,IVhzIApeRb ot,c,E,25-989-741-2988,711.56,BUILDING,to the even, regular platelets. regular, ironic epitaphs nag e,15
1,Customer#000000001,IVhzIApeRb ot,c,E,25-989-741-2988,711.56,BUILDING,to the even, regular platelets. regular, ironic epitaphs nag e,15
4,Customer#000000004,XxVSJsLAGtn,14-128-190-5944,2866.83,MACHINERY, requests. final, regular ideas sleep final accou,4
4,Customer#000000004,XxVSJsLAGtn,14-128-190-5944,2866.83,MACHINERY, requests. final, regular ideas sleep final accou,4
4,Customer#000000004,XxVSJsLAGtn,14-128-190-5944,2866.83,MACHINERY, requests. final, regular ideas sleep final accou,4
4,Customer#000000004,XxVSJsLAGtn,14-128-190-5944,2866.83,MACHINERY, requests. final, regular ideas sleep final accou,4]
2,Customer#00000000...>
TestBuiltinFunctions.testAvgLong:81->QueryTestCaseBase.assertResultSet:359->QueryTestCaseBase.assertResultSet:384->QueryTestCaseBase.verifyResultText:500 Result Verification expected:<[total_avg
-------------------------------
2.0]> but was:<[-------------------------------]>
TestBuiltinFunctions.testAvgDouble:74->QueryTestCaseBase.assertResultSet:359->QueryTestCaseBase.assertResultSet:384->QueryTestCaseBase.verifyResultText:500 Result Verification expected:<[l_orderkey,revenue
-------------------------------
1,0.065
2,0.0
3,0.08]> but was:<[-------------------------------]>
TestBuiltinFunctions.testAvgInt:88->QueryTestCaseBase.assertResultSet:359->QueryTestCaseBase.assertResultSet:384->QueryTestCaseBase.verifyResultText:500 Result Verification expected:<[total_avg
-------------------------------
1.8]> but was:<[-------------------------------]>
Tests in error:
TestTablePartitions.testColumnPartitionedTableByThreeColumns:314 » IllegalArgument
TestTablePartitions.testColumnPartitionedTableByTwoColumnsWithCompression:594 » IllegalArgument
TestTablePartitions.testQueryCasesOnColumnPartitionedTable:231->assertPartitionDirectories:205 » IllegalArgument
TestTablePartitions.testColumnPartitionedTableByOneColumn:185->assertPartitionDirectories:205 » IllegalArgument
TestTablePartitions.testInsertIntoColumnPartitionedTableByThreeColumns:378 » IllegalArgument
TestTablePartitions.testColumnPartitionedTableNoMatchedPartition:722 » IllegalArgument
TestTablePartitions.testColumnPartitionedTableByThreeColumnsWithCompression:639 » IllegalArgument
TestTablePartitions.testColumnPartitionedTableByOneColumnsWithCompression:557 » IllegalArgument
TestInsertQuery.testInsertOverwriteWithCompression:488 » IllegalArgument Wrong...
TestInsertQuery.testInsertOverwriteWithUnionDifferentAlias:756->QueryTestCaseBase.executeFile:339 » Service
TestInsertQuery.testInsertOverwriteTableWithNonFromQuery2:669->QueryTestCaseBase.executeString:293 » Service
TestInsertQuery.testInsertOverwriteWithDatabase:615->QueryTestCaseBase.executeFile:339 » Service
TestInsertQuery.testInsertOverwriteTableWithNonFromQuery:634->QueryTestCaseBase.executeString:293 » Service
TestInsertQuery.testInsertInto:69->QueryTestCaseBase.executeFile:339 » Service
TestInsertQuery.testInsertOverwriteSmallerColumns:304->QueryTestCaseBase.executeFile:339 » Service
TestInsertQuery.testInsertOverwrite:49->QueryTestCaseBase.executeFile:339 » Service
TestCTASQuery.testCtasWithGroupby:150->QueryTestCaseBase.executeQuery:303->QueryTestCaseBase.executeFile:339 » Service
TestCTASQuery.testCtasWithLimit:170->QueryTestCaseBase.executeQuery:303->QueryTestCaseBase.executeFile:339 » Service
TestCTASQuery.testCtasWithUnion:180->QueryTestCaseBase.executeQuery:303->QueryTestCaseBase.executeFile:339 » Service
TestCTASQuery.testCtasWithOptions:204->QueryTestCaseBase.executeQuery:303->QueryTestCaseBase.executeFile:339 » Service
TestCTASQuery.testCtasWithStoreType:190->QueryTestCaseBase.executeQuery:303->QueryTestCaseBase.executeFile:339 » Service
TestCTASQuery.testCtasWithOrderby:160->QueryTestCaseBase.executeQuery:303->QueryTestCaseBase.executeFile:339 » Service
TestCreateTable.testCreatedTableWithQuotedIdentifierAndVerifyPath:139->assertPathOfCreatedTable:110 » IllegalArgument
TestCreateTable.testCreatedTableJustCreatedAndVerifyPath:133->assertPathOfCreatedTable:110 » IllegalArgument
TestGroupByQuery.testDistinctAggregationCaseByCase3:497 » Service java.sql.SQL...
TestGroupByQuery.testDistinctAggregationCasebyCase11:435 » Service java.sql.SQ...
TestPredicates.testInPredicateWithConstant:307->ExprTestBase.testEval:196->ExprTestBase.testEval:281 » Compilation
TestPredicates.testIsNullPredicateWithFunction:361->ExprTestBase.testEval:196->ExprTestBase.testEval:281 » Compilation
TestSQLExpression.testCastFromTable:888->ExprTestBase.testEval:203->ExprTestBase.testEval:284 » NoSuchMethod
TestSQLExpression.testQuotedIdentifiers:47->ExprTestBase.testEval:196->ExprTestBase.testEval:281 » Compilation
TestEvalCodeGenerator.testStringConcat:308->ExprTestBase.testEval:196->ExprTestBase.testEval:281 » Compilation
TestDateTimeFunctions.testDatePart:242->ExprTestBase.testEval:196->ExprTestBase.testEval:281 » Compilation
TestDateTimeFunctions.testExtract:125->ExprTestBase.testEval:196->ExprTestBase.testEval:281 » Compilation
TestStringOperatorsAndFunctions.testRegexReplace:140->ExprTestBase.testEval:196->ExprTestBase.testEval:281 » Compilation
TestStringOperatorsAndFunctions.testOctetLength:351->ExprTestBase.testEval:196->ExprTestBase.testEval:281 » Compilation
TestStringOperatorsAndFunctions.testChr:521->ExprTestBase.testEval:196->ExprTestBase.testEval:281 » Compilation
TestStringOperatorsAndFunctions.testMd5:294->ExprTestBase.testEval:196->ExprTestBase.testEval:281 » Compilation
TestStringOperatorsAndFunctions.testAscii:505->ExprTestBase.testEval:196->ExprTestBase.testEval:281 » Compilation
TestStringOperatorsAndFunctions.testLTrim:75->ExprTestBase.testEval:196->ExprTestBase.testEval:281 » Compilation
TestStringOperatorsAndFunctions.testLower:256->ExprTestBase.testEval:196->ExprTestBase.testEval:281 » Compilation
TestStringOperatorsAndFunctions.testRTrim:96->ExprTestBase.testEval:196->ExprTestBase.testEval:281 » Compilation
TestStringOperatorsAndFunctions.testRight:202->ExprTestBase.testEval:196->ExprTestBase.testEval:281 » Compilation
TestStringOperatorsAndFunctions.testUpper:243->ExprTestBase.testEval:196->ExprTestBase.testEval:281 » Compilation
TestStringOperatorsAndFunctions.testLeft:173->ExprTestBase.testEval:196->ExprTestBase.testEval:281 » Compilation
TestStringOperatorsAndFunctions.testTrim:117->ExprTestBase.testEval:196->ExprTestBase.testEval:281 » Compilation
TestStringOperatorsAndFunctions.testCharLength:269->ExprTestBase.testEval:196->ExprTestBase.testEval:281 » Compilation
TestStringOperatorsAndFunctions.testBitLength:457->ExprTestBase.testEval:196->ExprTestBase.testEval:281 » Compilation
TestStringOperatorsAndFunctions.testReverse:217->ExprTestBase.testEval:196->ExprTestBase.testEval:281 » Compilation
TestStringOperatorsAndFunctions.testSplitPart:367->ExprTestBase.testEval:196->ExprTestBase.testEval:281 » Compilation
TestStringOperatorsAndFunctions.testFindInSet:593->ExprTestBase.testEval:209->ExprTestBase.testEval:281 » Compilation
TestStringOperatorsAndFunctions.testLength:281->ExprTestBase.testEval:196->ExprTestBase.testEval:281 » Compilation
TestStringOperatorsAndFunctions.testLocate:439->ExprTestBase.testEval:196->ExprTestBase.testEval:281 » Compilation
TestStringOperatorsAndFunctions.testRepeat:231->ExprTestBase.testEval:196->ExprTestBase.testEval:281 » Compilation
TestStringOperatorsAndFunctions.testStrpos:473->ExprTestBase.testEval:196->ExprTestBase.testEval:281 » Compilation
TestStringOperatorsAndFunctions.testSubstr:396->ExprTestBase.testEval:196->ExprTestBase.testEval:281 » Compilation
TestStringOperatorsAndFunctions.testStrposb:489->ExprTestBase.testEval:196->ExprTestBase.testEval:281 » Compilation
TestMathFunctions.testRoundWithSpecifiedPrecision:469->ExprTestBase.testEval:196->ExprTestBase.testEval:281 » Compilation
TestMathFunctions.testAbs:344->ExprTestBase.testEval:196->ExprTestBase.testEval:281 » Compilation
TestMathFunctions.testCos:144->ExprTestBase.testEval:196->ExprTestBase.testEval:281 » Compilation
TestMathFunctions.testDiv:257->ExprTestBase.testEval:196->ExprTestBase.testEval:281 » Compilation
TestMathFunctions.testExp:321->ExprTestBase.testEval:196->ExprTestBase.testEval:281 » Compilation
TestMathFunctions.testMod:241->ExprTestBase.testEval:196->ExprTestBase.testEval:281 » Compilation
TestMathFunctions.testPow:409->ExprTestBase.testEval:196->ExprTestBase.testEval:281 » Compilation
TestMathFunctions.testSin:127->ExprTestBase.testEval:196->ExprTestBase.testEval:281 » Compilation
TestMathFunctions.testTan:160->ExprTestBase.testEval:196->ExprTestBase.testEval:281 » Compilation
TestMathFunctions.testAtan2:225->ExprTestBase.testEval:196->ExprTestBase.testEval:281 » Compilation
TestMathFunctions.testFloor:73->ExprTestBase.testEval:196->ExprTestBase.testEval:281 » Compilation
TestMathFunctions.testRound:45->ExprTestBase.testEval:196->ExprTestBase.testEval:281 » Compilation
TestMathFunctions.testAcos:192->ExprTestBase.testEval:196->ExprTestBase.testEval:281 » Compilation
TestMathFunctions.testAsin:176->ExprTestBase.testEval:196->ExprTestBase.testEval:281 » Compilation
TestMathFunctions.testAtan:208->ExprTestBase.testEval:196->ExprTestBase.testEval:281 » Compilation
TestMathFunctions.testCbrt:364->ExprTestBase.testEval:196->ExprTestBase.testEval:281 » Compilation
TestMathFunctions.testCeil:92->ExprTestBase.testEval:196->ExprTestBase.testEval:281 » Compilation
TestMathFunctions.testSign:273->ExprTestBase.testEval:196->ExprTestBase.testEval:281 » Compilation
TestMathFunctions.testSqrt:298->ExprTestBase.testEval:196->ExprTestBase.testEval:281 » Compilation
TestMathFunctions.testCeiling:111->ExprTestBase.testEval:196->ExprTestBase.testEval:281 » Compilation
TestMathFunctions.testRadians:428->ExprTestBase.testEval:196->ExprTestBase.testEval:281 » Compilation
TestMathFunctions.testDegrees:387->ExprTestBase.testEval:196->ExprTestBase.testEval:281 » Compilation
Tests run: 1336, Failures: 29, Errors: 78, Skipped: 0
[INFO] ------------------------------------------------------------------------
[INFO] Reactor Summary:
[INFO]
[INFO] Tajo Main ......................................... SUCCESS [ 1.588 s]
[INFO] Tajo Project POM .................................. SUCCESS [ 1.162 s]
[INFO] Tajo Maven Plugins ................................ SUCCESS [ 2.774 s]
[INFO] Tajo Common ....................................... SUCCESS [ 24.028 s]
[INFO] Tajo Algebra ...................................... SUCCESS [ 1.300 s]
[INFO] Tajo Catalog Common ............................... SUCCESS [ 6.408 s]
[INFO] Tajo Plan ......................................... SUCCESS [ 5.679 s]
[INFO] Tajo Rpc .......................................... SUCCESS [ 25.583 s]
[INFO] Tajo Catalog Client ............................... SUCCESS [ 0.989 s]
[INFO] Tajo Catalog Server ............................... SUCCESS [ 9.877 s]
[INFO] Tajo Storage Common ............................... SUCCESS [ 10.437 s]
[INFO] Tajo HDFS Storage ................................. SUCCESS [ 41.015 s]
[INFO] Tajo HBase Storage ................................ SUCCESS [ 2.478 s]
[INFO] Tajo PullServer ................................... SUCCESS [ 0.871 s]
[INFO] Tajo Client ....................................... SUCCESS [ 3.458 s]
[INFO] Tajo JDBC Driver .................................. SUCCESS [ 0.569 s]
[INFO] ASM (thirdparty) .................................. SUCCESS [ 0.602 s]
[INFO] Tajo Core ......................................... FAILURE [16:15 min]
[INFO] Tajo Catalog Drivers .............................. SKIPPED
[INFO] Tajo Catalog ...................................... SKIPPED
[INFO] Tajo Storage ...................................... SKIPPED
[INFO] Tajo Distribution ................................. SKIPPED
[INFO] ------------------------------------------------------------------------
[INFO] BUILD FAILURE
[INFO] ------------------------------------------------------------------------
[INFO] Total time: 18:35 min
[INFO] Finished at: 2015-01-05T21:50:52+00:00
[INFO] Final Memory: 94M/1075M
[INFO] ------------------------------------------------------------------------
[ERROR] Failed to execute goal org.apache.maven.plugins:maven-surefire-plugin:2.17:test (default-test) on project tajo-core: There are test failures.
[ERROR]
[ERROR] Please refer to <https://builds.apache.org/job/Tajo-master-CODEGEN-build/ws/tajo-core/target/surefire-reports> for the individual test results.
[ERROR] -> [Help 1]
[ERROR]
[ERROR] To see the full stack trace of the errors, re-run Maven with the -e switch.
[ERROR] Re-run Maven using the -X switch to enable full debug logging.
[ERROR]
[ERROR] For more information about the errors and possible solutions, please read the following articles:
[ERROR] [Help 1] http://cwiki.apache.org/confluence/display/MAVEN/MojoFailureException
[ERROR]
[ERROR] After correcting the problems, you can resume the build with the command
[ERROR] mvn <goals> -rf :tajo-core
Build step 'Execute shell' marked build as failure
Updating TAJO-1180
Build failed in Jenkins: Tajo-master-CODEGEN-build #177
Posted by Apache Jenkins Server <je...@builds.apache.org>.
See <https://builds.apache.org/job/Tajo-master-CODEGEN-build/177/changes>
Changes:
[blrunner] TAJO-1285: Refactoring Magic Number to HAConstants. (DaeMyung Kang via jaehwa)
------------------------------------------
[...truncated 402479 lines...]
UNITED KINGDOM,3,23
IRAN,4,10
PERU,1,17
VIETNAM,2,21
ARGENTINA,1,1
EGYPT,4,4
INDIA,2,8
UNITED STATES,1,24
FRANCE,3,6
ETHIOPIA,0,5]
>
TestWindowQuery.firstValue1:258->QueryTestCaseBase.assertResultSet:359->QueryTestCaseBase.assertResultSet:384->QueryTestCaseBase.verifyResultText:500 Result Verification expected:<[l_orderkey,shipmode_first,linenumber_first,suppkey_first,shipdate_first,commitdate_first,extendedprice_first,discount_first
-------------------------------
1,MAIL,1,7311,1996-03-13,1996-02-12 00:00:00,21168.23,0.04
1,MAIL,1,7311,1996-03-13,1996-02-12 00:00:00,21168.23,0.04
2,RAIL,1,1191,1997-01-28,1997-01-14 00:00:00,44694.46,0.0
3,AIR,1,1798,1993-11-09,1993-12-20 00:00:00,46796.47,0.06
3,AIR,1,1798,1993-11-09,1993-12-20 00:00:00,46796.47,0.06]> but was:<[-------------------------------]>
TestWindowQuery.lastValue1:293->QueryTestCaseBase.assertResultSet:359->QueryTestCaseBase.assertResultSet:384->QueryTestCaseBase.verifyResultText:500 Result Verification expected:<[l_orderkey,shipmode_last,linenumber_last,suppkey_last,shipdate_last,commitdate_last,extendedprice_last,discount_last
-------------------------------
1,TRUCK,2,7706,1996-04-12,1996-02-28 00:00:00,45983.16,0.09
1,TRUCK,2,7706,1996-04-12,1996-02-28 00:00:00,45983.16,0.09
2,RAIL,1,1191,1997-01-28,1997-01-14 00:00:00,44694.46,0.0
3,RAIL,2,6540,1994-02-02,1994-01-04 00:00:00,54058.05,0.1
3,RAIL,2,6540,1994-02-02,1994-01-04 00:00:00,54058.05,0.1]> but was:<[-------------------------------]>
TestCTASQuery.testCtasWithManagedTable:232 null
TestJoinQuery.testLeftOuterJoinWithEmptyTable5:436->QueryTestCaseBase.assertResultSet:359->QueryTestCaseBase.assertResultSet:384->QueryTestCaseBase.verifyResultText:500 Result Verification expected:<[l_linenumber,?sum,?max_1,?max_2,?avg_3,?sum_4
-------------------------------
1,0,,,33.333333333333336,100.0
2,0,,,42.5,85.0]> but was:<[-------------------------------]>
TestJoinQuery.testLeftOuterJoinWithEmptyTable5:436->QueryTestCaseBase.assertResultSet:359->QueryTestCaseBase.assertResultSet:384->QueryTestCaseBase.verifyResultText:500 Result Verification expected:<[l_linenumber,?sum,?max_1,?max_2,?avg_3,?sum_4
-------------------------------
1,0,,,33.333333333333336,100.0
2,0,,,42.5,85.0]> but was:<[-------------------------------]>
TestJoinQuery.testLeftOuterJoinWithEmptyTable5:436->QueryTestCaseBase.assertResultSet:359->QueryTestCaseBase.assertResultSet:384->QueryTestCaseBase.verifyResultText:500 Result Verification expected:<[l_linenumber,?sum,?max_1,?max_2,?avg_3,?sum_4
-------------------------------
1,0,,,33.333333333333336,100.0
2,0,,,42.5,85.0]> but was:<[-------------------------------]>
TestJoinQuery.testLeftOuterJoinWithEmptyTable5:436->QueryTestCaseBase.assertResultSet:359->QueryTestCaseBase.assertResultSet:384->QueryTestCaseBase.verifyResultText:500 Result Verification expected:<[l_linenumber,?sum,?max_1,?max_2,?avg_3,?sum_4
-------------------------------
1,0,,,33.333333333333336,100.0
2,0,,,42.5,85.0]> but was:<[-------------------------------]>
TestGroupByQuery.testDistinctAggregationCasebyCase9:410->QueryTestCaseBase.assertResultSet:370->QueryTestCaseBase.assertResultSet:384->QueryTestCaseBase.verifyResultText:500 Result Verification expected:<[l_orderkey,cnt1,value2,l_partkey,avg1,cnt2
-------------------------------
1,1,28.0,1,26.5,2
2,1,39.0,2,38.0,1
3,1,46.0,2,45.0,1
3,1,51.0,3,49.0,1]> but was:<[-------------------------------]>
TestGroupByQuery.testGroupbyWithJson:581->QueryTestCaseBase.assertResultSet:359->QueryTestCaseBase.assertResultSet:384->QueryTestCaseBase.verifyResultText:500 Result Verification expected:<[l_orderkey,total,num
-------------------------------
3,2.5,3
2,2.0,1
1,1.0,3]> but was:<[-------------------------------]>
TestGroupByQuery.testHavingWithAggFunction:572->QueryTestCaseBase.assertResultSet:359->QueryTestCaseBase.assertResultSet:384->QueryTestCaseBase.verifyResultText:500 Result Verification expected:<[l_orderkey,total,num
-------------------------------
3,2.5,3
2,2.0,1]> but was:<[-------------------------------]>
TestGroupByQuery.testHavingWithNamedTarget:563->QueryTestCaseBase.assertResultSet:359->QueryTestCaseBase.assertResultSet:384->QueryTestCaseBase.verifyResultText:500 Result Verification expected:<[l_orderkey,total,num
-------------------------------
1,1.0,3
2,2.0,1
3,2.5,3]> but was:<[-------------------------------]>
TestGroupByQuery.testDistinctAggregationCasebyCase11:447 expected:<[id,?count_4,?avg_5,?min_6,?max_7,?sum_8,?cast_9,?cast_10,?cast_11,?cast_12
-------------------------------
1,2,4.0,0,5,12,4,0,5,12
2,3,2.0,0,3,6,7,0,8,21]
> but was:<[
-------------------------------]
>
TestGroupByQuery.testDistinctAggregationCasebyCase9:410->QueryTestCaseBase.assertResultSet:370->QueryTestCaseBase.assertResultSet:384->QueryTestCaseBase.verifyResultText:500 Result Verification expected:<[l_orderkey,cnt1,value2,l_partkey,avg1,cnt2
-------------------------------
1,1,28.0,1,26.5,2
2,1,39.0,2,38.0,1
3,1,46.0,2,45.0,1
3,1,51.0,3,49.0,1]> but was:<[-------------------------------]>
TestGroupByQuery.testGroupbyWithJson:581->QueryTestCaseBase.assertResultSet:359->QueryTestCaseBase.assertResultSet:384->QueryTestCaseBase.verifyResultText:500 Result Verification expected:<[l_orderkey,total,num
-------------------------------
3,2.5,3
2,2.0,1
1,1.0,3]> but was:<[-------------------------------]>
TestGroupByQuery.testHavingWithAggFunction:572->QueryTestCaseBase.assertResultSet:359->QueryTestCaseBase.assertResultSet:384->QueryTestCaseBase.verifyResultText:500 Result Verification expected:<[l_orderkey,total,num
-------------------------------
3,2.5,3
2,2.0,1]> but was:<[-------------------------------]>
TestGroupByQuery.testHavingWithNamedTarget:563->QueryTestCaseBase.assertResultSet:359->QueryTestCaseBase.assertResultSet:384->QueryTestCaseBase.verifyResultText:500 Result Verification expected:<[l_orderkey,total,num
-------------------------------
1,1.0,3
2,2.0,1
3,2.5,3]> but was:<[-------------------------------]>
TestSelectQuery.testSimpleQueryWithLimitPartitionedTable:93->QueryTestCaseBase.assertResultSet:359->QueryTestCaseBase.assertResultSet:384->QueryTestCaseBase.verifyResultText:500 Result Verification expected:<...-------------------
[3,Customer#000000003,MG9kdTD2WBHm,11-719-748-3364,7498.12,AUTOMOBILE, deposits eat slyly ironic, even instructions. express foxes detect slyly. blithely even accounts abov,1
3,Customer#000000003,MG9kdTD2WBHm,11-719-748-3364,7498.12,AUTOMOBILE, deposits eat slyly ironic, even instructions. express foxes detect slyly. blithely even accounts abov,1
3,Customer#000000003,MG9kdTD2WBHm,11-719-748-3364,7498.12,AUTOMOBILE, deposits eat slyly ironic, even instructions. express foxes detect slyly. blithely even accounts abov,1
3,Customer#000000003,MG9kdTD2WBHm,11-719-748-3364,7498.12,AUTOMOBILE, deposits eat slyly ironic, even instructions. express foxes detect slyly. blithely even accounts abov,1
3,Customer#000000003,MG9kdTD2WBHm,11-719-748-3364,7498.12,AUTOMOBILE, deposits eat slyly ironic, even instructions. express foxes detect slyly. blithely even accounts abov,1
2,Customer#000000002,XSTf4,NCwDVaWNe6tEgvwfmRchLXak,23-768-687-3665,121.65,AUTOMOBILE,l accounts. blithely ironic theodolites integrate boldly: caref,13
2,Customer#000000002,XSTf4,NCwDVaWNe6tEgvwfmRchLXak,23-768-687-3665,121.65,AUTOMOBILE,l accounts. blithely ironic theodolites integrate boldly: caref,13
2,Customer#000000002,XSTf4,NCwDVaWNe6tEgvwfmRchLXak,23-768-687-3665,121.65,AUTOMOBILE,l accounts. blithely ironic theodolites integrate boldly: caref,13]
2,Customer#00000000...> but was:<...-------------------
[1,Customer#000000001,IVhzIApeRb ot,c,E,25-989-741-2988,711.56,BUILDING,to the even, regular platelets. regular, ironic epitaphs nag e,15
1,Customer#000000001,IVhzIApeRb ot,c,E,25-989-741-2988,711.56,BUILDING,to the even, regular platelets. regular, ironic epitaphs nag e,15
1,Customer#000000001,IVhzIApeRb ot,c,E,25-989-741-2988,711.56,BUILDING,to the even, regular platelets. regular, ironic epitaphs nag e,15
1,Customer#000000001,IVhzIApeRb ot,c,E,25-989-741-2988,711.56,BUILDING,to the even, regular platelets. regular, ironic epitaphs nag e,15
4,Customer#000000004,XxVSJsLAGtn,14-128-190-5944,2866.83,MACHINERY, requests. final, regular ideas sleep final accou,4
4,Customer#000000004,XxVSJsLAGtn,14-128-190-5944,2866.83,MACHINERY, requests. final, regular ideas sleep final accou,4
4,Customer#000000004,XxVSJsLAGtn,14-128-190-5944,2866.83,MACHINERY, requests. final, regular ideas sleep final accou,4
4,Customer#000000004,XxVSJsLAGtn,14-128-190-5944,2866.83,MACHINERY, requests. final, regular ideas sleep final accou,4]
2,Customer#00000000...>
TestBuiltinFunctions.testAvgLong:81->QueryTestCaseBase.assertResultSet:359->QueryTestCaseBase.assertResultSet:384->QueryTestCaseBase.verifyResultText:500 Result Verification expected:<[total_avg
-------------------------------
2.0]> but was:<[-------------------------------]>
TestBuiltinFunctions.testAvgDouble:74->QueryTestCaseBase.assertResultSet:359->QueryTestCaseBase.assertResultSet:384->QueryTestCaseBase.verifyResultText:500 Result Verification expected:<[l_orderkey,revenue
-------------------------------
1,0.065
2,0.0
3,0.08]> but was:<[-------------------------------]>
TestBuiltinFunctions.testAvgInt:88->QueryTestCaseBase.assertResultSet:359->QueryTestCaseBase.assertResultSet:384->QueryTestCaseBase.verifyResultText:500 Result Verification expected:<[total_avg
-------------------------------
1.8]> but was:<[-------------------------------]>
Tests in error:
TestTablePartitions.testColumnPartitionedTableByThreeColumns:314 » IllegalArgument
TestTablePartitions.testColumnPartitionedTableByTwoColumnsWithCompression:594 » IllegalArgument
TestTablePartitions.testQueryCasesOnColumnPartitionedTable:231->assertPartitionDirectories:205 » IllegalArgument
TestTablePartitions.testColumnPartitionedTableByOneColumn:185->assertPartitionDirectories:205 » IllegalArgument
TestTablePartitions.testInsertIntoColumnPartitionedTableByThreeColumns:378 » IllegalArgument
TestTablePartitions.testColumnPartitionedTableNoMatchedPartition:722 » IllegalArgument
TestTablePartitions.testColumnPartitionedTableByThreeColumnsWithCompression:639 » IllegalArgument
TestTablePartitions.testColumnPartitionedTableByOneColumnsWithCompression:557 » IllegalArgument
TestInsertQuery.testInsertOverwriteWithCompression:488 » IllegalArgument Wrong...
TestInsertQuery.testInsertOverwriteWithUnionDifferentAlias:756->QueryTestCaseBase.executeFile:339 » Service
TestInsertQuery.testInsertOverwriteTableWithNonFromQuery2:669->QueryTestCaseBase.executeString:293 » Service
TestInsertQuery.testInsertOverwriteWithDatabase:615->QueryTestCaseBase.executeFile:339 » Service
TestInsertQuery.testInsertOverwriteTableWithNonFromQuery:634->QueryTestCaseBase.executeString:293 » Service
TestInsertQuery.testInsertInto:69->QueryTestCaseBase.executeFile:339 » Service
TestInsertQuery.testInsertOverwriteSmallerColumns:304->QueryTestCaseBase.executeFile:339 » Service
TestInsertQuery.testInsertOverwrite:49->QueryTestCaseBase.executeFile:339 » Service
TestCTASQuery.testCtasWithGroupby:150->QueryTestCaseBase.executeQuery:303->QueryTestCaseBase.executeFile:339 » Service
TestCTASQuery.testCtasWithLimit:170->QueryTestCaseBase.executeQuery:303->QueryTestCaseBase.executeFile:339 » Service
TestCTASQuery.testCtasWithUnion:180->QueryTestCaseBase.executeQuery:303->QueryTestCaseBase.executeFile:339 » Service
TestCTASQuery.testCtasWithOptions:204->QueryTestCaseBase.executeQuery:303->QueryTestCaseBase.executeFile:339 » Service
TestCTASQuery.testCtasWithStoreType:190->QueryTestCaseBase.executeQuery:303->QueryTestCaseBase.executeFile:339 » Service
TestCTASQuery.testCtasWithOrderby:160->QueryTestCaseBase.executeQuery:303->QueryTestCaseBase.executeFile:339 » Service
TestCreateTable.testCreatedTableWithQuotedIdentifierAndVerifyPath:139->assertPathOfCreatedTable:110 » IllegalArgument
TestCreateTable.testCreatedTableJustCreatedAndVerifyPath:133->assertPathOfCreatedTable:110 » IllegalArgument
TestGroupByQuery.testDistinctAggregationCaseByCase3:497 » Service java.sql.SQL...
TestGroupByQuery.testDistinctAggregationCasebyCase11:435 » Service java.sql.SQ...
TestPredicates.testInPredicateWithConstant:307->ExprTestBase.testEval:196->ExprTestBase.testEval:281 » Compilation
TestPredicates.testIsNullPredicateWithFunction:361->ExprTestBase.testEval:196->ExprTestBase.testEval:281 » Compilation
TestSQLExpression.testCastFromTable:888->ExprTestBase.testEval:203->ExprTestBase.testEval:284 » NoSuchMethod
TestSQLExpression.testQuotedIdentifiers:47->ExprTestBase.testEval:196->ExprTestBase.testEval:281 » Compilation
TestEvalCodeGenerator.testStringConcat:308->ExprTestBase.testEval:196->ExprTestBase.testEval:281 » Compilation
TestDateTimeFunctions.testDatePart:242->ExprTestBase.testEval:196->ExprTestBase.testEval:281 » Compilation
TestDateTimeFunctions.testExtract:125->ExprTestBase.testEval:196->ExprTestBase.testEval:281 » Compilation
TestStringOperatorsAndFunctions.testRegexReplace:140->ExprTestBase.testEval:196->ExprTestBase.testEval:281 » Compilation
TestStringOperatorsAndFunctions.testOctetLength:351->ExprTestBase.testEval:196->ExprTestBase.testEval:281 » Compilation
TestStringOperatorsAndFunctions.testChr:521->ExprTestBase.testEval:196->ExprTestBase.testEval:281 » Compilation
TestStringOperatorsAndFunctions.testMd5:294->ExprTestBase.testEval:196->ExprTestBase.testEval:281 » Compilation
TestStringOperatorsAndFunctions.testAscii:505->ExprTestBase.testEval:196->ExprTestBase.testEval:281 » Compilation
TestStringOperatorsAndFunctions.testLTrim:75->ExprTestBase.testEval:196->ExprTestBase.testEval:281 » Compilation
TestStringOperatorsAndFunctions.testLower:256->ExprTestBase.testEval:196->ExprTestBase.testEval:281 » Compilation
TestStringOperatorsAndFunctions.testRTrim:96->ExprTestBase.testEval:196->ExprTestBase.testEval:281 » Compilation
TestStringOperatorsAndFunctions.testRight:202->ExprTestBase.testEval:196->ExprTestBase.testEval:281 » Compilation
TestStringOperatorsAndFunctions.testUpper:243->ExprTestBase.testEval:196->ExprTestBase.testEval:281 » Compilation
TestStringOperatorsAndFunctions.testLeft:173->ExprTestBase.testEval:196->ExprTestBase.testEval:281 » Compilation
TestStringOperatorsAndFunctions.testTrim:117->ExprTestBase.testEval:196->ExprTestBase.testEval:281 » Compilation
TestStringOperatorsAndFunctions.testCharLength:269->ExprTestBase.testEval:196->ExprTestBase.testEval:281 » Compilation
TestStringOperatorsAndFunctions.testBitLength:457->ExprTestBase.testEval:196->ExprTestBase.testEval:281 » Compilation
TestStringOperatorsAndFunctions.testReverse:217->ExprTestBase.testEval:196->ExprTestBase.testEval:281 » Compilation
TestStringOperatorsAndFunctions.testSplitPart:367->ExprTestBase.testEval:196->ExprTestBase.testEval:281 » Compilation
TestStringOperatorsAndFunctions.testFindInSet:593->ExprTestBase.testEval:209->ExprTestBase.testEval:281 » Compilation
TestStringOperatorsAndFunctions.testLength:281->ExprTestBase.testEval:196->ExprTestBase.testEval:281 » Compilation
TestStringOperatorsAndFunctions.testLocate:439->ExprTestBase.testEval:196->ExprTestBase.testEval:281 » Compilation
TestStringOperatorsAndFunctions.testRepeat:231->ExprTestBase.testEval:196->ExprTestBase.testEval:281 » Compilation
TestStringOperatorsAndFunctions.testStrpos:473->ExprTestBase.testEval:196->ExprTestBase.testEval:281 » Compilation
TestStringOperatorsAndFunctions.testSubstr:396->ExprTestBase.testEval:196->ExprTestBase.testEval:281 » Compilation
TestStringOperatorsAndFunctions.testStrposb:489->ExprTestBase.testEval:196->ExprTestBase.testEval:281 » Compilation
TestMathFunctions.testRoundWithSpecifiedPrecision:469->ExprTestBase.testEval:196->ExprTestBase.testEval:281 » Compilation
TestMathFunctions.testAbs:344->ExprTestBase.testEval:196->ExprTestBase.testEval:281 » Compilation
TestMathFunctions.testCos:144->ExprTestBase.testEval:196->ExprTestBase.testEval:281 » Compilation
TestMathFunctions.testDiv:257->ExprTestBase.testEval:196->ExprTestBase.testEval:281 » Compilation
TestMathFunctions.testExp:321->ExprTestBase.testEval:196->ExprTestBase.testEval:281 » Compilation
TestMathFunctions.testMod:241->ExprTestBase.testEval:196->ExprTestBase.testEval:281 » Compilation
TestMathFunctions.testPow:409->ExprTestBase.testEval:196->ExprTestBase.testEval:281 » Compilation
TestMathFunctions.testSin:127->ExprTestBase.testEval:196->ExprTestBase.testEval:281 » Compilation
TestMathFunctions.testTan:160->ExprTestBase.testEval:196->ExprTestBase.testEval:281 » Compilation
TestMathFunctions.testAtan2:225->ExprTestBase.testEval:196->ExprTestBase.testEval:281 » Compilation
TestMathFunctions.testFloor:73->ExprTestBase.testEval:196->ExprTestBase.testEval:281 » Compilation
TestMathFunctions.testRound:45->ExprTestBase.testEval:196->ExprTestBase.testEval:281 » Compilation
TestMathFunctions.testAcos:192->ExprTestBase.testEval:196->ExprTestBase.testEval:281 » Compilation
TestMathFunctions.testAsin:176->ExprTestBase.testEval:196->ExprTestBase.testEval:281 » Compilation
TestMathFunctions.testAtan:208->ExprTestBase.testEval:196->ExprTestBase.testEval:281 » Compilation
TestMathFunctions.testCbrt:364->ExprTestBase.testEval:196->ExprTestBase.testEval:281 » Compilation
TestMathFunctions.testCeil:92->ExprTestBase.testEval:196->ExprTestBase.testEval:281 » Compilation
TestMathFunctions.testSign:273->ExprTestBase.testEval:196->ExprTestBase.testEval:281 » Compilation
TestMathFunctions.testSqrt:298->ExprTestBase.testEval:196->ExprTestBase.testEval:281 » Compilation
TestMathFunctions.testCeiling:111->ExprTestBase.testEval:196->ExprTestBase.testEval:281 » Compilation
TestMathFunctions.testRadians:428->ExprTestBase.testEval:196->ExprTestBase.testEval:281 » Compilation
TestMathFunctions.testDegrees:387->ExprTestBase.testEval:196->ExprTestBase.testEval:281 » Compilation
Tests run: 1336, Failures: 29, Errors: 78, Skipped: 0
[INFO] ------------------------------------------------------------------------
[INFO] Reactor Summary:
[INFO]
[INFO] Tajo Main ......................................... SUCCESS [ 1.653 s]
[INFO] Tajo Project POM .................................. SUCCESS [ 1.145 s]
[INFO] Tajo Maven Plugins ................................ SUCCESS [ 2.742 s]
[INFO] Tajo Common ....................................... SUCCESS [ 23.919 s]
[INFO] Tajo Algebra ...................................... SUCCESS [ 1.317 s]
[INFO] Tajo Catalog Common ............................... SUCCESS [ 6.465 s]
[INFO] Tajo Plan ......................................... SUCCESS [ 5.789 s]
[INFO] Tajo Rpc .......................................... SUCCESS [ 25.594 s]
[INFO] Tajo Catalog Client ............................... SUCCESS [ 0.971 s]
[INFO] Tajo Catalog Server ............................... SUCCESS [ 9.893 s]
[INFO] Tajo Storage Common ............................... SUCCESS [ 10.516 s]
[INFO] Tajo HDFS Storage ................................. SUCCESS [ 41.261 s]
[INFO] Tajo HBase Storage ................................ SUCCESS [ 2.525 s]
[INFO] Tajo PullServer ................................... SUCCESS [ 0.825 s]
[INFO] Tajo Client ....................................... SUCCESS [ 3.479 s]
[INFO] Tajo JDBC Driver .................................. SUCCESS [ 0.539 s]
[INFO] ASM (thirdparty) .................................. SUCCESS [ 0.575 s]
[INFO] Tajo Core ......................................... FAILURE [16:11 min]
[INFO] Tajo Catalog Drivers .............................. SKIPPED
[INFO] Tajo Catalog ...................................... SKIPPED
[INFO] Tajo Storage ...................................... SKIPPED
[INFO] Tajo Distribution ................................. SKIPPED
[INFO] ------------------------------------------------------------------------
[INFO] BUILD FAILURE
[INFO] ------------------------------------------------------------------------
[INFO] Total time: 18:31 min
[INFO] Finished at: 2015-01-08T02:42:45+00:00
[INFO] Final Memory: 94M/1109M
[INFO] ------------------------------------------------------------------------
[ERROR] Failed to execute goal org.apache.maven.plugins:maven-surefire-plugin:2.17:test (default-test) on project tajo-core: There are test failures.
[ERROR]
[ERROR] Please refer to <https://builds.apache.org/job/Tajo-master-CODEGEN-build/ws/tajo-core/target/surefire-reports> for the individual test results.
[ERROR] -> [Help 1]
[ERROR]
[ERROR] To see the full stack trace of the errors, re-run Maven with the -e switch.
[ERROR] Re-run Maven using the -X switch to enable full debug logging.
[ERROR]
[ERROR] For more information about the errors and possible solutions, please read the following articles:
[ERROR] [Help 1] http://cwiki.apache.org/confluence/display/MAVEN/MojoFailureException
[ERROR]
[ERROR] After correcting the problems, you can resume the build with the command
[ERROR] mvn <goals> -rf :tajo-core
Build step 'Execute shell' marked build as failure
Updating TAJO-1285
Build failed in Jenkins: Tajo-master-CODEGEN-build #176
Posted by Apache Jenkins Server <je...@builds.apache.org>.
See <https://builds.apache.org/job/Tajo-master-CODEGEN-build/176/changes>
Changes:
[jihoonson] TAJO-1245: Add documentation about PostgreSQL and Oracle Catalog driver. (jihoon)
------------------------------------------
[...truncated 402470 lines...]
UNITED KINGDOM,3,23
IRAN,4,10
PERU,1,17
VIETNAM,2,21
ARGENTINA,1,1
EGYPT,4,4
INDIA,2,8
UNITED STATES,1,24
FRANCE,3,6
ETHIOPIA,0,5]
>
TestWindowQuery.firstValue1:258->QueryTestCaseBase.assertResultSet:359->QueryTestCaseBase.assertResultSet:384->QueryTestCaseBase.verifyResultText:500 Result Verification expected:<[l_orderkey,shipmode_first,linenumber_first,suppkey_first,shipdate_first,commitdate_first,extendedprice_first,discount_first
-------------------------------
1,MAIL,1,7311,1996-03-13,1996-02-12 00:00:00,21168.23,0.04
1,MAIL,1,7311,1996-03-13,1996-02-12 00:00:00,21168.23,0.04
2,RAIL,1,1191,1997-01-28,1997-01-14 00:00:00,44694.46,0.0
3,AIR,1,1798,1993-11-09,1993-12-20 00:00:00,46796.47,0.06
3,AIR,1,1798,1993-11-09,1993-12-20 00:00:00,46796.47,0.06]> but was:<[-------------------------------]>
TestWindowQuery.lastValue1:293->QueryTestCaseBase.assertResultSet:359->QueryTestCaseBase.assertResultSet:384->QueryTestCaseBase.verifyResultText:500 Result Verification expected:<[l_orderkey,shipmode_last,linenumber_last,suppkey_last,shipdate_last,commitdate_last,extendedprice_last,discount_last
-------------------------------
1,TRUCK,2,7706,1996-04-12,1996-02-28 00:00:00,45983.16,0.09
1,TRUCK,2,7706,1996-04-12,1996-02-28 00:00:00,45983.16,0.09
2,RAIL,1,1191,1997-01-28,1997-01-14 00:00:00,44694.46,0.0
3,RAIL,2,6540,1994-02-02,1994-01-04 00:00:00,54058.05,0.1
3,RAIL,2,6540,1994-02-02,1994-01-04 00:00:00,54058.05,0.1]> but was:<[-------------------------------]>
TestCTASQuery.testCtasWithManagedTable:232 null
TestJoinQuery.testLeftOuterJoinWithEmptyTable5:436->QueryTestCaseBase.assertResultSet:359->QueryTestCaseBase.assertResultSet:384->QueryTestCaseBase.verifyResultText:500 Result Verification expected:<[l_linenumber,?sum,?max_1,?max_2,?avg_3,?sum_4
-------------------------------
1,0,,,33.333333333333336,100.0
2,0,,,42.5,85.0]> but was:<[-------------------------------]>
TestJoinQuery.testLeftOuterJoinWithEmptyTable5:436->QueryTestCaseBase.assertResultSet:359->QueryTestCaseBase.assertResultSet:384->QueryTestCaseBase.verifyResultText:500 Result Verification expected:<[l_linenumber,?sum,?max_1,?max_2,?avg_3,?sum_4
-------------------------------
1,0,,,33.333333333333336,100.0
2,0,,,42.5,85.0]> but was:<[-------------------------------]>
TestJoinQuery.testLeftOuterJoinWithEmptyTable5:436->QueryTestCaseBase.assertResultSet:359->QueryTestCaseBase.assertResultSet:384->QueryTestCaseBase.verifyResultText:500 Result Verification expected:<[l_linenumber,?sum,?max_1,?max_2,?avg_3,?sum_4
-------------------------------
1,0,,,33.333333333333336,100.0
2,0,,,42.5,85.0]> but was:<[-------------------------------]>
TestJoinQuery.testLeftOuterJoinWithEmptyTable5:436->QueryTestCaseBase.assertResultSet:359->QueryTestCaseBase.assertResultSet:384->QueryTestCaseBase.verifyResultText:500 Result Verification expected:<[l_linenumber,?sum,?max_1,?max_2,?avg_3,?sum_4
-------------------------------
1,0,,,33.333333333333336,100.0
2,0,,,42.5,85.0]> but was:<[-------------------------------]>
TestGroupByQuery.testDistinctAggregationCasebyCase9:410->QueryTestCaseBase.assertResultSet:370->QueryTestCaseBase.assertResultSet:384->QueryTestCaseBase.verifyResultText:500 Result Verification expected:<[l_orderkey,cnt1,value2,l_partkey,avg1,cnt2
-------------------------------
1,1,28.0,1,26.5,2
2,1,39.0,2,38.0,1
3,1,46.0,2,45.0,1
3,1,51.0,3,49.0,1]> but was:<[-------------------------------]>
TestGroupByQuery.testGroupbyWithJson:581->QueryTestCaseBase.assertResultSet:359->QueryTestCaseBase.assertResultSet:384->QueryTestCaseBase.verifyResultText:500 Result Verification expected:<[l_orderkey,total,num
-------------------------------
3,2.5,3
2,2.0,1
1,1.0,3]> but was:<[-------------------------------]>
TestGroupByQuery.testHavingWithAggFunction:572->QueryTestCaseBase.assertResultSet:359->QueryTestCaseBase.assertResultSet:384->QueryTestCaseBase.verifyResultText:500 Result Verification expected:<[l_orderkey,total,num
-------------------------------
3,2.5,3
2,2.0,1]> but was:<[-------------------------------]>
TestGroupByQuery.testHavingWithNamedTarget:563->QueryTestCaseBase.assertResultSet:359->QueryTestCaseBase.assertResultSet:384->QueryTestCaseBase.verifyResultText:500 Result Verification expected:<[l_orderkey,total,num
-------------------------------
1,1.0,3
2,2.0,1
3,2.5,3]> but was:<[-------------------------------]>
TestGroupByQuery.testDistinctAggregationCasebyCase11:447 expected:<[id,?count_4,?avg_5,?min_6,?max_7,?sum_8,?cast_9,?cast_10,?cast_11,?cast_12
-------------------------------
1,2,4.0,0,5,12,4,0,5,12
2,3,2.0,0,3,6,7,0,8,21]
> but was:<[
-------------------------------]
>
TestGroupByQuery.testDistinctAggregationCasebyCase9:410->QueryTestCaseBase.assertResultSet:370->QueryTestCaseBase.assertResultSet:384->QueryTestCaseBase.verifyResultText:500 Result Verification expected:<[l_orderkey,cnt1,value2,l_partkey,avg1,cnt2
-------------------------------
1,1,28.0,1,26.5,2
2,1,39.0,2,38.0,1
3,1,46.0,2,45.0,1
3,1,51.0,3,49.0,1]> but was:<[-------------------------------]>
TestGroupByQuery.testGroupbyWithJson:581->QueryTestCaseBase.assertResultSet:359->QueryTestCaseBase.assertResultSet:384->QueryTestCaseBase.verifyResultText:500 Result Verification expected:<[l_orderkey,total,num
-------------------------------
3,2.5,3
2,2.0,1
1,1.0,3]> but was:<[-------------------------------]>
TestGroupByQuery.testHavingWithAggFunction:572->QueryTestCaseBase.assertResultSet:359->QueryTestCaseBase.assertResultSet:384->QueryTestCaseBase.verifyResultText:500 Result Verification expected:<[l_orderkey,total,num
-------------------------------
3,2.5,3
2,2.0,1]> but was:<[-------------------------------]>
TestGroupByQuery.testHavingWithNamedTarget:563->QueryTestCaseBase.assertResultSet:359->QueryTestCaseBase.assertResultSet:384->QueryTestCaseBase.verifyResultText:500 Result Verification expected:<[l_orderkey,total,num
-------------------------------
1,1.0,3
2,2.0,1
3,2.5,3]> but was:<[-------------------------------]>
TestSelectQuery.testSimpleQueryWithLimitPartitionedTable:93->QueryTestCaseBase.assertResultSet:359->QueryTestCaseBase.assertResultSet:384->QueryTestCaseBase.verifyResultText:500 Result Verification expected:<...-------------------
[3,Customer#000000003,MG9kdTD2WBHm,11-719-748-3364,7498.12,AUTOMOBILE, deposits eat slyly ironic, even instructions. express foxes detect slyly. blithely even accounts abov,1
3,Customer#000000003,MG9kdTD2WBHm,11-719-748-3364,7498.12,AUTOMOBILE, deposits eat slyly ironic, even instructions. express foxes detect slyly. blithely even accounts abov,1
3,Customer#000000003,MG9kdTD2WBHm,11-719-748-3364,7498.12,AUTOMOBILE, deposits eat slyly ironic, even instructions. express foxes detect slyly. blithely even accounts abov,1
3,Customer#000000003,MG9kdTD2WBHm,11-719-748-3364,7498.12,AUTOMOBILE, deposits eat slyly ironic, even instructions. express foxes detect slyly. blithely even accounts abov,1
3,Customer#000000003,MG9kdTD2WBHm,11-719-748-3364,7498.12,AUTOMOBILE, deposits eat slyly ironic, even instructions. express foxes detect slyly. blithely even accounts abov,1
2,Customer#000000002,XSTf4,NCwDVaWNe6tEgvwfmRchLXak,23-768-687-3665,121.65,AUTOMOBILE,l accounts. blithely ironic theodolites integrate boldly: caref,13
2,Customer#000000002,XSTf4,NCwDVaWNe6tEgvwfmRchLXak,23-768-687-3665,121.65,AUTOMOBILE,l accounts. blithely ironic theodolites integrate boldly: caref,13
2,Customer#000000002,XSTf4,NCwDVaWNe6tEgvwfmRchLXak,23-768-687-3665,121.65,AUTOMOBILE,l accounts. blithely ironic theodolites integrate boldly: caref,13]
2,Customer#00000000...> but was:<...-------------------
[1,Customer#000000001,IVhzIApeRb ot,c,E,25-989-741-2988,711.56,BUILDING,to the even, regular platelets. regular, ironic epitaphs nag e,15
1,Customer#000000001,IVhzIApeRb ot,c,E,25-989-741-2988,711.56,BUILDING,to the even, regular platelets. regular, ironic epitaphs nag e,15
1,Customer#000000001,IVhzIApeRb ot,c,E,25-989-741-2988,711.56,BUILDING,to the even, regular platelets. regular, ironic epitaphs nag e,15
1,Customer#000000001,IVhzIApeRb ot,c,E,25-989-741-2988,711.56,BUILDING,to the even, regular platelets. regular, ironic epitaphs nag e,15
4,Customer#000000004,XxVSJsLAGtn,14-128-190-5944,2866.83,MACHINERY, requests. final, regular ideas sleep final accou,4
4,Customer#000000004,XxVSJsLAGtn,14-128-190-5944,2866.83,MACHINERY, requests. final, regular ideas sleep final accou,4
4,Customer#000000004,XxVSJsLAGtn,14-128-190-5944,2866.83,MACHINERY, requests. final, regular ideas sleep final accou,4
4,Customer#000000004,XxVSJsLAGtn,14-128-190-5944,2866.83,MACHINERY, requests. final, regular ideas sleep final accou,4]
2,Customer#00000000...>
TestBuiltinFunctions.testAvgLong:81->QueryTestCaseBase.assertResultSet:359->QueryTestCaseBase.assertResultSet:384->QueryTestCaseBase.verifyResultText:500 Result Verification expected:<[total_avg
-------------------------------
2.0]> but was:<[-------------------------------]>
TestBuiltinFunctions.testAvgDouble:74->QueryTestCaseBase.assertResultSet:359->QueryTestCaseBase.assertResultSet:384->QueryTestCaseBase.verifyResultText:500 Result Verification expected:<[l_orderkey,revenue
-------------------------------
1,0.065
2,0.0
3,0.08]> but was:<[-------------------------------]>
TestBuiltinFunctions.testAvgInt:88->QueryTestCaseBase.assertResultSet:359->QueryTestCaseBase.assertResultSet:384->QueryTestCaseBase.verifyResultText:500 Result Verification expected:<[total_avg
-------------------------------
1.8]> but was:<[-------------------------------]>
Tests in error:
TestTablePartitions.testColumnPartitionedTableByThreeColumns:314 » IllegalArgument
TestTablePartitions.testColumnPartitionedTableByTwoColumnsWithCompression:594 » IllegalArgument
TestTablePartitions.testQueryCasesOnColumnPartitionedTable:231->assertPartitionDirectories:205 » IllegalArgument
TestTablePartitions.testColumnPartitionedTableByOneColumn:185->assertPartitionDirectories:205 » IllegalArgument
TestTablePartitions.testInsertIntoColumnPartitionedTableByThreeColumns:378 » IllegalArgument
TestTablePartitions.testColumnPartitionedTableNoMatchedPartition:722 » IllegalArgument
TestTablePartitions.testColumnPartitionedTableByThreeColumnsWithCompression:639 » IllegalArgument
TestTablePartitions.testColumnPartitionedTableByOneColumnsWithCompression:557 » IllegalArgument
TestInsertQuery.testInsertOverwriteWithCompression:488 » IllegalArgument Wrong...
TestInsertQuery.testInsertOverwriteWithUnionDifferentAlias:756->QueryTestCaseBase.executeFile:339 » Service
TestInsertQuery.testInsertOverwriteTableWithNonFromQuery2:669->QueryTestCaseBase.executeString:293 » Service
TestInsertQuery.testInsertOverwriteWithDatabase:615->QueryTestCaseBase.executeFile:339 » Service
TestInsertQuery.testInsertOverwriteTableWithNonFromQuery:634->QueryTestCaseBase.executeString:293 » Service
TestInsertQuery.testInsertInto:69->QueryTestCaseBase.executeFile:339 » Service
TestInsertQuery.testInsertOverwriteSmallerColumns:304->QueryTestCaseBase.executeFile:339 » Service
TestInsertQuery.testInsertOverwrite:49->QueryTestCaseBase.executeFile:339 » Service
TestCTASQuery.testCtasWithGroupby:150->QueryTestCaseBase.executeQuery:303->QueryTestCaseBase.executeFile:339 » Service
TestCTASQuery.testCtasWithLimit:170->QueryTestCaseBase.executeQuery:303->QueryTestCaseBase.executeFile:339 » Service
TestCTASQuery.testCtasWithUnion:180->QueryTestCaseBase.executeQuery:303->QueryTestCaseBase.executeFile:339 » Service
TestCTASQuery.testCtasWithOptions:204->QueryTestCaseBase.executeQuery:303->QueryTestCaseBase.executeFile:339 » Service
TestCTASQuery.testCtasWithStoreType:190->QueryTestCaseBase.executeQuery:303->QueryTestCaseBase.executeFile:339 » Service
TestCTASQuery.testCtasWithOrderby:160->QueryTestCaseBase.executeQuery:303->QueryTestCaseBase.executeFile:339 » Service
TestCreateTable.testCreatedTableWithQuotedIdentifierAndVerifyPath:139->assertPathOfCreatedTable:110 » IllegalArgument
TestCreateTable.testCreatedTableJustCreatedAndVerifyPath:133->assertPathOfCreatedTable:110 » IllegalArgument
TestGroupByQuery.testDistinctAggregationCaseByCase3:497 » Service java.sql.SQL...
TestGroupByQuery.testDistinctAggregationCasebyCase11:435 » Service java.sql.SQ...
TestPredicates.testInPredicateWithConstant:307->ExprTestBase.testEval:196->ExprTestBase.testEval:281 » Compilation
TestPredicates.testIsNullPredicateWithFunction:361->ExprTestBase.testEval:196->ExprTestBase.testEval:281 » Compilation
TestSQLExpression.testCastFromTable:888->ExprTestBase.testEval:203->ExprTestBase.testEval:284 » NoSuchMethod
TestSQLExpression.testQuotedIdentifiers:47->ExprTestBase.testEval:196->ExprTestBase.testEval:281 » Compilation
TestEvalCodeGenerator.testStringConcat:308->ExprTestBase.testEval:196->ExprTestBase.testEval:281 » Compilation
TestDateTimeFunctions.testDatePart:242->ExprTestBase.testEval:196->ExprTestBase.testEval:281 » Compilation
TestDateTimeFunctions.testExtract:125->ExprTestBase.testEval:196->ExprTestBase.testEval:281 » Compilation
TestStringOperatorsAndFunctions.testRegexReplace:140->ExprTestBase.testEval:196->ExprTestBase.testEval:281 » Compilation
TestStringOperatorsAndFunctions.testOctetLength:351->ExprTestBase.testEval:196->ExprTestBase.testEval:281 » Compilation
TestStringOperatorsAndFunctions.testChr:521->ExprTestBase.testEval:196->ExprTestBase.testEval:281 » Compilation
TestStringOperatorsAndFunctions.testMd5:294->ExprTestBase.testEval:196->ExprTestBase.testEval:281 » Compilation
TestStringOperatorsAndFunctions.testAscii:505->ExprTestBase.testEval:196->ExprTestBase.testEval:281 » Compilation
TestStringOperatorsAndFunctions.testLTrim:75->ExprTestBase.testEval:196->ExprTestBase.testEval:281 » Compilation
TestStringOperatorsAndFunctions.testLower:256->ExprTestBase.testEval:196->ExprTestBase.testEval:281 » Compilation
TestStringOperatorsAndFunctions.testRTrim:96->ExprTestBase.testEval:196->ExprTestBase.testEval:281 » Compilation
TestStringOperatorsAndFunctions.testRight:202->ExprTestBase.testEval:196->ExprTestBase.testEval:281 » Compilation
TestStringOperatorsAndFunctions.testUpper:243->ExprTestBase.testEval:196->ExprTestBase.testEval:281 » Compilation
TestStringOperatorsAndFunctions.testLeft:173->ExprTestBase.testEval:196->ExprTestBase.testEval:281 » Compilation
TestStringOperatorsAndFunctions.testTrim:117->ExprTestBase.testEval:196->ExprTestBase.testEval:281 » Compilation
TestStringOperatorsAndFunctions.testCharLength:269->ExprTestBase.testEval:196->ExprTestBase.testEval:281 » Compilation
TestStringOperatorsAndFunctions.testBitLength:457->ExprTestBase.testEval:196->ExprTestBase.testEval:281 » Compilation
TestStringOperatorsAndFunctions.testReverse:217->ExprTestBase.testEval:196->ExprTestBase.testEval:281 » Compilation
TestStringOperatorsAndFunctions.testSplitPart:367->ExprTestBase.testEval:196->ExprTestBase.testEval:281 » Compilation
TestStringOperatorsAndFunctions.testFindInSet:593->ExprTestBase.testEval:209->ExprTestBase.testEval:281 » Compilation
TestStringOperatorsAndFunctions.testLength:281->ExprTestBase.testEval:196->ExprTestBase.testEval:281 » Compilation
TestStringOperatorsAndFunctions.testLocate:439->ExprTestBase.testEval:196->ExprTestBase.testEval:281 » Compilation
TestStringOperatorsAndFunctions.testRepeat:231->ExprTestBase.testEval:196->ExprTestBase.testEval:281 » Compilation
TestStringOperatorsAndFunctions.testStrpos:473->ExprTestBase.testEval:196->ExprTestBase.testEval:281 » Compilation
TestStringOperatorsAndFunctions.testSubstr:396->ExprTestBase.testEval:196->ExprTestBase.testEval:281 » Compilation
TestStringOperatorsAndFunctions.testStrposb:489->ExprTestBase.testEval:196->ExprTestBase.testEval:281 » Compilation
TestMathFunctions.testRoundWithSpecifiedPrecision:469->ExprTestBase.testEval:196->ExprTestBase.testEval:281 » Compilation
TestMathFunctions.testAbs:344->ExprTestBase.testEval:196->ExprTestBase.testEval:281 » Compilation
TestMathFunctions.testCos:144->ExprTestBase.testEval:196->ExprTestBase.testEval:281 » Compilation
TestMathFunctions.testDiv:257->ExprTestBase.testEval:196->ExprTestBase.testEval:281 » Compilation
TestMathFunctions.testExp:321->ExprTestBase.testEval:196->ExprTestBase.testEval:281 » Compilation
TestMathFunctions.testMod:241->ExprTestBase.testEval:196->ExprTestBase.testEval:281 » Compilation
TestMathFunctions.testPow:409->ExprTestBase.testEval:196->ExprTestBase.testEval:281 » Compilation
TestMathFunctions.testSin:127->ExprTestBase.testEval:196->ExprTestBase.testEval:281 » Compilation
TestMathFunctions.testTan:160->ExprTestBase.testEval:196->ExprTestBase.testEval:281 » Compilation
TestMathFunctions.testAtan2:225->ExprTestBase.testEval:196->ExprTestBase.testEval:281 » Compilation
TestMathFunctions.testFloor:73->ExprTestBase.testEval:196->ExprTestBase.testEval:281 » Compilation
TestMathFunctions.testRound:45->ExprTestBase.testEval:196->ExprTestBase.testEval:281 » Compilation
TestMathFunctions.testAcos:192->ExprTestBase.testEval:196->ExprTestBase.testEval:281 » Compilation
TestMathFunctions.testAsin:176->ExprTestBase.testEval:196->ExprTestBase.testEval:281 » Compilation
TestMathFunctions.testAtan:208->ExprTestBase.testEval:196->ExprTestBase.testEval:281 » Compilation
TestMathFunctions.testCbrt:364->ExprTestBase.testEval:196->ExprTestBase.testEval:281 » Compilation
TestMathFunctions.testCeil:92->ExprTestBase.testEval:196->ExprTestBase.testEval:281 » Compilation
TestMathFunctions.testSign:273->ExprTestBase.testEval:196->ExprTestBase.testEval:281 » Compilation
TestMathFunctions.testSqrt:298->ExprTestBase.testEval:196->ExprTestBase.testEval:281 » Compilation
TestMathFunctions.testCeiling:111->ExprTestBase.testEval:196->ExprTestBase.testEval:281 » Compilation
TestMathFunctions.testRadians:428->ExprTestBase.testEval:196->ExprTestBase.testEval:281 » Compilation
TestMathFunctions.testDegrees:387->ExprTestBase.testEval:196->ExprTestBase.testEval:281 » Compilation
Tests run: 1336, Failures: 29, Errors: 78, Skipped: 0
[INFO] ------------------------------------------------------------------------
[INFO] Reactor Summary:
[INFO]
[INFO] Tajo Main ......................................... SUCCESS [ 1.658 s]
[INFO] Tajo Project POM .................................. SUCCESS [ 1.161 s]
[INFO] Tajo Maven Plugins ................................ SUCCESS [ 2.664 s]
[INFO] Tajo Common ....................................... SUCCESS [ 23.771 s]
[INFO] Tajo Algebra ...................................... SUCCESS [ 1.311 s]
[INFO] Tajo Catalog Common ............................... SUCCESS [ 6.411 s]
[INFO] Tajo Plan ......................................... SUCCESS [ 5.604 s]
[INFO] Tajo Rpc .......................................... SUCCESS [ 25.439 s]
[INFO] Tajo Catalog Client ............................... SUCCESS [ 1.002 s]
[INFO] Tajo Catalog Server ............................... SUCCESS [ 9.917 s]
[INFO] Tajo Storage Common ............................... SUCCESS [ 10.447 s]
[INFO] Tajo HDFS Storage ................................. SUCCESS [ 40.452 s]
[INFO] Tajo HBase Storage ................................ SUCCESS [ 2.590 s]
[INFO] Tajo PullServer ................................... SUCCESS [ 0.853 s]
[INFO] Tajo Client ....................................... SUCCESS [ 3.438 s]
[INFO] Tajo JDBC Driver .................................. SUCCESS [ 0.571 s]
[INFO] ASM (thirdparty) .................................. SUCCESS [ 0.592 s]
[INFO] Tajo Core ......................................... FAILURE [16:20 min]
[INFO] Tajo Catalog Drivers .............................. SKIPPED
[INFO] Tajo Catalog ...................................... SKIPPED
[INFO] Tajo Storage ...................................... SKIPPED
[INFO] Tajo Distribution ................................. SKIPPED
[INFO] ------------------------------------------------------------------------
[INFO] BUILD FAILURE
[INFO] ------------------------------------------------------------------------
[INFO] Total time: 18:39 min
[INFO] Finished at: 2015-01-07T08:58:52+00:00
[INFO] Final Memory: 95M/1073M
[INFO] ------------------------------------------------------------------------
[ERROR] Failed to execute goal org.apache.maven.plugins:maven-surefire-plugin:2.17:test (default-test) on project tajo-core: There are test failures.
[ERROR]
[ERROR] Please refer to <https://builds.apache.org/job/Tajo-master-CODEGEN-build/ws/tajo-core/target/surefire-reports> for the individual test results.
[ERROR] -> [Help 1]
[ERROR]
[ERROR] To see the full stack trace of the errors, re-run Maven with the -e switch.
[ERROR] Re-run Maven using the -X switch to enable full debug logging.
[ERROR]
[ERROR] For more information about the errors and possible solutions, please read the following articles:
[ERROR] [Help 1] http://cwiki.apache.org/confluence/display/MAVEN/MojoFailureException
[ERROR]
[ERROR] After correcting the problems, you can resume the build with the command
[ERROR] mvn <goals> -rf :tajo-core
Build step 'Execute shell' marked build as failure
Updating TAJO-1245
Build failed in Jenkins: Tajo-master-CODEGEN-build #175
Posted by Apache Jenkins Server <je...@builds.apache.org>.
See <https://builds.apache.org/job/Tajo-master-CODEGEN-build/175/changes>
Changes:
[hyunsik] TAJO-1270: Fix typos. (DaeMyung Kang via hyunsik)
------------------------------------------
[...truncated 402482 lines...]
UNITED KINGDOM,3,23
IRAN,4,10
PERU,1,17
VIETNAM,2,21
ARGENTINA,1,1
EGYPT,4,4
INDIA,2,8
UNITED STATES,1,24
FRANCE,3,6
ETHIOPIA,0,5]
>
TestWindowQuery.firstValue1:258->QueryTestCaseBase.assertResultSet:359->QueryTestCaseBase.assertResultSet:384->QueryTestCaseBase.verifyResultText:500 Result Verification expected:<[l_orderkey,shipmode_first,linenumber_first,suppkey_first,shipdate_first,commitdate_first,extendedprice_first,discount_first
-------------------------------
1,MAIL,1,7311,1996-03-13,1996-02-12 00:00:00,21168.23,0.04
1,MAIL,1,7311,1996-03-13,1996-02-12 00:00:00,21168.23,0.04
2,RAIL,1,1191,1997-01-28,1997-01-14 00:00:00,44694.46,0.0
3,AIR,1,1798,1993-11-09,1993-12-20 00:00:00,46796.47,0.06
3,AIR,1,1798,1993-11-09,1993-12-20 00:00:00,46796.47,0.06]> but was:<[-------------------------------]>
TestWindowQuery.lastValue1:293->QueryTestCaseBase.assertResultSet:359->QueryTestCaseBase.assertResultSet:384->QueryTestCaseBase.verifyResultText:500 Result Verification expected:<[l_orderkey,shipmode_last,linenumber_last,suppkey_last,shipdate_last,commitdate_last,extendedprice_last,discount_last
-------------------------------
1,TRUCK,2,7706,1996-04-12,1996-02-28 00:00:00,45983.16,0.09
1,TRUCK,2,7706,1996-04-12,1996-02-28 00:00:00,45983.16,0.09
2,RAIL,1,1191,1997-01-28,1997-01-14 00:00:00,44694.46,0.0
3,RAIL,2,6540,1994-02-02,1994-01-04 00:00:00,54058.05,0.1
3,RAIL,2,6540,1994-02-02,1994-01-04 00:00:00,54058.05,0.1]> but was:<[-------------------------------]>
TestCTASQuery.testCtasWithManagedTable:232 null
TestJoinQuery.testLeftOuterJoinWithEmptyTable5:436->QueryTestCaseBase.assertResultSet:359->QueryTestCaseBase.assertResultSet:384->QueryTestCaseBase.verifyResultText:500 Result Verification expected:<[l_linenumber,?sum,?max_1,?max_2,?avg_3,?sum_4
-------------------------------
1,0,,,33.333333333333336,100.0
2,0,,,42.5,85.0]> but was:<[-------------------------------]>
TestJoinQuery.testLeftOuterJoinWithEmptyTable5:436->QueryTestCaseBase.assertResultSet:359->QueryTestCaseBase.assertResultSet:384->QueryTestCaseBase.verifyResultText:500 Result Verification expected:<[l_linenumber,?sum,?max_1,?max_2,?avg_3,?sum_4
-------------------------------
1,0,,,33.333333333333336,100.0
2,0,,,42.5,85.0]> but was:<[-------------------------------]>
TestJoinQuery.testLeftOuterJoinWithEmptyTable5:436->QueryTestCaseBase.assertResultSet:359->QueryTestCaseBase.assertResultSet:384->QueryTestCaseBase.verifyResultText:500 Result Verification expected:<[l_linenumber,?sum,?max_1,?max_2,?avg_3,?sum_4
-------------------------------
1,0,,,33.333333333333336,100.0
2,0,,,42.5,85.0]> but was:<[-------------------------------]>
TestJoinQuery.testLeftOuterJoinWithEmptyTable5:436->QueryTestCaseBase.assertResultSet:359->QueryTestCaseBase.assertResultSet:384->QueryTestCaseBase.verifyResultText:500 Result Verification expected:<[l_linenumber,?sum,?max_1,?max_2,?avg_3,?sum_4
-------------------------------
1,0,,,33.333333333333336,100.0
2,0,,,42.5,85.0]> but was:<[-------------------------------]>
TestGroupByQuery.testDistinctAggregationCasebyCase9:410->QueryTestCaseBase.assertResultSet:370->QueryTestCaseBase.assertResultSet:384->QueryTestCaseBase.verifyResultText:500 Result Verification expected:<[l_orderkey,cnt1,value2,l_partkey,avg1,cnt2
-------------------------------
1,1,28.0,1,26.5,2
2,1,39.0,2,38.0,1
3,1,46.0,2,45.0,1
3,1,51.0,3,49.0,1]> but was:<[-------------------------------]>
TestGroupByQuery.testGroupbyWithJson:581->QueryTestCaseBase.assertResultSet:359->QueryTestCaseBase.assertResultSet:384->QueryTestCaseBase.verifyResultText:500 Result Verification expected:<[l_orderkey,total,num
-------------------------------
3,2.5,3
2,2.0,1
1,1.0,3]> but was:<[-------------------------------]>
TestGroupByQuery.testHavingWithAggFunction:572->QueryTestCaseBase.assertResultSet:359->QueryTestCaseBase.assertResultSet:384->QueryTestCaseBase.verifyResultText:500 Result Verification expected:<[l_orderkey,total,num
-------------------------------
3,2.5,3
2,2.0,1]> but was:<[-------------------------------]>
TestGroupByQuery.testHavingWithNamedTarget:563->QueryTestCaseBase.assertResultSet:359->QueryTestCaseBase.assertResultSet:384->QueryTestCaseBase.verifyResultText:500 Result Verification expected:<[l_orderkey,total,num
-------------------------------
1,1.0,3
2,2.0,1
3,2.5,3]> but was:<[-------------------------------]>
TestGroupByQuery.testDistinctAggregationCasebyCase11:447 expected:<[id,?count_4,?avg_5,?min_6,?max_7,?sum_8,?cast_9,?cast_10,?cast_11,?cast_12
-------------------------------
1,2,4.0,0,5,12,4,0,5,12
2,3,2.0,0,3,6,7,0,8,21]
> but was:<[
-------------------------------]
>
TestGroupByQuery.testDistinctAggregationCasebyCase9:410->QueryTestCaseBase.assertResultSet:370->QueryTestCaseBase.assertResultSet:384->QueryTestCaseBase.verifyResultText:500 Result Verification expected:<[l_orderkey,cnt1,value2,l_partkey,avg1,cnt2
-------------------------------
1,1,28.0,1,26.5,2
2,1,39.0,2,38.0,1
3,1,46.0,2,45.0,1
3,1,51.0,3,49.0,1]> but was:<[-------------------------------]>
TestGroupByQuery.testGroupbyWithJson:581->QueryTestCaseBase.assertResultSet:359->QueryTestCaseBase.assertResultSet:384->QueryTestCaseBase.verifyResultText:500 Result Verification expected:<[l_orderkey,total,num
-------------------------------
3,2.5,3
2,2.0,1
1,1.0,3]> but was:<[-------------------------------]>
TestGroupByQuery.testHavingWithAggFunction:572->QueryTestCaseBase.assertResultSet:359->QueryTestCaseBase.assertResultSet:384->QueryTestCaseBase.verifyResultText:500 Result Verification expected:<[l_orderkey,total,num
-------------------------------
3,2.5,3
2,2.0,1]> but was:<[-------------------------------]>
TestGroupByQuery.testHavingWithNamedTarget:563->QueryTestCaseBase.assertResultSet:359->QueryTestCaseBase.assertResultSet:384->QueryTestCaseBase.verifyResultText:500 Result Verification expected:<[l_orderkey,total,num
-------------------------------
1,1.0,3
2,2.0,1
3,2.5,3]> but was:<[-------------------------------]>
TestSelectQuery.testSimpleQueryWithLimitPartitionedTable:93->QueryTestCaseBase.assertResultSet:359->QueryTestCaseBase.assertResultSet:384->QueryTestCaseBase.verifyResultText:500 Result Verification expected:<...-------------------
[3,Customer#000000003,MG9kdTD2WBHm,11-719-748-3364,7498.12,AUTOMOBILE, deposits eat slyly ironic, even instructions. express foxes detect slyly. blithely even accounts abov,1
3,Customer#000000003,MG9kdTD2WBHm,11-719-748-3364,7498.12,AUTOMOBILE, deposits eat slyly ironic, even instructions. express foxes detect slyly. blithely even accounts abov,1
3,Customer#000000003,MG9kdTD2WBHm,11-719-748-3364,7498.12,AUTOMOBILE, deposits eat slyly ironic, even instructions. express foxes detect slyly. blithely even accounts abov,1
3,Customer#000000003,MG9kdTD2WBHm,11-719-748-3364,7498.12,AUTOMOBILE, deposits eat slyly ironic, even instructions. express foxes detect slyly. blithely even accounts abov,1
3,Customer#000000003,MG9kdTD2WBHm,11-719-748-3364,7498.12,AUTOMOBILE, deposits eat slyly ironic, even instructions. express foxes detect slyly. blithely even accounts abov,1
2,Customer#000000002,XSTf4,NCwDVaWNe6tEgvwfmRchLXak,23-768-687-3665,121.65,AUTOMOBILE,l accounts. blithely ironic theodolites integrate boldly: caref,13
2,Customer#000000002,XSTf4,NCwDVaWNe6tEgvwfmRchLXak,23-768-687-3665,121.65,AUTOMOBILE,l accounts. blithely ironic theodolites integrate boldly: caref,13
2,Customer#000000002,XSTf4,NCwDVaWNe6tEgvwfmRchLXak,23-768-687-3665,121.65,AUTOMOBILE,l accounts. blithely ironic theodolites integrate boldly: caref,13]
2,Customer#00000000...> but was:<...-------------------
[1,Customer#000000001,IVhzIApeRb ot,c,E,25-989-741-2988,711.56,BUILDING,to the even, regular platelets. regular, ironic epitaphs nag e,15
1,Customer#000000001,IVhzIApeRb ot,c,E,25-989-741-2988,711.56,BUILDING,to the even, regular platelets. regular, ironic epitaphs nag e,15
1,Customer#000000001,IVhzIApeRb ot,c,E,25-989-741-2988,711.56,BUILDING,to the even, regular platelets. regular, ironic epitaphs nag e,15
1,Customer#000000001,IVhzIApeRb ot,c,E,25-989-741-2988,711.56,BUILDING,to the even, regular platelets. regular, ironic epitaphs nag e,15
4,Customer#000000004,XxVSJsLAGtn,14-128-190-5944,2866.83,MACHINERY, requests. final, regular ideas sleep final accou,4
4,Customer#000000004,XxVSJsLAGtn,14-128-190-5944,2866.83,MACHINERY, requests. final, regular ideas sleep final accou,4
4,Customer#000000004,XxVSJsLAGtn,14-128-190-5944,2866.83,MACHINERY, requests. final, regular ideas sleep final accou,4
4,Customer#000000004,XxVSJsLAGtn,14-128-190-5944,2866.83,MACHINERY, requests. final, regular ideas sleep final accou,4]
2,Customer#00000000...>
TestBuiltinFunctions.testAvgLong:81->QueryTestCaseBase.assertResultSet:359->QueryTestCaseBase.assertResultSet:384->QueryTestCaseBase.verifyResultText:500 Result Verification expected:<[total_avg
-------------------------------
2.0]> but was:<[-------------------------------]>
TestBuiltinFunctions.testAvgDouble:74->QueryTestCaseBase.assertResultSet:359->QueryTestCaseBase.assertResultSet:384->QueryTestCaseBase.verifyResultText:500 Result Verification expected:<[l_orderkey,revenue
-------------------------------
1,0.065
2,0.0
3,0.08]> but was:<[-------------------------------]>
TestBuiltinFunctions.testAvgInt:88->QueryTestCaseBase.assertResultSet:359->QueryTestCaseBase.assertResultSet:384->QueryTestCaseBase.verifyResultText:500 Result Verification expected:<[total_avg
-------------------------------
1.8]> but was:<[-------------------------------]>
Tests in error:
TestTablePartitions.testColumnPartitionedTableByThreeColumns:314 » IllegalArgument
TestTablePartitions.testColumnPartitionedTableByTwoColumnsWithCompression:594 » IllegalArgument
TestTablePartitions.testQueryCasesOnColumnPartitionedTable:231->assertPartitionDirectories:205 » IllegalArgument
TestTablePartitions.testColumnPartitionedTableByOneColumn:185->assertPartitionDirectories:205 » IllegalArgument
TestTablePartitions.testInsertIntoColumnPartitionedTableByThreeColumns:378 » IllegalArgument
TestTablePartitions.testColumnPartitionedTableNoMatchedPartition:722 » IllegalArgument
TestTablePartitions.testColumnPartitionedTableByThreeColumnsWithCompression:639 » IllegalArgument
TestTablePartitions.testColumnPartitionedTableByOneColumnsWithCompression:557 » IllegalArgument
TestInsertQuery.testInsertOverwriteWithCompression:488 » IllegalArgument Wrong...
TestInsertQuery.testInsertOverwriteWithUnionDifferentAlias:756->QueryTestCaseBase.executeFile:339 » Service
TestInsertQuery.testInsertOverwriteTableWithNonFromQuery2:669->QueryTestCaseBase.executeString:293 » Service
TestInsertQuery.testInsertOverwriteWithDatabase:615->QueryTestCaseBase.executeFile:339 » Service
TestInsertQuery.testInsertOverwriteTableWithNonFromQuery:634->QueryTestCaseBase.executeString:293 » Service
TestInsertQuery.testInsertInto:69->QueryTestCaseBase.executeFile:339 » Service
TestInsertQuery.testInsertOverwriteSmallerColumns:304->QueryTestCaseBase.executeFile:339 » Service
TestInsertQuery.testInsertOverwrite:49->QueryTestCaseBase.executeFile:339 » Service
TestCTASQuery.testCtasWithGroupby:150->QueryTestCaseBase.executeQuery:303->QueryTestCaseBase.executeFile:339 » Service
TestCTASQuery.testCtasWithLimit:170->QueryTestCaseBase.executeQuery:303->QueryTestCaseBase.executeFile:339 » Service
TestCTASQuery.testCtasWithUnion:180->QueryTestCaseBase.executeQuery:303->QueryTestCaseBase.executeFile:339 » Service
TestCTASQuery.testCtasWithOptions:204->QueryTestCaseBase.executeQuery:303->QueryTestCaseBase.executeFile:339 » Service
TestCTASQuery.testCtasWithStoreType:190->QueryTestCaseBase.executeQuery:303->QueryTestCaseBase.executeFile:339 » Service
TestCTASQuery.testCtasWithOrderby:160->QueryTestCaseBase.executeQuery:303->QueryTestCaseBase.executeFile:339 » Service
TestCreateTable.testCreatedTableWithQuotedIdentifierAndVerifyPath:139->assertPathOfCreatedTable:110 » IllegalArgument
TestCreateTable.testCreatedTableJustCreatedAndVerifyPath:133->assertPathOfCreatedTable:110 » IllegalArgument
TestGroupByQuery.testDistinctAggregationCaseByCase3:497 » Service java.sql.SQL...
TestGroupByQuery.testDistinctAggregationCasebyCase11:435 » Service java.sql.SQ...
TestPredicates.testInPredicateWithConstant:307->ExprTestBase.testEval:196->ExprTestBase.testEval:281 » Compilation
TestPredicates.testIsNullPredicateWithFunction:361->ExprTestBase.testEval:196->ExprTestBase.testEval:281 » Compilation
TestSQLExpression.testCastFromTable:888->ExprTestBase.testEval:203->ExprTestBase.testEval:284 » NoSuchMethod
TestSQLExpression.testQuotedIdentifiers:47->ExprTestBase.testEval:196->ExprTestBase.testEval:281 » Compilation
TestEvalCodeGenerator.testStringConcat:308->ExprTestBase.testEval:196->ExprTestBase.testEval:281 » Compilation
TestDateTimeFunctions.testDatePart:242->ExprTestBase.testEval:196->ExprTestBase.testEval:281 » Compilation
TestDateTimeFunctions.testExtract:125->ExprTestBase.testEval:196->ExprTestBase.testEval:281 » Compilation
TestStringOperatorsAndFunctions.testRegexReplace:140->ExprTestBase.testEval:196->ExprTestBase.testEval:281 » Compilation
TestStringOperatorsAndFunctions.testOctetLength:351->ExprTestBase.testEval:196->ExprTestBase.testEval:281 » Compilation
TestStringOperatorsAndFunctions.testChr:521->ExprTestBase.testEval:196->ExprTestBase.testEval:281 » Compilation
TestStringOperatorsAndFunctions.testMd5:294->ExprTestBase.testEval:196->ExprTestBase.testEval:281 » Compilation
TestStringOperatorsAndFunctions.testAscii:505->ExprTestBase.testEval:196->ExprTestBase.testEval:281 » Compilation
TestStringOperatorsAndFunctions.testLTrim:75->ExprTestBase.testEval:196->ExprTestBase.testEval:281 » Compilation
TestStringOperatorsAndFunctions.testLower:256->ExprTestBase.testEval:196->ExprTestBase.testEval:281 » Compilation
TestStringOperatorsAndFunctions.testRTrim:96->ExprTestBase.testEval:196->ExprTestBase.testEval:281 » Compilation
TestStringOperatorsAndFunctions.testRight:202->ExprTestBase.testEval:196->ExprTestBase.testEval:281 » Compilation
TestStringOperatorsAndFunctions.testUpper:243->ExprTestBase.testEval:196->ExprTestBase.testEval:281 » Compilation
TestStringOperatorsAndFunctions.testLeft:173->ExprTestBase.testEval:196->ExprTestBase.testEval:281 » Compilation
TestStringOperatorsAndFunctions.testTrim:117->ExprTestBase.testEval:196->ExprTestBase.testEval:281 » Compilation
TestStringOperatorsAndFunctions.testCharLength:269->ExprTestBase.testEval:196->ExprTestBase.testEval:281 » Compilation
TestStringOperatorsAndFunctions.testBitLength:457->ExprTestBase.testEval:196->ExprTestBase.testEval:281 » Compilation
TestStringOperatorsAndFunctions.testReverse:217->ExprTestBase.testEval:196->ExprTestBase.testEval:281 » Compilation
TestStringOperatorsAndFunctions.testSplitPart:367->ExprTestBase.testEval:196->ExprTestBase.testEval:281 » Compilation
TestStringOperatorsAndFunctions.testFindInSet:593->ExprTestBase.testEval:209->ExprTestBase.testEval:281 » Compilation
TestStringOperatorsAndFunctions.testLength:281->ExprTestBase.testEval:196->ExprTestBase.testEval:281 » Compilation
TestStringOperatorsAndFunctions.testLocate:439->ExprTestBase.testEval:196->ExprTestBase.testEval:281 » Compilation
TestStringOperatorsAndFunctions.testRepeat:231->ExprTestBase.testEval:196->ExprTestBase.testEval:281 » Compilation
TestStringOperatorsAndFunctions.testStrpos:473->ExprTestBase.testEval:196->ExprTestBase.testEval:281 » Compilation
TestStringOperatorsAndFunctions.testSubstr:396->ExprTestBase.testEval:196->ExprTestBase.testEval:281 » Compilation
TestStringOperatorsAndFunctions.testStrposb:489->ExprTestBase.testEval:196->ExprTestBase.testEval:281 » Compilation
TestMathFunctions.testRoundWithSpecifiedPrecision:469->ExprTestBase.testEval:196->ExprTestBase.testEval:281 » Compilation
TestMathFunctions.testAbs:344->ExprTestBase.testEval:196->ExprTestBase.testEval:281 » Compilation
TestMathFunctions.testCos:144->ExprTestBase.testEval:196->ExprTestBase.testEval:281 » Compilation
TestMathFunctions.testDiv:257->ExprTestBase.testEval:196->ExprTestBase.testEval:281 » Compilation
TestMathFunctions.testExp:321->ExprTestBase.testEval:196->ExprTestBase.testEval:281 » Compilation
TestMathFunctions.testMod:241->ExprTestBase.testEval:196->ExprTestBase.testEval:281 » Compilation
TestMathFunctions.testPow:409->ExprTestBase.testEval:196->ExprTestBase.testEval:281 » Compilation
TestMathFunctions.testSin:127->ExprTestBase.testEval:196->ExprTestBase.testEval:281 » Compilation
TestMathFunctions.testTan:160->ExprTestBase.testEval:196->ExprTestBase.testEval:281 » Compilation
TestMathFunctions.testAtan2:225->ExprTestBase.testEval:196->ExprTestBase.testEval:281 » Compilation
TestMathFunctions.testFloor:73->ExprTestBase.testEval:196->ExprTestBase.testEval:281 » Compilation
TestMathFunctions.testRound:45->ExprTestBase.testEval:196->ExprTestBase.testEval:281 » Compilation
TestMathFunctions.testAcos:192->ExprTestBase.testEval:196->ExprTestBase.testEval:281 » Compilation
TestMathFunctions.testAsin:176->ExprTestBase.testEval:196->ExprTestBase.testEval:281 » Compilation
TestMathFunctions.testAtan:208->ExprTestBase.testEval:196->ExprTestBase.testEval:281 » Compilation
TestMathFunctions.testCbrt:364->ExprTestBase.testEval:196->ExprTestBase.testEval:281 » Compilation
TestMathFunctions.testCeil:92->ExprTestBase.testEval:196->ExprTestBase.testEval:281 » Compilation
TestMathFunctions.testSign:273->ExprTestBase.testEval:196->ExprTestBase.testEval:281 » Compilation
TestMathFunctions.testSqrt:298->ExprTestBase.testEval:196->ExprTestBase.testEval:281 » Compilation
TestMathFunctions.testCeiling:111->ExprTestBase.testEval:196->ExprTestBase.testEval:281 » Compilation
TestMathFunctions.testRadians:428->ExprTestBase.testEval:196->ExprTestBase.testEval:281 » Compilation
TestMathFunctions.testDegrees:387->ExprTestBase.testEval:196->ExprTestBase.testEval:281 » Compilation
Tests run: 1336, Failures: 29, Errors: 78, Skipped: 0
[INFO] ------------------------------------------------------------------------
[INFO] Reactor Summary:
[INFO]
[INFO] Tajo Main ......................................... SUCCESS [ 1.644 s]
[INFO] Tajo Project POM .................................. SUCCESS [ 1.184 s]
[INFO] Tajo Maven Plugins ................................ SUCCESS [ 3.266 s]
[INFO] Tajo Common ....................................... SUCCESS [ 24.143 s]
[INFO] Tajo Algebra ...................................... SUCCESS [ 1.269 s]
[INFO] Tajo Catalog Common ............................... SUCCESS [ 6.676 s]
[INFO] Tajo Plan ......................................... SUCCESS [ 5.893 s]
[INFO] Tajo Rpc .......................................... SUCCESS [ 25.559 s]
[INFO] Tajo Catalog Client ............................... SUCCESS [ 0.953 s]
[INFO] Tajo Catalog Server ............................... SUCCESS [ 10.442 s]
[INFO] Tajo Storage Common ............................... SUCCESS [ 10.571 s]
[INFO] Tajo HDFS Storage ................................. SUCCESS [ 39.927 s]
[INFO] Tajo HBase Storage ................................ SUCCESS [ 2.453 s]
[INFO] Tajo PullServer ................................... SUCCESS [ 0.871 s]
[INFO] Tajo Client ....................................... SUCCESS [ 3.629 s]
[INFO] Tajo JDBC Driver .................................. SUCCESS [ 0.528 s]
[INFO] ASM (thirdparty) .................................. SUCCESS [ 0.612 s]
[INFO] Tajo Core ......................................... FAILURE [16:27 min]
[INFO] Tajo Catalog Drivers .............................. SKIPPED
[INFO] Tajo Catalog ...................................... SKIPPED
[INFO] Tajo Storage ...................................... SKIPPED
[INFO] Tajo Distribution ................................. SKIPPED
[INFO] ------------------------------------------------------------------------
[INFO] BUILD FAILURE
[INFO] ------------------------------------------------------------------------
[INFO] Total time: 18:47 min
[INFO] Finished at: 2015-01-06T17:46:01+00:00
[INFO] Final Memory: 95M/845M
[INFO] ------------------------------------------------------------------------
[ERROR] Failed to execute goal org.apache.maven.plugins:maven-surefire-plugin:2.17:test (default-test) on project tajo-core: There are test failures.
[ERROR]
[ERROR] Please refer to <https://builds.apache.org/job/Tajo-master-CODEGEN-build/ws/tajo-core/target/surefire-reports> for the individual test results.
[ERROR] -> [Help 1]
[ERROR]
[ERROR] To see the full stack trace of the errors, re-run Maven with the -e switch.
[ERROR] Re-run Maven using the -X switch to enable full debug logging.
[ERROR]
[ERROR] For more information about the errors and possible solutions, please read the following articles:
[ERROR] [Help 1] http://cwiki.apache.org/confluence/display/MAVEN/MojoFailureException
[ERROR]
[ERROR] After correcting the problems, you can resume the build with the command
[ERROR] mvn <goals> -rf :tajo-core
Build step 'Execute shell' marked build as failure
Updating TAJO-1270
Build failed in Jenkins: Tajo-master-CODEGEN-build #174
Posted by Apache Jenkins Server <je...@builds.apache.org>.
See <https://builds.apache.org/job/Tajo-master-CODEGEN-build/174/changes>
Changes:
[hyunsik] TAJO-1280: Update the roles of Hyoungjun and Jihun in web site.
------------------------------------------
[...truncated 415128 lines...]
Jan 6, 2015 2:05:33 PM INFO: parquet.hadoop.ParquetFileReader: reading another 1 footers
Jan 6, 2015 2:05:33 PM INFO: parquet.hadoop.ParquetFileReader: reading another 1 footers
Jan 6, 2015 2:05:48 PM INFO: parquet.hadoop.ParquetFileReader: reading another 1 footers
Jan 6, 2015 2:05:48 PM INFO: parquet.hadoop.ParquetFileReader: reading another 1 footers
Jan 6, 2015 2:05:48 PM INFO: parquet.hadoop.ParquetFileReader: reading another 1 footers
Jan 6, 2015 2:05:48 PM INFO: parquet.hadoop.ParquetFileReader: reading another 1 footers
Jan 6, 2015 2:05:49 PM INFO: parquet.hadoop.ParquetFileReader: reading another 1 footers
Jan 6, 2015 2:05:52 PM INFO: parquet.hadoop.ParquetFileReader: reading another 1 footers
2015-01-06 14:18:55,320 INFO: org.apache.tajo.worker.TajoWorker (run(615)) - ============================================
2015-01-06 14:18:55,324 INFO: org.apache.tajo.worker.TajoWorker (run(616)) - TajoWorker received SIGINT Signal
2015-01-06 14:18:55,324 INFO: org.apache.tajo.worker.TajoWorker (run(617)) - ============================================
2015-01-06 14:18:55,321 INFO: org.apache.tajo.master.TajoMaster (run(573)) - ============================================
2015-01-06 14:18:55,324 INFO: org.apache.tajo.master.session.SessionManager (removeSession(79)) - Session dbef2891-013c-4bab-9984-044f7fc779e5 is removed.
2015-01-06 14:18:55,324 INFO: org.apache.tajo.master.session.SessionManager (removeSession(79)) - Session 622904fb-576d-40c4-90fb-8d06ad86af4b is removed.
2015-01-06 14:18:55,324 INFO: org.apache.tajo.util.history.HistoryCleaner (run(134)) - History cleaner stopped
2015-01-06 14:18:55,324 INFO: org.apache.tajo.util.history.HistoryWriter (run(227)) - HistoryWriter_asf903.gq1.ygridcore.net_39024 stopped.
2015-01-06 14:18:55,325 INFO: org.apache.tajo.master.TajoMaster (run(574)) - TajoMaster received SIGINT Signal
2015-01-06 14:18:55,325 INFO: org.apache.tajo.master.TajoMaster (run(575)) - ============================================
2015-01-06 14:18:55,325 INFO: org.apache.tajo.catalog.CatalogServer (stop(198)) - Catalog Server (127.0.0.1:39019) shutdown
2015-01-06 14:18:55,327 INFO: org.apache.tajo.rpc.NettyServerBase (shutdown(128)) - Rpc (CatalogProtocol) listened on 127.0.0.1:39019) shutdown
2015-01-06 14:18:55,329 INFO: org.apache.tajo.util.history.HistoryWriter (run(227)) - HistoryWriter_127.0.0.1_39021 stopped.
2015-01-06 14:18:55,331 INFO: BlockStateChange (logAddStoredBlock(2383)) - BLOCK* addStoredBlock: blockMap updated: 127.0.0.1:38666 is added to blk_1073741834_1010{blockUCState=UNDER_CONSTRUCTION, primaryNodeIndex=-1, replicas=[ReplicaUnderConstruction[[DISK]DS-8865692e-c71c-4538-b85c-706f105f251f:NORMAL|RBW]]} size 439
2015-01-06 14:18:55,332 INFO: org.apache.tajo.util.history.HistoryCleaner (run(134)) - History cleaner stopped
2015-01-06 14:18:55,333 INFO: org.apache.tajo.rpc.NettyServerBase (shutdown(128)) - Rpc (TajoMasterProtocol) listened on 127.0.0.1:39021) shutdown
2015-01-06 14:18:55,334 INFO: org.apache.tajo.rpc.NettyServerBase (shutdown(128)) - Rpc (TajoMasterClientProtocol) listened on 127.0.0.1:39020) shutdown
2015-01-06 14:18:55,335 ERROR: org.apache.tajo.master.rm.TajoWorkerResourceManager (run(349)) - java.lang.InterruptedException
2015-01-06 14:18:55,336 INFO: org.apache.tajo.rpc.NettyServerBase (shutdown(128)) - Rpc (TajoResourceTrackerProtocol) listened on 127.0.0.1:39018) shutdown
2015-01-06 14:18:55,336 INFO: org.apache.tajo.master.TajoMaster (stop(407)) - Tajo Master main thread exiting
2015-01-06 14:18:55,389 INFO: org.apache.tajo.worker.WorkerHeartbeatService (run(242)) - Worker Resource Heartbeat Thread stopped.
2015-01-06 14:18:55,391 INFO: org.apache.tajo.rpc.NettyServerBase (shutdown(128)) - Rpc (QueryMasterProtocol) listened on 0:0:0:0:0:0:0:0:39024) shutdown
2015-01-06 14:18:55,391 INFO: org.apache.tajo.master.querymaster.QueryMasterManagerService (stop(111)) - QueryMasterManagerService stopped
2015-01-06 14:18:55,391 INFO: org.apache.tajo.master.querymaster.QueryMaster (run(552)) - QueryMaster heartbeat thread stopped
2015-01-06 14:18:55,392 INFO: org.apache.tajo.master.TajoAsyncDispatcher (stop(122)) - AsyncDispatcher stopped:querymaster_1420552931194
2015-01-06 14:18:55,392 INFO: org.apache.tajo.master.querymaster.QueryMaster (stop(168)) - QueryMaster stop
2015-01-06 14:18:55,392 INFO: org.apache.tajo.worker.TajoWorkerClientService (stop(99)) - TajoWorkerClientService stopping
2015-01-06 14:18:55,393 INFO: org.apache.tajo.rpc.NettyServerBase (shutdown(128)) - Rpc (QueryMasterClientProtocol) listened on 0:0:0:0:0:0:0:0:39023) shutdown
2015-01-06 14:18:55,393 INFO: org.apache.tajo.worker.TajoWorkerClientService (stop(103)) - TajoWorkerClientService stopped
2015-01-06 14:18:55,394 INFO: org.apache.tajo.rpc.NettyServerBase (shutdown(128)) - Rpc (TajoWorkerProtocol) listened on 0:0:0:0:0:0:0:0:39022) shutdown
2015-01-06 14:18:55,394 INFO: org.apache.tajo.worker.TajoWorkerManagerService (stop(97)) - TajoWorkerManagerService stopped
2015-01-06 14:18:55,395 INFO: org.apache.tajo.worker.TajoWorker (serviceStop(404)) - TajoWorker main thread exiting
Results :
Failed tests:
TestBuiltinFunctions.testAvgLong:81->QueryTestCaseBase.assertResultSet:359->QueryTestCaseBase.assertResultSet:384->QueryTestCaseBase.verifyResultText:500 Result Verification expected:<[total_avg
-------------------------------
2.0]> but was:<[-------------------------------]>
TestBuiltinFunctions.testAvgDouble:74->QueryTestCaseBase.assertResultSet:359->QueryTestCaseBase.assertResultSet:384->QueryTestCaseBase.verifyResultText:500 Result Verification expected:<[l_orderkey,revenue
-------------------------------
1,0.065
2,0.0
3,0.08]> but was:<[-------------------------------]>
TestBuiltinFunctions.testAvgInt:88->QueryTestCaseBase.assertResultSet:359->QueryTestCaseBase.assertResultSet:384->QueryTestCaseBase.verifyResultText:500 Result Verification expected:<[total_avg
-------------------------------
1.8]> but was:<[-------------------------------]>
TestJoinBroadcast.testBroadcastSubquery2:401->QueryTestCaseBase.assertResultSet:359->QueryTestCaseBase.assertResultSet:384->QueryTestCaseBase.verifyResultText:500 Result Verification expected:<[?sum
-------------------------------
190.0]> but was:<[-------------------------------]>
TestWindowQuery.firstValue1:258->QueryTestCaseBase.assertResultSet:359->QueryTestCaseBase.assertResultSet:384->QueryTestCaseBase.verifyResultText:500 Result Verification expected:<[l_orderkey,shipmode_first,linenumber_first,suppkey_first,shipdate_first,commitdate_first,extendedprice_first,discount_first
-------------------------------
1,MAIL,1,7311,1996-03-13,1996-02-12 00:00:00,21168.23,0.04
1,MAIL,1,7311,1996-03-13,1996-02-12 00:00:00,21168.23,0.04
2,RAIL,1,1191,1997-01-28,1997-01-14 00:00:00,44694.46,0.0
3,AIR,1,1798,1993-11-09,1993-12-20 00:00:00,46796.47,0.06
3,AIR,1,1798,1993-11-09,1993-12-20 00:00:00,46796.47,0.06]> but was:<[-------------------------------]>
TestWindowQuery.lastValue1:293->QueryTestCaseBase.assertResultSet:359->QueryTestCaseBase.assertResultSet:384->QueryTestCaseBase.verifyResultText:500 Result Verification expected:<[l_orderkey,shipmode_last,linenumber_last,suppkey_last,shipdate_last,commitdate_last,extendedprice_last,discount_last
-------------------------------
1,TRUCK,2,7706,1996-04-12,1996-02-28 00:00:00,45983.16,0.09
1,TRUCK,2,7706,1996-04-12,1996-02-28 00:00:00,45983.16,0.09
2,RAIL,1,1191,1997-01-28,1997-01-14 00:00:00,44694.46,0.0
3,RAIL,2,6540,1994-02-02,1994-01-04 00:00:00,54058.05,0.1
3,RAIL,2,6540,1994-02-02,1994-01-04 00:00:00,54058.05,0.1]> but was:<[-------------------------------]>
TestGroupByQuery.testDistinctAggregationCasebyCase9:410->QueryTestCaseBase.assertResultSet:370->QueryTestCaseBase.assertResultSet:384->QueryTestCaseBase.verifyResultText:500 Result Verification expected:<[l_orderkey,cnt1,value2,l_partkey,avg1,cnt2
-------------------------------
1,1,28.0,1,26.5,2
2,1,39.0,2,38.0,1
3,1,46.0,2,45.0,1
3,1,51.0,3,49.0,1]> but was:<[-------------------------------]>
TestGroupByQuery.testGroupbyWithJson:581->QueryTestCaseBase.assertResultSet:359->QueryTestCaseBase.assertResultSet:384->QueryTestCaseBase.verifyResultText:500 Result Verification expected:<[l_orderkey,total,num
-------------------------------
3,2.5,3
2,2.0,1
1,1.0,3]> but was:<[-------------------------------]>
TestGroupByQuery.testHavingWithAggFunction:572->QueryTestCaseBase.assertResultSet:359->QueryTestCaseBase.assertResultSet:384->QueryTestCaseBase.verifyResultText:500 Result Verification expected:<[l_orderkey,total,num
-------------------------------
3,2.5,3
2,2.0,1]> but was:<[-------------------------------]>
TestGroupByQuery.testHavingWithNamedTarget:563->QueryTestCaseBase.assertResultSet:359->QueryTestCaseBase.assertResultSet:384->QueryTestCaseBase.verifyResultText:500 Result Verification expected:<[l_orderkey,total,num
-------------------------------
1,1.0,3
2,2.0,1
3,2.5,3]> but was:<[-------------------------------]>
TestGroupByQuery.testDistinctAggregationCasebyCase11:447 expected:<[id,?count_4,?avg_5,?min_6,?max_7,?sum_8,?cast_9,?cast_10,?cast_11,?cast_12
-------------------------------
1,2,4.0,0,5,12,4,0,5,12
2,3,2.0,0,3,6,7,0,8,21]
> but was:<[
-------------------------------]
>
TestGroupByQuery.testDistinctAggregationCasebyCase9:410->QueryTestCaseBase.assertResultSet:370->QueryTestCaseBase.assertResultSet:384->QueryTestCaseBase.verifyResultText:500 Result Verification expected:<[l_orderkey,cnt1,value2,l_partkey,avg1,cnt2
-------------------------------
1,1,28.0,1,26.5,2
2,1,39.0,2,38.0,1
3,1,46.0,2,45.0,1
3,1,51.0,3,49.0,1]> but was:<[-------------------------------]>
TestGroupByQuery.testGroupbyWithJson:581->QueryTestCaseBase.assertResultSet:359->QueryTestCaseBase.assertResultSet:384->QueryTestCaseBase.verifyResultText:500 Result Verification expected:<[l_orderkey,total,num
-------------------------------
3,2.5,3
2,2.0,1
1,1.0,3]> but was:<[-------------------------------]>
TestGroupByQuery.testHavingWithAggFunction:572->QueryTestCaseBase.assertResultSet:359->QueryTestCaseBase.assertResultSet:384->QueryTestCaseBase.verifyResultText:500 Result Verification expected:<[l_orderkey,total,num
-------------------------------
3,2.5,3
2,2.0,1]> but was:<[-------------------------------]>
TestGroupByQuery.testHavingWithNamedTarget:563->QueryTestCaseBase.assertResultSet:359->QueryTestCaseBase.assertResultSet:384->QueryTestCaseBase.verifyResultText:500 Result Verification expected:<[l_orderkey,total,num
-------------------------------
1,1.0,3
2,2.0,1
3,2.5,3]> but was:<[-------------------------------]>
TestJoinQuery.testLeftOuterJoinWithEmptyTable5:436->QueryTestCaseBase.assertResultSet:359->QueryTestCaseBase.assertResultSet:384->QueryTestCaseBase.verifyResultText:500 Result Verification expected:<[l_linenumber,?sum,?max_1,?max_2,?avg_3,?sum_4
-------------------------------
1,0,,,33.333333333333336,100.0
2,0,,,42.5,85.0]> but was:<[-------------------------------]>
TestJoinQuery.testLeftOuterJoinWithEmptyTable5:436->QueryTestCaseBase.assertResultSet:359->QueryTestCaseBase.assertResultSet:384->QueryTestCaseBase.verifyResultText:500 Result Verification expected:<[l_linenumber,?sum,?max_1,?max_2,?avg_3,?sum_4
-------------------------------
1,0,,,33.333333333333336,100.0
2,0,,,42.5,85.0]> but was:<[-------------------------------]>
TestJoinQuery.testLeftOuterJoinWithEmptyTable5:436->QueryTestCaseBase.assertResultSet:359->QueryTestCaseBase.assertResultSet:384->QueryTestCaseBase.verifyResultText:500 Result Verification expected:<[l_linenumber,?sum,?max_1,?max_2,?avg_3,?sum_4
-------------------------------
1,0,,,33.333333333333336,100.0
2,0,,,42.5,85.0]> but was:<[-------------------------------]>
TestJoinQuery.testLeftOuterJoinWithEmptyTable5:436->QueryTestCaseBase.assertResultSet:359->QueryTestCaseBase.assertResultSet:384->QueryTestCaseBase.verifyResultText:500 Result Verification expected:<[l_linenumber,?sum,?max_1,?max_2,?avg_3,?sum_4
-------------------------------
1,0,,,33.333333333333336,100.0
2,0,,,42.5,85.0]> but was:<[-------------------------------]>
TestCTASQuery.testCtasWithManagedTable:232 null
TestTaskStatusUpdate.case2:80->assertStatus:164 expected:<3> but was:<2>
Tests in error:
TestSQLExpression.testCastFromTable:888->ExprTestBase.testEval:203->ExprTestBase.testEval:284 » NoSuchMethod
TestSQLExpression.testQuotedIdentifiers:47->ExprTestBase.testEval:196->ExprTestBase.testEval:281 » Compilation
TestPredicates.testInPredicateWithConstant:307->ExprTestBase.testEval:196->ExprTestBase.testEval:281 » Compilation
TestPredicates.testIsNullPredicateWithFunction:361->ExprTestBase.testEval:196->ExprTestBase.testEval:281 » Compilation
TestMathFunctions.testRoundWithSpecifiedPrecision:469->ExprTestBase.testEval:196->ExprTestBase.testEval:281 » Compilation
TestMathFunctions.testAbs:344->ExprTestBase.testEval:196->ExprTestBase.testEval:281 » Compilation
TestMathFunctions.testCos:144->ExprTestBase.testEval:196->ExprTestBase.testEval:281 » Compilation
TestMathFunctions.testDiv:257->ExprTestBase.testEval:196->ExprTestBase.testEval:281 » Compilation
TestMathFunctions.testExp:321->ExprTestBase.testEval:196->ExprTestBase.testEval:281 » Compilation
TestMathFunctions.testMod:241->ExprTestBase.testEval:196->ExprTestBase.testEval:281 » Compilation
TestMathFunctions.testPow:409->ExprTestBase.testEval:196->ExprTestBase.testEval:281 » Compilation
TestMathFunctions.testSin:127->ExprTestBase.testEval:196->ExprTestBase.testEval:281 » Compilation
TestMathFunctions.testTan:160->ExprTestBase.testEval:196->ExprTestBase.testEval:281 » Compilation
TestMathFunctions.testAtan2:225->ExprTestBase.testEval:196->ExprTestBase.testEval:281 » Compilation
TestMathFunctions.testFloor:73->ExprTestBase.testEval:196->ExprTestBase.testEval:281 » Compilation
TestMathFunctions.testRound:45->ExprTestBase.testEval:196->ExprTestBase.testEval:281 » Compilation
TestMathFunctions.testAcos:192->ExprTestBase.testEval:196->ExprTestBase.testEval:281 » Compilation
TestMathFunctions.testAsin:176->ExprTestBase.testEval:196->ExprTestBase.testEval:281 » Compilation
TestMathFunctions.testAtan:208->ExprTestBase.testEval:196->ExprTestBase.testEval:281 » Compilation
TestMathFunctions.testCbrt:364->ExprTestBase.testEval:196->ExprTestBase.testEval:281 » Compilation
TestMathFunctions.testCeil:92->ExprTestBase.testEval:196->ExprTestBase.testEval:281 » Compilation
TestMathFunctions.testSign:273->ExprTestBase.testEval:196->ExprTestBase.testEval:281 » Compilation
TestMathFunctions.testSqrt:298->ExprTestBase.testEval:196->ExprTestBase.testEval:281 » Compilation
TestMathFunctions.testCeiling:111->ExprTestBase.testEval:196->ExprTestBase.testEval:281 » Compilation
TestMathFunctions.testRadians:428->ExprTestBase.testEval:196->ExprTestBase.testEval:281 » Compilation
TestMathFunctions.testDegrees:387->ExprTestBase.testEval:196->ExprTestBase.testEval:281 » Compilation
TestDateTimeFunctions.testDatePart:242->ExprTestBase.testEval:196->ExprTestBase.testEval:281 » Compilation
TestDateTimeFunctions.testExtract:125->ExprTestBase.testEval:196->ExprTestBase.testEval:281 » Compilation
TestStringOperatorsAndFunctions.testRegexReplace:140->ExprTestBase.testEval:196->ExprTestBase.testEval:281 » Compilation
TestStringOperatorsAndFunctions.testOctetLength:351->ExprTestBase.testEval:196->ExprTestBase.testEval:281 » Compilation
TestStringOperatorsAndFunctions.testChr:521->ExprTestBase.testEval:196->ExprTestBase.testEval:281 » Compilation
TestStringOperatorsAndFunctions.testMd5:294->ExprTestBase.testEval:196->ExprTestBase.testEval:281 » Compilation
TestStringOperatorsAndFunctions.testAscii:505->ExprTestBase.testEval:196->ExprTestBase.testEval:281 » Compilation
TestStringOperatorsAndFunctions.testLTrim:75->ExprTestBase.testEval:196->ExprTestBase.testEval:281 » Compilation
TestStringOperatorsAndFunctions.testLower:256->ExprTestBase.testEval:196->ExprTestBase.testEval:281 » Compilation
TestStringOperatorsAndFunctions.testRTrim:96->ExprTestBase.testEval:196->ExprTestBase.testEval:281 » Compilation
TestStringOperatorsAndFunctions.testRight:202->ExprTestBase.testEval:196->ExprTestBase.testEval:281 » Compilation
TestStringOperatorsAndFunctions.testUpper:243->ExprTestBase.testEval:196->ExprTestBase.testEval:281 » Compilation
TestStringOperatorsAndFunctions.testLeft:173->ExprTestBase.testEval:196->ExprTestBase.testEval:281 » Compilation
TestStringOperatorsAndFunctions.testTrim:117->ExprTestBase.testEval:196->ExprTestBase.testEval:281 » Compilation
TestStringOperatorsAndFunctions.testCharLength:269->ExprTestBase.testEval:196->ExprTestBase.testEval:281 » Compilation
TestStringOperatorsAndFunctions.testBitLength:457->ExprTestBase.testEval:196->ExprTestBase.testEval:281 » Compilation
TestStringOperatorsAndFunctions.testReverse:217->ExprTestBase.testEval:196->ExprTestBase.testEval:281 » Compilation
TestStringOperatorsAndFunctions.testSplitPart:367->ExprTestBase.testEval:196->ExprTestBase.testEval:281 » Compilation
TestStringOperatorsAndFunctions.testFindInSet:593->ExprTestBase.testEval:209->ExprTestBase.testEval:281 » Compilation
TestStringOperatorsAndFunctions.testLength:281->ExprTestBase.testEval:196->ExprTestBase.testEval:281 » Compilation
TestStringOperatorsAndFunctions.testLocate:439->ExprTestBase.testEval:196->ExprTestBase.testEval:281 » Compilation
TestStringOperatorsAndFunctions.testRepeat:231->ExprTestBase.testEval:196->ExprTestBase.testEval:281 » Compilation
TestStringOperatorsAndFunctions.testStrpos:473->ExprTestBase.testEval:196->ExprTestBase.testEval:281 » Compilation
TestStringOperatorsAndFunctions.testSubstr:396->ExprTestBase.testEval:196->ExprTestBase.testEval:281 » Compilation
TestStringOperatorsAndFunctions.testStrposb:489->ExprTestBase.testEval:196->ExprTestBase.testEval:281 » Compilation
TestGroupByQuery.testDistinctAggregationCaseByCase3:497 » Service java.sql.SQL...
TestGroupByQuery.testDistinctAggregationCasebyCase11:435 » Service java.sql.SQ...
TestCTASQuery.testCtasWithGroupby:150->QueryTestCaseBase.executeQuery:303->QueryTestCaseBase.executeFile:339 » Service
TestCTASQuery.testCtasWithLimit:170->QueryTestCaseBase.executeQuery:303->QueryTestCaseBase.executeFile:339 » Service
TestCTASQuery.testCtasWithUnion:180->QueryTestCaseBase.executeQuery:303->QueryTestCaseBase.executeFile:339 » Service
TestCTASQuery.testCtasWithOptions:204->QueryTestCaseBase.executeQuery:303->QueryTestCaseBase.executeFile:339 » Service
TestCTASQuery.testCtasWithStoreType:190->QueryTestCaseBase.executeQuery:303->QueryTestCaseBase.executeFile:339 » Service
TestCTASQuery.testCtasWithOrderby:160->QueryTestCaseBase.executeQuery:303->QueryTestCaseBase.executeFile:339 » Service
TestEvalCodeGenerator.testStringConcat:308->ExprTestBase.testEval:196->ExprTestBase.testEval:281 » Compilation
Tests run: 1336, Failures: 21, Errors: 60, Skipped: 0
[INFO] ------------------------------------------------------------------------
[INFO] Reactor Summary:
[INFO]
[INFO] Tajo Main ......................................... SUCCESS [ 1.885 s]
[INFO] Tajo Project POM .................................. SUCCESS [ 1.637 s]
[INFO] Tajo Maven Plugins ................................ SUCCESS [ 3.617 s]
[INFO] Tajo Common ....................................... SUCCESS [ 24.081 s]
[INFO] Tajo Algebra ...................................... SUCCESS [ 1.674 s]
[INFO] Tajo Catalog Common ............................... SUCCESS [ 6.649 s]
[INFO] Tajo Plan ......................................... SUCCESS [ 5.933 s]
[INFO] Tajo Rpc .......................................... SUCCESS [ 25.986 s]
[INFO] Tajo Catalog Client ............................... SUCCESS [ 1.130 s]
[INFO] Tajo Catalog Server ............................... SUCCESS [ 10.541 s]
[INFO] Tajo Storage Common ............................... SUCCESS [ 10.827 s]
[INFO] Tajo HDFS Storage ................................. SUCCESS [ 39.916 s]
[INFO] Tajo HBase Storage ................................ SUCCESS [ 2.825 s]
[INFO] Tajo PullServer ................................... SUCCESS [ 0.993 s]
[INFO] Tajo Client ....................................... SUCCESS [ 3.726 s]
[INFO] Tajo JDBC Driver .................................. SUCCESS [ 0.723 s]
[INFO] ASM (thirdparty) .................................. SUCCESS [ 0.804 s]
[INFO] Tajo Core ......................................... FAILURE [17:14 min]
[INFO] Tajo Catalog Drivers .............................. SKIPPED
[INFO] Tajo Catalog ...................................... SKIPPED
[INFO] Tajo Storage ...................................... SKIPPED
[INFO] Tajo Distribution ................................. SKIPPED
[INFO] ------------------------------------------------------------------------
[INFO] BUILD FAILURE
[INFO] ------------------------------------------------------------------------
[INFO] Total time: 19:38 min
[INFO] Finished at: 2015-01-06T14:18:55+00:00
[INFO] Final Memory: 96M/934M
[INFO] ------------------------------------------------------------------------
[ERROR] Failed to execute goal org.apache.maven.plugins:maven-surefire-plugin:2.17:test (default-test) on project tajo-core: There are test failures.
[ERROR]
[ERROR] Please refer to <https://builds.apache.org/job/Tajo-master-CODEGEN-build/ws/tajo-core/target/surefire-reports> for the individual test results.
[ERROR] -> [Help 1]
[ERROR]
[ERROR] To see the full stack trace of the errors, re-run Maven with the -e switch.
[ERROR] Re-run Maven using the -X switch to enable full debug logging.
[ERROR]
[ERROR] For more information about the errors and possible solutions, please read the following articles:
[ERROR] [Help 1] http://cwiki.apache.org/confluence/display/MAVEN/MojoFailureException
[ERROR]
[ERROR] After correcting the problems, you can resume the build with the command
[ERROR] mvn <goals> -rf :tajo-core
Build step 'Execute shell' marked build as failure
Updating TAJO-1280