You are viewing a plain text version of this content. The canonical link for it is here.
Posted to dev@cloudstack.apache.org by je...@cloudstack.org on 2014/08/02 02:16:34 UTC
Build failed in Jenkins: simulator-singlerun #29
See <http://jenkins.buildacloud.org/job/simulator-singlerun/29/changes>
Changes:
[sudison] remove unused servlet
------------------------------------------
[...truncated 2579 lines...]
[INFO]
[INFO] ------------------------------------------------------------------------
[INFO] Building Apache CloudStack Plugin POM 4.5.0-SNAPSHOT
[INFO] ------------------------------------------------------------------------
[INFO]
[INFO] --- maven-clean-plugin:2.5:clean (default-clean) @ cloudstack-plugins ---
[INFO] Deleting <http://jenkins.buildacloud.org/job/simulator-singlerun/ws/plugins/target> (includes = [**/*], excludes = [])
[INFO] Deleting <http://jenkins.buildacloud.org/job/simulator-singlerun/ws/plugins> (includes = [target, dist], excludes = [])
[INFO]
[INFO] --- maven-remote-resources-plugin:1.3:process (default) @ cloudstack-plugins ---
[INFO]
[INFO] --- maven-site-plugin:3.3:attach-descriptor (attach-descriptor) @ cloudstack-plugins ---
[INFO]
[INFO] --- maven-install-plugin:2.3.1:install (default-install) @ cloudstack-plugins ---
[INFO] Installing <http://jenkins.buildacloud.org/job/simulator-singlerun/ws/plugins/pom.xml> to /var/lib/jenkins/.m2/repository/org/apache/cloudstack/cloudstack-plugins/4.5.0-SNAPSHOT/cloudstack-plugins-4.5.0-SNAPSHOT.pom
[INFO]
[INFO] ------------------------------------------------------------------------
[INFO] Building Apache CloudStack Plugin - API Rate Limit 4.5.0-SNAPSHOT
[INFO] ------------------------------------------------------------------------
[INFO]
[INFO] --- maven-clean-plugin:2.5:clean (default-clean) @ cloud-plugin-api-limit-account-based ---
[INFO] Deleting <http://jenkins.buildacloud.org/job/simulator-singlerun/ws/plugins/api/rate-limit/target> (includes = [**/*], excludes = [])
[INFO] Deleting <http://jenkins.buildacloud.org/job/simulator-singlerun/ws/plugins/api/rate-limit> (includes = [target, dist], excludes = [])
[INFO]
[INFO] --- maven-checkstyle-plugin:2.11:check (cloudstack-checkstyle) @ cloud-plugin-api-limit-account-based ---
[INFO] Starting audit...
Audit done.
[INFO]
[INFO] --- maven-remote-resources-plugin:1.3:process (default) @ cloud-plugin-api-limit-account-based ---
[INFO]
[INFO] --- maven-resources-plugin:2.5:resources (default-resources) @ cloud-plugin-api-limit-account-based ---
[debug] execute contextualize
[INFO] Using 'UTF-8' encoding to copy filtered resources.
[INFO] Copying 2 resources
[INFO] Copying 3 resources
[INFO]
[INFO] --- maven-compiler-plugin:2.5.1:compile (default-compile) @ cloud-plugin-api-limit-account-based ---
[INFO] Compiling 9 source files to <http://jenkins.buildacloud.org/job/simulator-singlerun/ws/plugins/api/rate-limit/target/classes>
[INFO]
[INFO] --- maven-resources-plugin:2.5:testResources (default-testResources) @ cloud-plugin-api-limit-account-based ---
[debug] execute contextualize
[INFO] Using 'UTF-8' encoding to copy filtered resources.
[INFO] skip non existing resourceDirectory <http://jenkins.buildacloud.org/job/simulator-singlerun/ws/plugins/api/rate-limit/test/resources>
[INFO] Copying 3 resources
[INFO]
[INFO] --- maven-compiler-plugin:2.5.1:testCompile (default-testCompile) @ cloud-plugin-api-limit-account-based ---
[INFO] Compiling 4 source files to <http://jenkins.buildacloud.org/job/simulator-singlerun/ws/plugins/api/rate-limit/target/test-classes>
[INFO]
[INFO] --- maven-surefire-plugin:2.12:test (default-test) @ cloud-plugin-api-limit-account-based ---
[INFO] Surefire report directory: <http://jenkins.buildacloud.org/job/simulator-singlerun/ws/plugins/api/rate-limit/target/surefire-reports>
-------------------------------------------------------
T E S T S
-------------------------------------------------------
Running org.apache.cloudstack.ratelimit.ApiRateLimitTest
log4j:WARN No appenders could be found for logger (net.sf.ehcache.config.ConfigurationFactory).
log4j:WARN Please initialize the log4j system properly.
log4j:WARN See http://logging.apache.org/log4j/1.2/faq.html#noconfig for more info.
Tests run: 7, Failures: 0, Errors: 0, Skipped: 0, Time elapsed: 2.569 sec
Results :
Tests run: 7, Failures: 0, Errors: 0, Skipped: 0
[INFO]
[INFO] --- maven-jar-plugin:2.4:jar (default-jar) @ cloud-plugin-api-limit-account-based ---
[INFO] Building jar: <http://jenkins.buildacloud.org/job/simulator-singlerun/ws/plugins/api/rate-limit/target/cloud-plugin-api-limit-account-based-4.5.0-SNAPSHOT.jar>
[INFO]
[INFO] --- maven-site-plugin:3.3:attach-descriptor (attach-descriptor) @ cloud-plugin-api-limit-account-based ---
[INFO]
[INFO] --- maven-install-plugin:2.3.1:install (default-install) @ cloud-plugin-api-limit-account-based ---
[INFO] Installing <http://jenkins.buildacloud.org/job/simulator-singlerun/ws/plugins/api/rate-limit/target/cloud-plugin-api-limit-account-based-4.5.0-SNAPSHOT.jar> to /var/lib/jenkins/.m2/repository/org/apache/cloudstack/cloud-plugin-api-limit-account-based/4.5.0-SNAPSHOT/cloud-plugin-api-limit-account-based-4.5.0-SNAPSHOT.jar
[INFO] Installing <http://jenkins.buildacloud.org/job/simulator-singlerun/ws/plugins/api/rate-limit/pom.xml> to /var/lib/jenkins/.m2/repository/org/apache/cloudstack/cloud-plugin-api-limit-account-based/4.5.0-SNAPSHOT/cloud-plugin-api-limit-account-based-4.5.0-SNAPSHOT.pom
[INFO]
[INFO] ------------------------------------------------------------------------
[INFO] Building Apache CloudStack Plugin - Storage Volume default provider 4.5.0-SNAPSHOT
[INFO] ------------------------------------------------------------------------
[INFO]
[INFO] --- maven-clean-plugin:2.5:clean (default-clean) @ cloud-plugin-storage-volume-default ---
[INFO] Deleting <http://jenkins.buildacloud.org/job/simulator-singlerun/ws/plugins/storage/volume/default/target> (includes = [**/*], excludes = [])
[INFO] Deleting <http://jenkins.buildacloud.org/job/simulator-singlerun/ws/plugins/storage/volume/default> (includes = [target, dist], excludes = [])
[INFO]
[INFO] --- maven-checkstyle-plugin:2.11:check (cloudstack-checkstyle) @ cloud-plugin-storage-volume-default ---
[INFO] Starting audit...
<http://jenkins.buildacloud.org/job/simulator-singlerun/ws/plugins/storage/volume/default/src/org/apache/cloudstack/storage/datastore/lifecycle/CloudStackPrimaryDataStoreLifeCycleImpl.java>:49:8: Unused import - com.cloud.exception.DiscoveryException.
<http://jenkins.buildacloud.org/job/simulator-singlerun/ws/plugins/storage/volume/default/src/org/apache/cloudstack/storage/datastore/lifecycle/CloudStackPrimaryDataStoreLifeCycleImpl.java>:62:8: Unused import - com.cloud.storage.StoragePoolDiscoverer.
Audit done.
[INFO] ------------------------------------------------------------------------
[INFO] Reactor Summary:
[INFO]
[INFO] Apache CloudStack Developer Tools - Checkstyle Configuration SUCCESS [4.206s]
[INFO] Apache CloudStack ................................. SUCCESS [3.905s]
[INFO] Apache CloudStack Maven Conventions Parent ........ SUCCESS [2.760s]
[INFO] Apache CloudStack Framework - Managed Context ..... SUCCESS [5.089s]
[INFO] Apache CloudStack Utils ........................... SUCCESS [19.501s]
[INFO] Apache CloudStack Framework ....................... SUCCESS [0.086s]
[INFO] Apache CloudStack Framework - Event Notification .. SUCCESS [13.073s]
[INFO] Apache CloudStack Framework - Configuration ....... SUCCESS [6.205s]
[INFO] Apache CloudStack API ............................. SUCCESS [24.826s]
[INFO] Apache CloudStack Framework - REST ................ SUCCESS [4.081s]
[INFO] Apache CloudStack Framework - IPC ................. SUCCESS [8.596s]
[INFO] Apache CloudStack Cloud Engine .................... SUCCESS [0.076s]
[INFO] Apache CloudStack Cloud Engine API ................ SUCCESS [6.631s]
[INFO] Apache CloudStack Framework - Security ............ SUCCESS [3.453s]
[INFO] Apache CloudStack Core ............................ SUCCESS [33.115s]
[INFO] Apache CloudStack Agents .......................... SUCCESS [9.272s]
[INFO] Apache CloudStack Framework - Clustering .......... SUCCESS [5.100s]
[INFO] Apache CloudStack Framework - Event Notification .. SUCCESS [2.893s]
[INFO] Apache CloudStack Cloud Engine Schema Component ... SUCCESS [24.962s]
[INFO] Apache CloudStack Framework - Jobs ................ SUCCESS [9.557s]
[INFO] Apache CloudStack Cloud Engine Internal Components API SUCCESS [5.088s]
[INFO] Apache CloudStack Server .......................... SUCCESS [1:18.531s]
[INFO] Apache CloudStack Usage Server .................... SUCCESS [10.134s]
[INFO] Apache CloudStack Cloud Engine Orchestration Component SUCCESS [14.821s]
[INFO] Apache CloudStack Cloud Services .................. SUCCESS [0.060s]
[INFO] Apache CloudStack Secondary Storage ............... SUCCESS [0.416s]
[INFO] Apache CloudStack Secondary Storage Service ....... SUCCESS [8.371s]
[INFO] Apache CloudStack Engine Storage Component ........ SUCCESS [10.654s]
[INFO] Apache CloudStack Engine Storage Volume Component . SUCCESS [6.606s]
[INFO] Apache CloudStack Engine Storage Image Component .. SUCCESS [4.410s]
[INFO] Apache CloudStack Engine Storage Data Motion Component SUCCESS [3.730s]
[INFO] Apache CloudStack Engine Storage Cache Component .. SUCCESS [3.388s]
[INFO] Apache CloudStack Engine Storage Snapshot Component SUCCESS [10.096s]
[INFO] Apache CloudStack Cloud Engine API ................ SUCCESS [2.690s]
[INFO] Apache CloudStack Cloud Engine Service ............ SUCCESS [5.452s]
[INFO] Apache CloudStack Plugin POM ...................... SUCCESS [0.599s]
[INFO] Apache CloudStack Plugin - API Rate Limit ......... SUCCESS [8.730s]
[INFO] Apache CloudStack Plugin - Storage Volume default provider FAILURE [0.255s]
[INFO] Apache CloudStack Plugin - Storage Volume SolidFire Provider SKIPPED
[INFO] Apache CloudStack Plugin - API SolidFire .......... SKIPPED
[INFO] Apache CloudStack Plugin - API Discovery .......... SKIPPED
[INFO] Apache CloudStack Plugin - ACL Static Role Based .. SKIPPED
[INFO] Apache CloudStack Plugin - Host Anti-Affinity Processor SKIPPED
[INFO] Apache CloudStack Plugin - Explicit Dedication Processor SKIPPED
[INFO] Apache CloudStack Plugin - User Concentrated Pod Deployment Planner SKIPPED
[INFO] Apache CloudStack Plugin - User Dispersing Deployment Planner SKIPPED
[INFO] Apache CloudStack Plugin - Implicit Dedication Planner SKIPPED
[INFO] Apache CloudStack Plugin - Skip Heurestics Planner SKIPPED
[INFO] Apache CloudStack Plugin - Host Allocator Random .. SKIPPED
[INFO] Apache CloudStack Plugin - Dedicated Resources .... SKIPPED
[INFO] Apache CloudStack Plugin - Hypervisor OracleVM .... SKIPPED
[INFO] Apache CloudStack Plugin - Open vSwitch ........... SKIPPED
[INFO] Apache CloudStack Plugin - Hypervisor XenServer ... SKIPPED
[INFO] Apache CloudStack Plugin - Hypervisor KVM ......... SKIPPED
[INFO] Apache CloudStack Plugin - RabbitMQ Event Bus ..... SKIPPED
[INFO] Apache CloudStack Plugin - In Memory Event Bus .... SKIPPED
[INFO] Apache CloudStack Plugin - Hypervisor Baremetal ... SKIPPED
[INFO] Apache CloudStack Plugin - Hypervisor UCS ......... SKIPPED
[INFO] Apache CloudStack Plugin - Hypervisor Hyper-V ..... SKIPPED
[INFO] Apache CloudStack Plugin - Network Elastic Load Balancer SKIPPED
[INFO] Apache CloudStack Plugin - Network Internal Load Balancer SKIPPED
[INFO] Apache CloudStack Framework - Spring Life Cycle ... SKIPPED
[INFO] Apache CloudStack Plugin - Network Juniper Contrail SKIPPED
[INFO] Apache CloudStack Plugin - Palo Alto .............. SKIPPED
[INFO] Apache CloudStack Plugin - Network Netscaler ...... SKIPPED
[INFO] Apache CloudStack Plugin - Network Nicira NVP ..... SKIPPED
[INFO] Apache CloudStack Plugin - BigSwitch Virtual Network Segment SKIPPED
[INFO] Apache CloudStack Plugin - Network Brocade VCS .... SKIPPED
[INFO] Apache CloudStack Plugin - Midokura Midonet ....... SKIPPED
[INFO] Apache CloudStack Plugin - Stratosphere SSP ....... SKIPPED
[INFO] Apache CloudStack Plugin - Network Opendaylight ... SKIPPED
[INFO] Apache CloudStack Plugin - Storage Allocator Random SKIPPED
[INFO] Apache CloudStack Plugin - User Authenticator LDAP SKIPPED
[INFO] Apache CloudStack Plugin - User Authenticator MD5 . SKIPPED
[INFO] Apache CloudStack Plugin - User Authenticator Plain Text SKIPPED
[INFO] Apache CloudStack Plugin - User Authenticator SHA256 Salted SKIPPED
[INFO] Apache CloudStack Plugin - Dns Notifier Example ... SKIPPED
[INFO] Apache CloudStack Plugin - Storage Image S3 ....... SKIPPED
[INFO] Apache CloudStack Plugin - Storage Image Swift provider SKIPPED
[INFO] Apache CloudStack Plugin - Storage Image default provider SKIPPED
[INFO] Apache CloudStack Plugin - Storage Image sample provider SKIPPED
[INFO] Apache CloudStack Plugin - Storage Volume Nexenta Provider SKIPPED
[INFO] Apache CloudStack Plugin - Storage Volume CloudByte Provider SKIPPED
[INFO] Apache CloudStack Plugin - Storage Volume sample provider SKIPPED
[INFO] Apache CloudStack Plugin - SNMP Alerts ............ SKIPPED
[INFO] Apache CloudStack Plugin - Syslog Alerts .......... SKIPPED
[INFO] Apache CloudStack Plugin - Network VXLAN .......... SKIPPED
[INFO] Apache CloudStack Plugin - Hypervisor Simulator ... SKIPPED
[INFO] Apache CloudStack Framework - Spring Module ....... SKIPPED
[INFO] Apache CloudStack Secondary Storage Controller .... SKIPPED
[INFO] Apache CloudStack Client UI ....................... SKIPPED
[INFO] Apache CloudStack Console Proxy - RDP Client ...... SKIPPED
[INFO] Apache CloudStack Console Proxy ................... SKIPPED
[INFO] Apache CloudStack Console Proxy - Server .......... SKIPPED
[INFO] Apache CloudStack Framework - QuickCloud .......... SKIPPED
[INFO] Apache CloudStack Test ............................ SKIPPED
[INFO] Apache CloudStack Developer Mode .................. SKIPPED
[INFO] Apache CloudStack Developer Tools ................. SKIPPED
[INFO] Apache CloudStack apidocs ......................... SKIPPED
[INFO] Apache CloudStack marvin .......................... SKIPPED
[INFO] Apache CloudStack DevCloud ........................ SKIPPED
[INFO] Apache CloudStack DevCloud-KVM .................... SKIPPED
[INFO] ------------------------------------------------------------------------
[INFO] BUILD FAILURE
[INFO] ------------------------------------------------------------------------
[INFO] Total time: 6:04.988s
[INFO] Finished at: Fri Aug 01 20:16:32 EDT 2014
[INFO] Final Memory: 58M/380M
[INFO] ------------------------------------------------------------------------
[ERROR] Failed to execute goal org.apache.maven.plugins:maven-checkstyle-plugin:2.11:check (cloudstack-checkstyle) on project cloud-plugin-storage-volume-default: Failed during checkstyle execution: There are 2 checkstyle errors. -> [Help 1]
[ERROR]
[ERROR] To see the full stack trace of the errors, re-run Maven with the -e switch.
[ERROR] Re-run Maven using the -X switch to enable full debug logging.
[ERROR]
[ERROR] For more information about the errors and possible solutions, please read the following articles:
[ERROR] [Help 1] http://cwiki.apache.org/confluence/display/MAVEN/MojoExecutionException
[ERROR]
[ERROR] After correcting the problems, you can resume the build with the command
[ERROR] mvn <goals> -rf :cloud-plugin-storage-volume-default
Build step 'Invoke top-level Maven targets' marked build as failure
[xUnit] [INFO] - Starting to record.
[xUnit] [INFO] - Processing JUnit
[xUnit] [INFO] - [JUnit] - 1 test report file(s) were found with the pattern 'xunit.xml' relative to '<http://jenkins.buildacloud.org/job/simulator-singlerun/ws/'> for the testing framework 'JUnit'.
[xUnit] [ERROR] - Test reports were found but not all of them are new. Did all the tests run?
* <http://jenkins.buildacloud.org/job/simulator-singlerun/ws/xunit.xml> is 3 hr 53 min old
ERROR: Publisher org.jenkinsci.plugins.xunit.XUnitPublisher aborted due to exception
java.lang.InterruptedException: org.jenkinsci.plugins.xunit.OldTestReportException
at hudson.FilePath.act(FilePath.java:905)
at hudson.FilePath.act(FilePath.java:887)
at org.jenkinsci.plugins.xunit.XUnitProcessor.performTests(XUnitProcessor.java:111)
at org.jenkinsci.plugins.xunit.XUnitProcessor.performXUnit(XUnitProcessor.java:54)
at org.jenkinsci.plugins.xunit.XUnitPublisher.perform(XUnitPublisher.java:88)
at hudson.tasks.BuildStepMonitor$1.perform(BuildStepMonitor.java:20)
at hudson.model.AbstractBuild$AbstractBuildExecution.perform(AbstractBuild.java:742)
at hudson.model.AbstractBuild$AbstractBuildExecution.performAllBuildSteps(AbstractBuild.java:714)
at hudson.model.Build$BuildExecution.post2(Build.java:183)
at hudson.model.AbstractBuild$AbstractBuildExecution.post(AbstractBuild.java:663)
at hudson.model.Run.execute(Run.java:1713)
at hudson.model.FreeStyleBuild.run(FreeStyleBuild.java:43)
at hudson.model.ResourceController.execute(ResourceController.java:88)
at hudson.model.Executor.run(Executor.java:231)
Caused by: hudson.FilePath$TunneledInterruptedException: org.jenkinsci.plugins.xunit.OldTestReportException
at hudson.FilePath$FileCallableWrapper.call(FilePath.java:2464)
at hudson.remoting.UserRequest.perform(UserRequest.java:118)
at hudson.remoting.UserRequest.perform(UserRequest.java:48)
at hudson.remoting.Request$2.run(Request.java:328)
at hudson.remoting.InterceptingExecutorService$1.call(InterceptingExecutorService.java:72)
at java.util.concurrent.FutureTask.run(FutureTask.java:262)
at java.util.concurrent.ThreadPoolExecutor.runWorker(ThreadPoolExecutor.java:1145)
at java.util.concurrent.ThreadPoolExecutor$Worker.run(ThreadPoolExecutor.java:615)
at java.lang.Thread.run(Thread.java:744)
Caused by: org.jenkinsci.plugins.xunit.OldTestReportException
at org.jenkinsci.plugins.xunit.service.XUnitTransformer.invoke(XUnitTransformer.java:146)
at org.jenkinsci.plugins.xunit.service.XUnitTransformer.invoke(XUnitTransformer.java:17)
at hudson.FilePath$FileCallableWrapper.call(FilePath.java:2462)
... 8 more
Jenkins build is back to normal : simulator-singlerun #31
Posted by je...@cloudstack.org.
See <http://jenkins.buildacloud.org/job/simulator-singlerun/31/>
Build failed in Jenkins: simulator-singlerun #30
Posted by je...@cloudstack.org.
See <http://jenkins.buildacloud.org/job/simulator-singlerun/30/changes>
Changes:
[santhosh.edukulla] Build failed with checkstyle error because of unused imports, removed them
------------------------------------------
[...truncated 7259 lines...]
[INFO]
[INFO] --- exec-maven-plugin:1.2.1:java (create-schema-simulator) @ cloud-developer ---
log4j:WARN No appenders could be found for logger (org.springframework.core.env.StandardEnvironment).
log4j:WARN Please initialize the log4j system properly.
log4j:WARN See http://logging.apache.org/log4j/1.2/faq.html#noconfig for more info.
========> WARNING: Provided file does not exist: <http://jenkins.buildacloud.org/job/simulator-singlerun/ws/developer/../utils/conf/db.properties.override>
========> Initializing database=simulator with host=localhost port=3306 username=cloud password=cloud
============> Running query: drop database if exists `simulator`
============> Running query: create database `simulator`
============> Running query: GRANT ALL ON simulator.* to 'cloud'@`localhost` identified by 'cloud'
============> Running query: GRANT ALL ON simulator.* to 'cloud'@`%` identified by 'cloud'
========> Processing SQL file at <http://jenkins.buildacloud.org/job/simulator-singlerun/ws/developer/target/db/create-schema-simulator.sql>
========> Processing SQL file at <http://jenkins.buildacloud.org/job/simulator-singlerun/ws/developer/target/db/templates.simulator.sql>
========> Processing SQL file at <http://jenkins.buildacloud.org/job/simulator-singlerun/ws/developer/target/db/hypervisor_capabilities.simulator.sql>
========> Processing upgrade: com.cloud.upgrade.DatabaseUpgradeChecker
[INFO]
[INFO] --- maven-site-plugin:3.3:attach-descriptor (attach-descriptor) @ cloud-developer ---
[INFO]
[INFO] --- maven-install-plugin:2.3.1:install (default-install) @ cloud-developer ---
[INFO] Installing <http://jenkins.buildacloud.org/job/simulator-singlerun/ws/developer/pom.xml> to /var/lib/jenkins/.m2/repository/org/apache/cloudstack/cloud-developer/4.5.0-SNAPSHOT/cloud-developer-4.5.0-SNAPSHOT.pom
[INFO] ------------------------------------------------------------------------
[INFO] BUILD SUCCESS
[INFO] ------------------------------------------------------------------------
[INFO] Total time: 21.982s
[INFO] Finished at: Sat Aug 02 05:17:39 EDT 2014
[INFO] Final Memory: 41M/237M
[INFO] ------------------------------------------------------------------------
[simulator-singlerun] $ /bin/bash -x /tmp/hudson7972379787420360345.sh
+ jps -l
+ grep -q Launcher
+ rm -f xunit.xml
+ rm -rf /tmp/MarvinLogs
+ echo Check for initialization of the management server
Check for initialization of the management server
+ COUNTER=0
+ SERVER_PID=15973
+ mvn -P systemvm,simulator -pl :cloud-client-ui jetty:run
+ '[' 0 -lt 44 ']'
+ grep -q 'Management server node 127.0.0.1 is up' jetty-output.out
+ sleep 5
+ COUNTER=1
+ '[' 1 -lt 44 ']'
+ grep -q 'Management server node 127.0.0.1 is up' jetty-output.out
+ sleep 5
+ COUNTER=2
+ '[' 2 -lt 44 ']'
+ grep -q 'Management server node 127.0.0.1 is up' jetty-output.out
+ sleep 5
+ COUNTER=3
+ '[' 3 -lt 44 ']'
+ grep -q 'Management server node 127.0.0.1 is up' jetty-output.out
+ sleep 5
+ COUNTER=4
+ '[' 4 -lt 44 ']'
+ grep -q 'Management server node 127.0.0.1 is up' jetty-output.out
+ sleep 5
+ COUNTER=5
+ '[' 5 -lt 44 ']'
+ grep -q 'Management server node 127.0.0.1 is up' jetty-output.out
+ sleep 5
+ COUNTER=6
+ '[' 6 -lt 44 ']'
+ grep -q 'Management server node 127.0.0.1 is up' jetty-output.out
+ sleep 5
+ COUNTER=7
+ '[' 7 -lt 44 ']'
+ grep -q 'Management server node 127.0.0.1 is up' jetty-output.out
+ sleep 5
+ COUNTER=8
+ '[' 8 -lt 44 ']'
+ grep -q 'Management server node 127.0.0.1 is up' jetty-output.out
+ sleep 5
+ COUNTER=9
+ '[' 9 -lt 44 ']'
+ grep -q 'Management server node 127.0.0.1 is up' jetty-output.out
+ sleep 5
+ COUNTER=10
+ '[' 10 -lt 44 ']'
+ grep -q 'Management server node 127.0.0.1 is up' jetty-output.out
+ sleep 5
+ COUNTER=11
+ '[' 11 -lt 44 ']'
+ grep -q 'Management server node 127.0.0.1 is up' jetty-output.out
+ sleep 5
+ COUNTER=12
+ '[' 12 -lt 44 ']'
+ grep -q 'Management server node 127.0.0.1 is up' jetty-output.out
+ sleep 5
+ COUNTER=13
+ '[' 13 -lt 44 ']'
+ grep -q 'Management server node 127.0.0.1 is up' jetty-output.out
+ sleep 5
+ COUNTER=14
+ '[' 14 -lt 44 ']'
+ grep -q 'Management server node 127.0.0.1 is up' jetty-output.out
+ sleep 5
+ COUNTER=15
+ '[' 15 -lt 44 ']'
+ grep -q 'Management server node 127.0.0.1 is up' jetty-output.out
+ sleep 5
+ COUNTER=16
+ '[' 16 -lt 44 ']'
+ grep -q 'Management server node 127.0.0.1 is up' jetty-output.out
+ sleep 5
+ COUNTER=17
+ '[' 17 -lt 44 ']'
+ grep -q 'Management server node 127.0.0.1 is up' jetty-output.out
+ sleep 5
+ COUNTER=18
+ '[' 18 -lt 44 ']'
+ grep -q 'Management server node 127.0.0.1 is up' jetty-output.out
+ sleep 5
+ COUNTER=19
+ '[' 19 -lt 44 ']'
+ grep -q 'Management server node 127.0.0.1 is up' jetty-output.out
+ sleep 5
+ COUNTER=20
+ '[' 20 -lt 44 ']'
+ grep -q 'Management server node 127.0.0.1 is up' jetty-output.out
+ sleep 5
+ COUNTER=21
+ '[' 21 -lt 44 ']'
+ grep -q 'Management server node 127.0.0.1 is up' jetty-output.out
+ sleep 5
+ COUNTER=22
+ '[' 22 -lt 44 ']'
+ grep -q 'Management server node 127.0.0.1 is up' jetty-output.out
+ sleep 5
+ COUNTER=23
+ '[' 23 -lt 44 ']'
+ grep -q 'Management server node 127.0.0.1 is up' jetty-output.out
+ sleep 5
+ COUNTER=24
+ '[' 24 -lt 44 ']'
+ grep -q 'Management server node 127.0.0.1 is up' jetty-output.out
+ sleep 5
+ COUNTER=25
+ '[' 25 -lt 44 ']'
+ grep -q 'Management server node 127.0.0.1 is up' jetty-output.out
+ sleep 5
+ COUNTER=26
+ '[' 26 -lt 44 ']'
+ grep -q 'Management server node 127.0.0.1 is up' jetty-output.out
+ sleep 5
+ COUNTER=27
+ '[' 27 -lt 44 ']'
+ grep -q 'Management server node 127.0.0.1 is up' jetty-output.out
+ sleep 5
+ COUNTER=28
+ '[' 28 -lt 44 ']'
+ grep -q 'Management server node 127.0.0.1 is up' jetty-output.out
+ break
+ grep -q 'Management server node 127.0.0.1 is up' jetty-output.out
+ echo Started OK pid 15973
Started OK pid 15973
+ sleep 20
+ export PYTHONPATH=<http://jenkins.buildacloud.org/job/simulator-singlerun/ws/tools/marvin>
+ PYTHONPATH=<http://jenkins.buildacloud.org/job/simulator-singlerun/ws/tools/marvin>
+ python2.6 tools/marvin/marvin/deployDataCenter.py -i setup/dev/advanced.cfg
/usr/lib/python2.6/site-packages/pycrypto-2.6-py2.6-linux-x86_64.egg/Crypto/Util/number.py:57: PowmInsecureWarning: Not using mpz_powm_sec. You should rebuild using libgmp >= 5 to avoid timing attack vulnerability.
_warn("Not using mpz_powm_sec. You should rebuild using libgmp >= 5 to avoid timing attack vulnerability.", PowmInsecureWarning)
==== Log Folder Path: /tmp//MarvinLogs//DeployDataCenter__Aug_02_2014_05_20_23_13VKHS. All logs will be available here ====
==== Deploy DC Started ====
=== Data Center Settings are dumped to /tmp//MarvinLogs//DeployDataCenter__Aug_02_2014_05_20_23_13VKHS/dc_entries.obj===
====Deploy DC Successful=====
+ /usr/local/bin/nosetests-2.7 -v --with-marvin --marvin-config=setup/dev/advanced.cfg --with-xunit --xunit-file=xunit.xml -a tags=advanced,required_hardware=false --zone=Sandbox-simulator --hypervisor=simulator -w test/integration/smoke
====Trying SSH Connection: Host:192.168.2.5 User:root Port:22 RetryCnt:2===
SshClient: Exception under createConnection: ['Traceback (most recent call last):\n', ' File "<http://jenkins.buildacloud.org/job/simulator-singlerun/ws/tools/marvin/marvin/sshClient.py",> line 121, in createConnection\n timeout=self.timeout)\n', ' File "/usr/local/lib/python2.7/site-packages/paramiko-1.13.0-py2.7.egg/paramiko/client.py", line 236, in connect\n retry_on_signal(lambda: sock.connect(addr))\n', ' File "/usr/local/lib/python2.7/site-packages/paramiko-1.13.0-py2.7.egg/paramiko/util.py", line 279, in retry_on_signal\n return function()\n', ' File "/usr/local/lib/python2.7/site-packages/paramiko-1.13.0-py2.7.egg/paramiko/client.py", line 236, in <lambda>\n retry_on_signal(lambda: sock.connect(addr))\n', ' File "/usr/local/lib/python2.7/socket.py", line 222, in meth\n return getattr(self._sock,name)(*args)\n', 'timeout: timed out\n']
Traceback (most recent call last):
File "<http://jenkins.buildacloud.org/job/simulator-singlerun/ws/tools/marvin/marvin/sshClient.py",> line 121, in createConnection
timeout=self.timeout)
File "/usr/local/lib/python2.7/site-packages/paramiko-1.13.0-py2.7.egg/paramiko/client.py", line 236, in connect
retry_on_signal(lambda: sock.connect(addr))
File "/usr/local/lib/python2.7/site-packages/paramiko-1.13.0-py2.7.egg/paramiko/util.py", line 279, in retry_on_signal
return function()
File "/usr/local/lib/python2.7/site-packages/paramiko-1.13.0-py2.7.egg/paramiko/client.py", line 236, in <lambda>
retry_on_signal(lambda: sock.connect(addr))
File "/usr/local/lib/python2.7/socket.py", line 222, in meth
return getattr(self._sock,name)(*args)
timeout: timed out
====Trying SSH Connection: Host:192.168.2.5 User:root Port:22 RetryCnt:1===
SshClient: Exception under createConnection: ['Traceback (most recent call last):\n', ' File "<http://jenkins.buildacloud.org/job/simulator-singlerun/ws/tools/marvin/marvin/sshClient.py",> line 121, in createConnection\n timeout=self.timeout)\n', ' File "/usr/local/lib/python2.7/site-packages/paramiko-1.13.0-py2.7.egg/paramiko/client.py", line 236, in connect\n retry_on_signal(lambda: sock.connect(addr))\n', ' File "/usr/local/lib/python2.7/site-packages/paramiko-1.13.0-py2.7.egg/paramiko/util.py", line 279, in retry_on_signal\n return function()\n', ' File "/usr/local/lib/python2.7/site-packages/paramiko-1.13.0-py2.7.egg/paramiko/client.py", line 236, in <lambda>\n retry_on_signal(lambda: sock.connect(addr))\n', ' File "/usr/local/lib/python2.7/socket.py", line 222, in meth\n return getattr(self._sock,name)(*args)\n', 'timeout: timed out\n']
Traceback (most recent call last):
File "<http://jenkins.buildacloud.org/job/simulator-singlerun/ws/tools/marvin/marvin/sshClient.py",> line 121, in createConnection
timeout=self.timeout)
File "/usr/local/lib/python2.7/site-packages/paramiko-1.13.0-py2.7.egg/paramiko/client.py", line 236, in connect
retry_on_signal(lambda: sock.connect(addr))
File "/usr/local/lib/python2.7/site-packages/paramiko-1.13.0-py2.7.egg/paramiko/util.py", line 279, in retry_on_signal
return function()
File "/usr/local/lib/python2.7/site-packages/paramiko-1.13.0-py2.7.egg/paramiko/client.py", line 236, in <lambda>
retry_on_signal(lambda: sock.connect(addr))
File "/usr/local/lib/python2.7/socket.py", line 222, in meth
return getattr(self._sock,name)(*args)
timeout: timed out
====Trying SSH Connection: Host:192.168.2.5 User:root Port:22 RetryCnt:0===
=== Marvin Parse Config Successful ===
=== Marvin Setting TestData Successful===
==== Log Folder Path: /tmp//MarvinLogs//Aug_02_2014_05_23_15_E5QTH6. All logs will be available here ====
=== Marvin Init Logging Successful===
+ mvn -P systemvm,simulator -pl :cloud-client-ui jetty:stop
[INFO] Scanning for projects...
[INFO]
[INFO] ------------------------------------------------------------------------
[INFO] Building Apache CloudStack Client UI 4.5.0-SNAPSHOT
[INFO] ------------------------------------------------------------------------
[INFO]
[INFO] --- maven-jetty-plugin:6.1.26:stop (default-cli) @ cloud-client-ui ---
[INFO] ------------------------------------------------------------------------
[INFO] BUILD SUCCESS
[INFO] ------------------------------------------------------------------------
[INFO] Total time: 6.156s
[INFO] Finished at: Sat Aug 02 06:12:54 EDT 2014
[INFO] Final Memory: 24M/152M
[INFO] ------------------------------------------------------------------------
+ sleep 10
+ kill -KILL 15973
/tmp/hudson7972379787420360345.sh: line 40: kill: (15973) - No such process
[simulator-singlerun] $ mvn -P systemvm,simulator -pl :cloud-client-ui jetty:stop
[INFO] Scanning for projects...
[INFO]
[INFO] ------------------------------------------------------------------------
[INFO] Building Apache CloudStack Client UI 4.5.0-SNAPSHOT
[INFO] ------------------------------------------------------------------------
[INFO]
[INFO] --- maven-jetty-plugin:6.1.26:stop (default-cli) @ cloud-client-ui ---
[INFO] Jetty not running!
[INFO] ------------------------------------------------------------------------
[INFO] BUILD SUCCESS
[INFO] ------------------------------------------------------------------------
[INFO] Total time: 4.877s
[INFO] Finished at: Sat Aug 02 06:13:13 EDT 2014
[INFO] Final Memory: 24M/117M
[INFO] ------------------------------------------------------------------------
[xUnit] [INFO] - Starting to record.
[xUnit] [INFO] - Processing JUnit
[xUnit] [INFO] - [JUnit] - 1 test report file(s) were found with the pattern 'xunit.xml' relative to '<http://jenkins.buildacloud.org/job/simulator-singlerun/ws/'> for the testing framework 'JUnit'.
[xUnit] [INFO] - Check 'Failed Tests' threshold.
[xUnit] [INFO] - The total number of tests for this category exceeds the specified 'failure' threshold value.
[xUnit] [INFO] - Setting the build status to FAILURE
[xUnit] [INFO] - Stopping recording.
Build step 'Publish xUnit test result report' changed build result to FAILURE