You are viewing a plain text version of this content. The canonical link for it is here.
Posted to commits@flex.apache.org by Apache Jenkins Server <je...@builds.apache.org> on 2013/09/15 01:29:36 UTC

Build failed in Jenkins: flex-sdk_release #183

See <https://builds.apache.org/job/flex-sdk_release/183/changes>

Changes:

[jmclean] Update release notes

------------------------------------------
[...truncated 432 lines...]

automation_agent_bundles-clean:

automation_agent_bundles-clean:

automation_agent_bundles-clean:

automation_agent_bundles-clean:

automation_agent_bundles-clean:

automation_agent_bundles-clean:

automation_agent_bundles-clean:

automation_agent_bundles-clean:

clean:

bundles-clean:

clean:

clean:

clean:

clean:

clean:

clean:

clean:

bundles-clean:
     [echo] IN bundles clean

tool_air_bundles-clean:

tool_air_bundles-clean:

tool_air_bundles-clean:

tool_air_bundles-clean:

tool_air_bundles-clean:

tool_air_bundles-clean:

tool_air_bundles-clean:

tool_air_bundles-clean:

tool_air_bundles-clean:

tool_air_bundles-clean:

tool_air_bundles-clean:

tool_air_bundles-clean:

tool_air_bundles-clean:

tool_air_bundles-clean:

tool_air_bundles-clean:

tool_air_bundles-clean:

tool_air_bundles-clean:

tool_air_bundles-clean:

clean:

airsdk-clean:

clean:

check-tlf-home:

bundles-clean:

clean-external:
     [echo] cleaning <https://builds.apache.org/job/flex-sdk_release/ws/../flex-tlf>
     [echo] FLEX_HOME is <https://builds.apache.org/job/flex-sdk_release/ws/>
  [taskdef] Could not load definitions from resource flexTasks.tasks. It could not be found.

clean:

clean:

bundles-clean:

pixelbender-clean:

assets-clean:

clean:

bundles-clean:

clean:

bundles-clean:

assets-clean:

clean:

bundles-clean:

clean:

bundles-clean:

clean:

clean:

clean:

bundles-clean:

pixelbender-clean:

clean:

clean:

clean:

clean:

clean:

bundles-clean:

clean:

bundles-clean:

clean:

clean:

bundles-clean:

clean:

bundles-clean:

clean:

bundles-clean:

clean:

bundles-clean:

clean:

clean:

clean:

frameworks-rsls-clean:

package-clean:

clean-temp:

clean-dependencychecker:

checkintests-clean:
 [loadfile] <https://builds.apache.org/job/flex-sdk_release/ws/mustella\local.properties> doesn't exist

cleanmustellaswc:

clean:

clean:

clean:
 [loadfile] <https://builds.apache.org/job/flex-sdk_release/ws/mustella\local.properties> doesn't exist

cleanswfs:

clean:
     [echo] Deleting old results and files from previous testsuite build.

super-clean:

create-description:
     [echo] build.number is 20130915

create-config:

playerglobal-setswfversion:

flex-config:
     [copy] Copying 1 file to <https://builds.apache.org/job/flex-sdk_release/ws/frameworks>

stage-source:

clean-temp:
     [copy] Copying 8 files to <https://builds.apache.org/job/flex-sdk_release/ws/temp>

stage-bin:
     [copy] Copying 30 files to <https://builds.apache.org/job/flex-sdk_release/ws/temp\bin>

stage-frameworks:
     [copy] Copying 5693 files to <https://builds.apache.org/job/flex-sdk_release/ws/temp\frameworks>
     [copy] Copying 1 file to <https://builds.apache.org/job/flex-sdk_release/ws/temp\frameworks\javascript>

stage-frameworks-tests:
     [copy] Copying 204 files to <https://builds.apache.org/job/flex-sdk_release/ws/temp\frameworks>
     [echo] Updating config file air-config.xml with version 4.10.0.20130915
     [echo] Updating config file flex-config.xml with version 4.10.0.20130915

version-update:

have-greptask:

no-greptask:
     [echo] Version files not updated.
     [echo] AntelopeTasks_*.jar not found in anttask.classpath

stage-tlf:
     [copy] Copying 224 files to <https://builds.apache.org/job/flex-sdk_release/ws/temp\frameworks\projects\textLayout>

stage-modules:
     [copy] Copying 1720 files to <https://builds.apache.org/job/flex-sdk_release/ws/temp\modules>
     [copy] Copying 1828 files to <https://builds.apache.org/job/flex-sdk_release/ws/temp\modules\thirdparty>
     [copy] Copying 49 files to <https://builds.apache.org/job/flex-sdk_release/ws/temp\asdoc>
     [copy] Copying 11 files to <https://builds.apache.org/job/flex-sdk_release/ws/temp\ide>

stage-mustella:
     [copy] Copying 101 files to <https://builds.apache.org/job/flex-sdk_release/ws/temp\mustella>
     [copy] Copying 965 files to <https://builds.apache.org/job/flex-sdk_release/ws/temp\samples>
     [copy] Copying 7 files to <https://builds.apache.org/job/flex-sdk_release/ws/temp\templates>

BUILD FAILED
<https://builds.apache.org/job/flex-sdk_release/ws/build.xml>:638: error running fixcrlf on file <https://builds.apache.org/job/flex-sdk_release/ws/temp\LICENSE>

Total time: 3 minutes 38 seconds
Build step 'Invoke Ant' marked build as failure
Archiving artifacts

Build failed in Jenkins: flex-sdk_release #187

Posted by Apache Jenkins Server <je...@builds.apache.org>.
See <https://builds.apache.org/job/flex-sdk_release/187/changes>

Changes:

[jmclean] FLEX-33724 Stop RTE when setting locked columns to zero and horizontal scroll policy to off

------------------------------------------
[...truncated 430 lines...]

automation_agent_bundles-clean:

automation_agent_bundles-clean:

automation_agent_bundles-clean:

automation_agent_bundles-clean:

automation_agent_bundles-clean:

automation_agent_bundles-clean:

automation_agent_bundles-clean:

automation_agent_bundles-clean:

clean:

bundles-clean:

clean:

clean:

clean:

clean:

clean:

clean:

clean:

bundles-clean:
     [echo] IN bundles clean

tool_air_bundles-clean:

tool_air_bundles-clean:

tool_air_bundles-clean:

tool_air_bundles-clean:

tool_air_bundles-clean:

tool_air_bundles-clean:

tool_air_bundles-clean:

tool_air_bundles-clean:

tool_air_bundles-clean:

tool_air_bundles-clean:

tool_air_bundles-clean:

tool_air_bundles-clean:

tool_air_bundles-clean:

tool_air_bundles-clean:

tool_air_bundles-clean:

tool_air_bundles-clean:

tool_air_bundles-clean:

tool_air_bundles-clean:

clean:

airsdk-clean:

clean:

check-tlf-home:

bundles-clean:

clean-external:
     [echo] cleaning <https://builds.apache.org/job/flex-sdk_release/ws/../flex-tlf>
     [echo] FLEX_HOME is <https://builds.apache.org/job/flex-sdk_release/ws/>
  [taskdef] Could not load definitions from resource flexTasks.tasks. It could not be found.

clean:

clean:

bundles-clean:

pixelbender-clean:

assets-clean:

clean:

bundles-clean:

clean:

bundles-clean:

assets-clean:

clean:

bundles-clean:

clean:

bundles-clean:

clean:

clean:

clean:

bundles-clean:

pixelbender-clean:

clean:

clean:

clean:

clean:

clean:

bundles-clean:

clean:

bundles-clean:

clean:

clean:

bundles-clean:

clean:

bundles-clean:

clean:

bundles-clean:

clean:

bundles-clean:

clean:

clean:

clean:

frameworks-rsls-clean:

package-clean:

clean-temp:

clean-dependencychecker:

checkintests-clean:
 [loadfile] <https://builds.apache.org/job/flex-sdk_release/ws/mustella\local.properties> doesn't exist

cleanmustellaswc:

clean:

clean:

clean:
 [loadfile] <https://builds.apache.org/job/flex-sdk_release/ws/mustella\local.properties> doesn't exist

cleanswfs:

clean:
     [echo] Deleting old results and files from previous testsuite build.

super-clean:

create-description:
     [echo] build.number is 20130917

create-config:

playerglobal-setswfversion:

flex-config:
     [copy] Copying 1 file to <https://builds.apache.org/job/flex-sdk_release/ws/frameworks>

stage-source:

clean-temp:
     [copy] Copying 8 files to <https://builds.apache.org/job/flex-sdk_release/ws/temp>

stage-bin:
     [copy] Copying 30 files to <https://builds.apache.org/job/flex-sdk_release/ws/temp\bin>

stage-frameworks:
     [copy] Copying 5693 files to <https://builds.apache.org/job/flex-sdk_release/ws/temp\frameworks>
     [copy] Copying 1 file to <https://builds.apache.org/job/flex-sdk_release/ws/temp\frameworks\javascript>

stage-frameworks-tests:
     [copy] Copying 204 files to <https://builds.apache.org/job/flex-sdk_release/ws/temp\frameworks>
     [echo] Updating config file air-config.xml with version 4.10.0.20130917
     [echo] Updating config file flex-config.xml with version 4.10.0.20130917

version-update:

have-greptask:

no-greptask:
     [echo] Version files not updated.
     [echo] AntelopeTasks_*.jar not found in anttask.classpath

stage-tlf:
     [copy] Copying 224 files to <https://builds.apache.org/job/flex-sdk_release/ws/temp\frameworks\projects\textLayout>

stage-modules:
     [copy] Copying 1720 files to <https://builds.apache.org/job/flex-sdk_release/ws/temp\modules>
     [copy] Copying 1828 files to <https://builds.apache.org/job/flex-sdk_release/ws/temp\modules\thirdparty>
     [copy] Copying 49 files to <https://builds.apache.org/job/flex-sdk_release/ws/temp\asdoc>
     [copy] Copying 11 files to <https://builds.apache.org/job/flex-sdk_release/ws/temp\ide>

stage-mustella:
     [copy] Copying 101 files to <https://builds.apache.org/job/flex-sdk_release/ws/temp\mustella>
     [copy] Copying 965 files to <https://builds.apache.org/job/flex-sdk_release/ws/temp\samples>
     [copy] Copying 7 files to <https://builds.apache.org/job/flex-sdk_release/ws/temp\templates>

BUILD FAILED
<https://builds.apache.org/job/flex-sdk_release/ws/build.xml>:638: error running fixcrlf on file <https://builds.apache.org/job/flex-sdk_release/ws/temp\RELEASE_NOTES>

Total time: 2 minutes 15 seconds
Build step 'Invoke Ant' marked build as failure
Archiving artifacts

Build failed in Jenkins: flex-sdk_release #186

Posted by Apache Jenkins Server <je...@builds.apache.org>.
See <https://builds.apache.org/job/flex-sdk_release/186/>

------------------------------------------
[...truncated 430 lines...]

automation_agent_bundles-clean:

automation_agent_bundles-clean:

automation_agent_bundles-clean:

automation_agent_bundles-clean:

automation_agent_bundles-clean:

automation_agent_bundles-clean:

automation_agent_bundles-clean:

automation_agent_bundles-clean:

clean:

bundles-clean:

clean:

clean:

clean:

clean:

clean:

clean:

clean:

bundles-clean:
     [echo] IN bundles clean

tool_air_bundles-clean:

tool_air_bundles-clean:

tool_air_bundles-clean:

tool_air_bundles-clean:

tool_air_bundles-clean:

tool_air_bundles-clean:

tool_air_bundles-clean:

tool_air_bundles-clean:

tool_air_bundles-clean:

tool_air_bundles-clean:

tool_air_bundles-clean:

tool_air_bundles-clean:

tool_air_bundles-clean:

tool_air_bundles-clean:

tool_air_bundles-clean:

tool_air_bundles-clean:

tool_air_bundles-clean:

tool_air_bundles-clean:

clean:

airsdk-clean:

clean:

check-tlf-home:

bundles-clean:

clean-external:
     [echo] cleaning <https://builds.apache.org/job/flex-sdk_release/ws/../flex-tlf>
     [echo] FLEX_HOME is <https://builds.apache.org/job/flex-sdk_release/ws/>
  [taskdef] Could not load definitions from resource flexTasks.tasks. It could not be found.

clean:

clean:

bundles-clean:

pixelbender-clean:

assets-clean:

clean:

bundles-clean:

clean:

bundles-clean:

assets-clean:

clean:

bundles-clean:

clean:

bundles-clean:

clean:

clean:

clean:

bundles-clean:

pixelbender-clean:

clean:

clean:

clean:

clean:

clean:

bundles-clean:

clean:

bundles-clean:

clean:

clean:

bundles-clean:

clean:

bundles-clean:

clean:

bundles-clean:

clean:

bundles-clean:

clean:

clean:

clean:

frameworks-rsls-clean:

package-clean:

clean-temp:

clean-dependencychecker:

checkintests-clean:
 [loadfile] <https://builds.apache.org/job/flex-sdk_release/ws/mustella\local.properties> doesn't exist

cleanmustellaswc:

clean:

clean:

clean:
 [loadfile] <https://builds.apache.org/job/flex-sdk_release/ws/mustella\local.properties> doesn't exist

cleanswfs:

clean:
     [echo] Deleting old results and files from previous testsuite build.

super-clean:

create-description:
     [echo] build.number is 20130917

create-config:

playerglobal-setswfversion:

flex-config:
     [copy] Copying 1 file to <https://builds.apache.org/job/flex-sdk_release/ws/frameworks>

stage-source:

clean-temp:
     [copy] Copying 8 files to <https://builds.apache.org/job/flex-sdk_release/ws/temp>

stage-bin:
     [copy] Copying 30 files to <https://builds.apache.org/job/flex-sdk_release/ws/temp\bin>

stage-frameworks:
     [copy] Copying 5693 files to <https://builds.apache.org/job/flex-sdk_release/ws/temp\frameworks>
     [copy] Copying 1 file to <https://builds.apache.org/job/flex-sdk_release/ws/temp\frameworks\javascript>

stage-frameworks-tests:
     [copy] Copying 204 files to <https://builds.apache.org/job/flex-sdk_release/ws/temp\frameworks>
     [echo] Updating config file air-config.xml with version 4.10.0.20130917
     [echo] Updating config file flex-config.xml with version 4.10.0.20130917

version-update:

have-greptask:

no-greptask:
     [echo] Version files not updated.
     [echo] AntelopeTasks_*.jar not found in anttask.classpath

stage-tlf:
     [copy] Copying 224 files to <https://builds.apache.org/job/flex-sdk_release/ws/temp\frameworks\projects\textLayout>

stage-modules:
     [copy] Copying 1720 files to <https://builds.apache.org/job/flex-sdk_release/ws/temp\modules>
     [copy] Copying 1828 files to <https://builds.apache.org/job/flex-sdk_release/ws/temp\modules\thirdparty>
     [copy] Copying 49 files to <https://builds.apache.org/job/flex-sdk_release/ws/temp\asdoc>
     [copy] Copying 11 files to <https://builds.apache.org/job/flex-sdk_release/ws/temp\ide>

stage-mustella:
     [copy] Copying 101 files to <https://builds.apache.org/job/flex-sdk_release/ws/temp\mustella>
     [copy] Copying 965 files to <https://builds.apache.org/job/flex-sdk_release/ws/temp\samples>
     [copy] Copying 7 files to <https://builds.apache.org/job/flex-sdk_release/ws/temp\templates>

BUILD FAILED
<https://builds.apache.org/job/flex-sdk_release/ws/build.xml>:638: error running fixcrlf on file <https://builds.apache.org/job/flex-sdk_release/ws/temp\LICENSE>

Total time: 1 minute 52 seconds
Build step 'Invoke Ant' marked build as failure
Archiving artifacts

Build failed in Jenkins: flex-sdk_release #185

Posted by Apache Jenkins Server <je...@builds.apache.org>.
See <https://builds.apache.org/job/flex-sdk_release/185/>

------------------------------------------
[...truncated 400 lines...]

automation-clean:

bundles-clean:

automation_agent_bundles-clean:

automation_agent_bundles-clean:

automation_agent_bundles-clean:

automation_agent_bundles-clean:

automation_agent_bundles-clean:

automation_agent_bundles-clean:

automation_agent_bundles-clean:

automation_agent_bundles-clean:

automation_agent_bundles-clean:

automation_agent_bundles-clean:

automation_agent_bundles-clean:

automation_agent_bundles-clean:

automation_agent_bundles-clean:

automation_agent_bundles-clean:

automation_agent_bundles-clean:

automation_agent_bundles-clean:

automation_agent_bundles-clean:

automation_agent_bundles-clean:

automation_agent_bundles-clean:

automation_agent_bundles-clean:

automation_agent_bundles-clean:

clean:

bundles-clean:

clean:

clean:

clean:

clean:

clean:

clean:

clean:

bundles-clean:
     [echo] IN bundles clean

tool_air_bundles-clean:

tool_air_bundles-clean:

tool_air_bundles-clean:

tool_air_bundles-clean:

tool_air_bundles-clean:

tool_air_bundles-clean:

tool_air_bundles-clean:

tool_air_bundles-clean:

tool_air_bundles-clean:

tool_air_bundles-clean:

tool_air_bundles-clean:

tool_air_bundles-clean:

tool_air_bundles-clean:

tool_air_bundles-clean:

tool_air_bundles-clean:

tool_air_bundles-clean:

tool_air_bundles-clean:

tool_air_bundles-clean:

clean:

airsdk-clean:

clean:

check-tlf-home:

bundles-clean:

clean-external:
     [echo] cleaning <https://builds.apache.org/job/flex-sdk_release/ws/../flex-tlf>
     [echo] FLEX_HOME is <https://builds.apache.org/job/flex-sdk_release/ws/>
  [taskdef] Could not load definitions from resource flexTasks.tasks. It could not be found.

clean:

clean:

bundles-clean:

pixelbender-clean:

assets-clean:

clean:

bundles-clean:

clean:

bundles-clean:

assets-clean:

clean:

bundles-clean:

clean:

bundles-clean:

clean:

clean:

clean:

bundles-clean:

pixelbender-clean:

clean:

clean:

clean:

clean:

clean:

bundles-clean:

clean:

bundles-clean:

clean:

clean:

bundles-clean:

clean:

bundles-clean:

clean:

bundles-clean:

clean:

bundles-clean:

clean:

clean:

clean:

frameworks-rsls-clean:

package-clean:

clean-temp:

clean-dependencychecker:

checkintests-clean:
 [loadfile] <https://builds.apache.org/job/flex-sdk_release/ws/mustella\local.properties> doesn't exist

cleanmustellaswc:

clean:

clean:

clean:
 [loadfile] <https://builds.apache.org/job/flex-sdk_release/ws/mustella\local.properties> doesn't exist

cleanswfs:

clean:
     [echo] Deleting old results and files from previous testsuite build.

super-clean:

create-description:
     [echo] build.number is 20130917

create-config:

playerglobal-setswfversion:

flex-config:
     [copy] Copying 1 file to <https://builds.apache.org/job/flex-sdk_release/ws/frameworks>

stage-source:

clean-temp:
     [copy] Copying 8 files to <https://builds.apache.org/job/flex-sdk_release/ws/temp>

stage-bin:
     [copy] Copying 30 files to <https://builds.apache.org/job/flex-sdk_release/ws/temp\bin>

BUILD FAILED
<https://builds.apache.org/job/flex-sdk_release/ws/build.xml>:586: The following error occurred while executing this line:
<https://builds.apache.org/job/flex-sdk_release/ws/build.xml>:743: error running fixcrlf on file <https://builds.apache.org/job/flex-sdk_release/ws/temp\bin\amxmlc.bat>

Total time: 9 seconds
Build step 'Invoke Ant' marked build as failure
Archiving artifacts

Re: Build failed in Jenkins: flex-sdk_release #184

Posted by Erik de Bruin <er...@ixsoftware.nl>.
I just sent an email to builds@a.o., they have tendency to "improve"
the nodes with various tweaks. The 'release' and 'tlf' builds are also
failing due to reasons that seem unconnected to changes to the code...

EdB



On Tue, Sep 17, 2013 at 10:26 AM, Justin Mclean
<ju...@classsoftware.com> wrote:
> Hi,
>
> Anyone have any  idea why fixcrlf may be failing?
>
>> BUILD FAILED
>> <https://builds.apache.org/job/flex-sdk_release/ws/build.xml>:586: The following error occurred while executing this line:
>> <https://builds.apache.org/job/flex-sdk_release/ws/build.xml>:743: error running fixcrlf on file <https://builds.apache.org/job/flex-sdk_release/ws/temp\bin\asc.bat>
>
>
> Thanks,
> Justin



-- 
Ix Multimedia Software

Jan Luykenstraat 27
3521 VB Utrecht

T. 06-51952295
I. www.ixsoftware.nl

Re: Build failed in Jenkins: flex-sdk_release #184

Posted by Justin Mclean <ju...@classsoftware.com>.
Hi,

Anyone have any  idea why fixcrlf may be failing?

> BUILD FAILED
> <https://builds.apache.org/job/flex-sdk_release/ws/build.xml>:586: The following error occurred while executing this line:
> <https://builds.apache.org/job/flex-sdk_release/ws/build.xml>:743: error running fixcrlf on file <https://builds.apache.org/job/flex-sdk_release/ws/temp\bin\asc.bat>


Thanks,
Justin

Build failed in Jenkins: flex-sdk_release #184

Posted by Apache Jenkins Server <je...@builds.apache.org>.
See <https://builds.apache.org/job/flex-sdk_release/184/changes>

Changes:

[jmclean] FLEX-33728 added access to imageDecodingPolicy

[jmclean] FLEX-33728 fixed so compiles and all supported version of flash and chache first answer

[jmclean] FLEX-33722 stop RTE when dragging a spark datagrid column

------------------------------------------
[...truncated 400 lines...]

automation-clean:

bundles-clean:

automation_agent_bundles-clean:

automation_agent_bundles-clean:

automation_agent_bundles-clean:

automation_agent_bundles-clean:

automation_agent_bundles-clean:

automation_agent_bundles-clean:

automation_agent_bundles-clean:

automation_agent_bundles-clean:

automation_agent_bundles-clean:

automation_agent_bundles-clean:

automation_agent_bundles-clean:

automation_agent_bundles-clean:

automation_agent_bundles-clean:

automation_agent_bundles-clean:

automation_agent_bundles-clean:

automation_agent_bundles-clean:

automation_agent_bundles-clean:

automation_agent_bundles-clean:

automation_agent_bundles-clean:

automation_agent_bundles-clean:

automation_agent_bundles-clean:

clean:

bundles-clean:

clean:

clean:

clean:

clean:

clean:

clean:

clean:

bundles-clean:
     [echo] IN bundles clean

tool_air_bundles-clean:

tool_air_bundles-clean:

tool_air_bundles-clean:

tool_air_bundles-clean:

tool_air_bundles-clean:

tool_air_bundles-clean:

tool_air_bundles-clean:

tool_air_bundles-clean:

tool_air_bundles-clean:

tool_air_bundles-clean:

tool_air_bundles-clean:

tool_air_bundles-clean:

tool_air_bundles-clean:

tool_air_bundles-clean:

tool_air_bundles-clean:

tool_air_bundles-clean:

tool_air_bundles-clean:

tool_air_bundles-clean:

clean:

airsdk-clean:

clean:

check-tlf-home:

bundles-clean:

clean-external:
     [echo] cleaning <https://builds.apache.org/job/flex-sdk_release/ws/../flex-tlf>
     [echo] FLEX_HOME is <https://builds.apache.org/job/flex-sdk_release/ws/>
  [taskdef] Could not load definitions from resource flexTasks.tasks. It could not be found.

clean:

clean:

bundles-clean:

pixelbender-clean:

assets-clean:

clean:

bundles-clean:

clean:

bundles-clean:

assets-clean:

clean:

bundles-clean:

clean:

bundles-clean:

clean:

clean:

clean:

bundles-clean:

pixelbender-clean:

clean:

clean:

clean:

clean:

clean:

bundles-clean:

clean:

bundles-clean:

clean:

clean:

bundles-clean:

clean:

bundles-clean:

clean:

bundles-clean:

clean:

bundles-clean:

clean:

clean:

clean:

frameworks-rsls-clean:

package-clean:

clean-temp:

clean-dependencychecker:

checkintests-clean:
 [loadfile] <https://builds.apache.org/job/flex-sdk_release/ws/mustella\local.properties> doesn't exist

cleanmustellaswc:

clean:

clean:

clean:
 [loadfile] <https://builds.apache.org/job/flex-sdk_release/ws/mustella\local.properties> doesn't exist

cleanswfs:

clean:
     [echo] Deleting old results and files from previous testsuite build.

super-clean:

create-description:
     [echo] build.number is 20130917

create-config:

playerglobal-setswfversion:

flex-config:
     [copy] Copying 1 file to <https://builds.apache.org/job/flex-sdk_release/ws/frameworks>

stage-source:

clean-temp:
     [copy] Copying 8 files to <https://builds.apache.org/job/flex-sdk_release/ws/temp>

stage-bin:
     [copy] Copying 30 files to <https://builds.apache.org/job/flex-sdk_release/ws/temp\bin>

BUILD FAILED
<https://builds.apache.org/job/flex-sdk_release/ws/build.xml>:586: The following error occurred while executing this line:
<https://builds.apache.org/job/flex-sdk_release/ws/build.xml>:743: error running fixcrlf on file <https://builds.apache.org/job/flex-sdk_release/ws/temp\bin\asc.bat>

Total time: 32 seconds
Build step 'Invoke Ant' marked build as failure
Archiving artifacts