You are viewing a plain text version of this content. The canonical link for it is here.
Posted to dev@sling.apache.org by Apache Jenkins Server <je...@builds.apache.org> on 2015/04/09 17:48:23 UTC

Build failed in Jenkins: sling-trunk-1.8 #954

See <https://builds.apache.org/job/sling-trunk-1.8/954/changes>

Changes:

[cziegeler] SLING-4598 : Migrate launchpad testing to provisioning model

[radu] [maven-release-plugin] prepare for next development iteration

[radu] [maven-release-plugin] prepare release org.apache.sling.scripting.sightly.testing-1.0.4

[radu] releng: updating dependencies for release

[radu] [maven-release-plugin] prepare for next development iteration

[radu] [maven-release-plugin] prepare release org.apache.sling.scripting.sightly.testing-content-1.0.4

[radu] [maven-release-plugin] prepare for next development iteration

[radu] [maven-release-plugin] prepare release org.apache.sling.scripting.sightly.js.provider-1.0.2

[radu] SLING-4578 - Incorrect Sightly JS Use-API script dependency resolution

* script dependency resolution now also takes into account relative paths for
sling:resourceSuperType

[radu] releng: rolled back Apache Sling Scripting JS Use Provider 1.0.2

------------------------------------------
Started by an SCM change
Building remotely on ubuntu-4 (docker Ubuntu ubuntu4 ubuntu) in workspace <https://builds.apache.org/job/sling-trunk-1.8/ws/>
Updating http://svn.apache.org/repos/asf/sling/trunk at revision '2015-04-09T15:42:11.045 +0000'
D         launchpad/slingstart
U         launchpad/builder/pom.xml
D         launchpad/builder/src/main/appended-resources
D         launchpad/builder/src/main/bundles
D         launchpad/builder/src/main/sling
D         launchpad/builder/src/main/assembly
D         launchpad/builder/src/main/config
A         launchpad/builder/src/main/provisioning
AU        launchpad/builder/src/main/provisioning/boot.txt
AU        launchpad/builder/src/main/provisioning/standalone.txt
AU        launchpad/builder/src/main/provisioning/oak.txt
AU        launchpad/builder/src/main/provisioning/jackrabbit.txt
AU        launchpad/builder/src/main/provisioning/sling.txt
AU        launchpad/builder/src/main/provisioning/launchpad.txt
U         launchpad/test-bundles/pom.xml
D         launchpad/test-bundles/src/main/bundles
D         launchpad/test-bundles/src/main/java
D         launchpad/testing/src/main/config
A         launchpad/testing/src/main/provisioning
AU        launchpad/testing/src/main/provisioning/model.txt
U         launchpad/testing/pom.xml
U         contrib/scripting/sightly/testing/pom.xml
U         contrib/scripting/sightly/js-use-provider/src/main/java/org/apache/sling/scripting/sightly/js/impl/JsEnvironment.java
U         contrib/scripting/sightly/testing-content/src/main/resources/SLING-INF/apps/sightly/scripts/useinheritance.json
U         tooling/maven/slingstart-maven-plugin/src/main/java/org/apache/sling/maven/slingstart/DependencyLifecycleParticipant.java
U         tooling/maven/slingstart-maven-plugin/src/main/resources/META-INF/plexus/components.xml
At revision 1672400
Parsing POMs
Modules changed, recalculating dependency graph
maven3-agent.jar already up to date
maven3-interceptor.jar already up to date
maven3-interceptor-commons.jar already up to date
[trunk] $ /home/jenkins/jenkins-slave/tools/hudson.model.JDK/jdk-1.8.0/bin/java -Xmx512M -XX:MaxPermSize=256M -enableassertions -cp /home/jenkins/jenkins-slave/maven3-agent.jar:/home/jenkins/jenkins-slave/tools/hudson.tasks.Maven_MavenInstallation/Maven_3.0.5/boot/plexus-classworlds-2.4.jar org.jvnet.hudson.maven3.agent.Maven3Main /home/jenkins/jenkins-slave/tools/hudson.tasks.Maven_MavenInstallation/Maven_3.0.5 /home/jenkins/jenkins-slave/slave.jar /home/jenkins/jenkins-slave/maven3-interceptor.jar /home/jenkins/jenkins-slave/maven3-interceptor-commons.jar 42595
Java HotSpot(TM) 64-Bit Server VM warning: ignoring option MaxPermSize=256M; support was removed in 8.0
<===[JENKINS REMOTING CAPACITY]===>   channel started
Executing Maven:  -B -f <https://builds.apache.org/job/sling-trunk-1.8/ws/trunk/pom.xml> -Dmaven.repo.local=/home/jenkins/jenkins-slave/maven-repositories/1 -DobrRepository=false clean install -DHttpTestBase.readyTimeoutSeconds=300
[INFO] Scanning for projects...
[WARNING] 
[WARNING] Some problems were encountered while building the effective model for org.apache.sling:org.apache.sling.discovery.impl:bundle:1.1.1-SNAPSHOT
[WARNING] 'dependencies.dependency.(groupId:artifactId:type:classifier)' must be unique: org.apache.sling:org.apache.sling.testing.tools:jar -> duplicate declaration of version 1.0.2 @ line 259, column 21
[WARNING] 
[WARNING] It is highly recommended to fix these problems because they threaten the stability of your build.
[WARNING] 
[WARNING] For this reason, future Maven versions might no longer support building such malformed projects.
[WARNING] 
[INFO] Searching for slingstart projects...
[ERROR] Unable to determine plugin-based dependencies: No model files found in <https://builds.apache.org/job/sling-trunk-1.8/ws/trunk/launchpad/test-bundles/src/main/provisioning> -> [Help 1]
[ERROR] 
[ERROR] To see the full stack trace of the errors, re-run Maven with the -e switch.
[ERROR] Re-run Maven using the -X switch to enable full debug logging.
[ERROR] 
[ERROR] For more information about the errors and possible solutions, please read the following articles:
[ERROR] [Help 1] http://cwiki.apache.org/confluence/display/MAVEN/MavenExecutionException
channel stopped

Jenkins build is back to stable : sling-trunk-1.8 #966

Posted by Apache Jenkins Server <je...@builds.apache.org>.
See <https://builds.apache.org/job/sling-trunk-1.8/966/changes>


Jenkins build is still unstable: sling-trunk-1.8 #965

Posted by Apache Jenkins Server <je...@builds.apache.org>.
See <https://builds.apache.org/job/sling-trunk-1.8/changes>


Jenkins build is unstable: sling-trunk-1.8 #964

Posted by Apache Jenkins Server <je...@builds.apache.org>.
See <https://builds.apache.org/job/sling-trunk-1.8/964/changes>


Build failed in Jenkins: sling-trunk-1.8 #963

Posted by Apache Jenkins Server <je...@builds.apache.org>.
See <https://builds.apache.org/job/sling-trunk-1.8/963/changes>

Changes:

[rombert] SLING-4606 - Move validation from contrib to /

Add the sling parent pom to the validation reactor pom

[cziegeler] SLING-4602 : Migrate launchpad/testing-war to provisioning model

------------------------------------------
Started by an SCM change
Building remotely on H10 (Ubuntu ubuntu) in workspace <https://builds.apache.org/job/sling-trunk-1.8/ws/>
Updating http://svn.apache.org/repos/asf/sling/trunk at revision '2015-04-10T15:42:09.014 +0000'
U         bundles/extensions/validation/pom.xml
U         launchpad/testing-war/pom.xml
At revision 1672684
Parsing POMs
Modules changed, recalculating dependency graph
maven3-agent.jar already up to date
maven3-interceptor.jar already up to date
maven3-interceptor-commons.jar already up to date
[trunk] $ /home/jenkins/jenkins-slave/tools/hudson.model.JDK/jdk-1.8.0/bin/java -Xmx512M -XX:MaxPermSize=256M -enableassertions -cp /home/jenkins/jenkins-slave/maven3-agent.jar:/home/jenkins/jenkins-slave/tools/hudson.tasks.Maven_MavenInstallation/Maven_3.0.5/boot/plexus-classworlds-2.4.jar org.jvnet.hudson.maven3.agent.Maven3Main /home/jenkins/jenkins-slave/tools/hudson.tasks.Maven_MavenInstallation/Maven_3.0.5 /home/jenkins/jenkins-slave/slave.jar /home/jenkins/jenkins-slave/maven3-interceptor.jar /home/jenkins/jenkins-slave/maven3-interceptor-commons.jar 40148
Java HotSpot(TM) 64-Bit Server VM warning: ignoring option MaxPermSize=256M; support was removed in 8.0
<===[JENKINS REMOTING CAPACITY]===>   channel started
Executing Maven:  -B -f <https://builds.apache.org/job/sling-trunk-1.8/ws/trunk/pom.xml> -Dmaven.repo.local=/home/jenkins/jenkins-slave/maven-repositories/0 -DobrRepository=false clean install -DHttpTestBase.readyTimeoutSeconds=300
[INFO] Scanning for projects...
[WARNING] 
[WARNING] Some problems were encountered while building the effective model for org.apache.sling:org.apache.sling.discovery.impl:bundle:1.1.1-SNAPSHOT
[WARNING] 'dependencies.dependency.(groupId:artifactId:type:classifier)' must be unique: org.apache.sling:org.apache.sling.testing.tools:jar -> duplicate declaration of version 1.0.2 @ line 259, column 21
[WARNING] 
[WARNING] It is highly recommended to fix these problems because they threaten the stability of your build.
[WARNING] 
[WARNING] For this reason, future Maven versions might no longer support building such malformed projects.
[WARNING] 
[INFO] Searching for slingstart projects...
[ERROR] Unable to determine plugin-based dependencies: No launchpad feature found. -> [Help 1]
[ERROR] 
[ERROR] To see the full stack trace of the errors, re-run Maven with the -e switch.
[ERROR] Re-run Maven using the -X switch to enable full debug logging.
[ERROR] 
[ERROR] For more information about the errors and possible solutions, please read the following articles:
[ERROR] [Help 1] http://cwiki.apache.org/confluence/display/MAVEN/MavenExecutionException
channel stopped

Jenkins build is unstable: sling-trunk-1.8 #962

Posted by Apache Jenkins Server <je...@builds.apache.org>.
See <https://builds.apache.org/job/sling-trunk-1.8/962/changes>


Build failed in Jenkins: sling-trunk-1.8 #961

Posted by Apache Jenkins Server <je...@builds.apache.org>.
See <https://builds.apache.org/job/sling-trunk-1.8/961/changes>

Changes:

[cziegeler] Add missing projects

[kwin] SLING-4606 fix SCM infos, reference launchpad in released version 7, build validation with the default reactor

[cziegeler] Check main artifact and attached artifacts for artifacts from the same build

[kwin] SLING 4606 move validation from contrib to /

[kwin] SLING-4606 remove Sling validation as contrib module

------------------------------------------
[...truncated 57417 lines...]
[INFO] Apache Sling Repository API Bundle ................ SUCCESS [1.699s]
[INFO] Apache Sling Testing JCR Mock ..................... SUCCESS [3.247s]
[INFO] Apache Sling JCR Base Bundle ...................... SUCCESS [3.020s]
[INFO] Apache Sling JCR ClassLoader ...................... SUCCESS [2.083s]
[INFO] Apache Sling Initial Content Loader ............... SUCCESS [3.684s]
[INFO] Apache Sling Jackrabbit Embedded Repository ....... SUCCESS [11.684s]
[INFO] Apache Sling Jackrabbit UserManager Support ....... SUCCESS [2.349s]
[INFO] Apache Sling Jackrabbit JSR-283 Access Control Manager Support  SUCCESS [2.153s]
[INFO] Apache Sling Wrapper Bundle for the JCR API ....... SUCCESS [1.604s]
[INFO] Apache Sling JCR Resource Resolver ................ SUCCESS [32.214s]
[INFO] Apache Sling Testing Sling Mock Jackrabbit-based Resource Resolver  SUCCESS [13.497s]
[INFO] Apache Sling Versioning Integration Tests ......... SUCCESS [7.009s]
[INFO] Apache Sling JCR Repository Registration .......... SUCCESS [3.274s]
[INFO] Apache Sling Simple WebDAV Access to repositories . SUCCESS [2.500s]
[INFO] Apache Sling DavEx Access to repositories ......... SUCCESS [2.922s]
[INFO] Apache Sling JCR WebConsole Bundle ................ SUCCESS [1.745s]
[INFO] Apache Sling Oak Repository Server ................ SUCCESS [2.978s]
[INFO] Apache Sling SlingRepository Integration Tests .... SUCCESS [43.665s]
[INFO] Apache Sling Servlet Resolver ..................... SUCCESS [3.414s]
[INFO] Apache Sling Default GET Servlets ................. SUCCESS [3.307s]
[INFO] Apache Sling Default POST Servlets ................ SUCCESS [4.222s]
[INFO] Apache Sling Compat Servlets ...................... SUCCESS [1.847s]
[INFO] Apache Sling Scripting Implementation API ......... SUCCESS [1.923s]
[INFO] Apache Sling Scripting Core implementation ........ SUCCESS [10.825s]
[INFO] Apache Sling Scripting JavaScript Support ......... SUCCESS [8.477s]
[INFO] Apache Sling Scripting JSP Support ................ SUCCESS [5.152s]
[INFO] Apache Sling JSP Tag Library ...................... SUCCESS [7.259s]
[INFO] Apache Sling JSP Standard Tag Library ............. SUCCESS [1.771s]
[INFO] Apache Sling Adapter Manager Implementation ....... SUCCESS [2.685s]
[INFO] Apache Sling Bundle Resource Provider ............. SUCCESS [1.723s]
[INFO] Apache Sling Distributed Event Admin .............. SUCCESS [4.159s]
[INFO] Apache Sling Discovery API ........................ SUCCESS [1.887s]
[INFO] Apache Sling Resource-Based Discovery Service ..... SUCCESS [4:40.933s]
[INFO] Apache Sling Discovery Support Bundle ............. SUCCESS [1.717s]
[INFO] Apache Sling Discovery Standalone Implementation .. SUCCESS [1.783s]
[INFO] Apache Sling Event Support ........................ SUCCESS [11:21.622s]
[INFO] Apache Sling Feature Flags ........................ SUCCESS [1.954s]
[INFO] Apache Sling Filesystem Resource Provider ......... SUCCESS [1.805s]
[INFO] Apache Sling javax.activation bundle .............. SUCCESS [1.897s]
[INFO] Apache Sling Service User Mapper .................. SUCCESS [2.573s]
[INFO] Apache Sling Settings ............................. SUCCESS [2.435s]
[INFO] Apache Sling Web Console Branding ................. SUCCESS [1.784s]
[INFO] Apache Sling Web Console Security Provider ........ SUCCESS [1.834s]
[INFO] Apache Sling Explorer ............................. SUCCESS [1.817s]
[INFO] Apache Sling Health Check Core .................... SUCCESS [7.156s]
[INFO] Apache Sling Health Check Annotations ............. SUCCESS [1.883s]
[INFO] Apache Sling Health Check Samples ................. SUCCESS [2.599s]
[INFO] Apache Sling Health Check Support Components ...... SUCCESS [3.083s]
[INFO] Apache Sling Health Check Webconsole Plugin ....... SUCCESS [1.771s]
[INFO] Apache Sling Health Check JUnit Bridge ............ SUCCESS [2.707s]
[INFO] Apache Sling Health Check Integration Tests ....... SUCCESS [23.019s]
[INFO] Apache Sling Health Check Reactor POM ............. SUCCESS [1.010s]
[INFO] Apache Sling Resource Access Security ............. SUCCESS [1.986s]
[INFO] Apache Sling Resource Access Security Integration Tests  SUCCESS [19.895s]
[INFO] Apache Sling Validation Framework API ............. SUCCESS [3.837s]
[INFO] Apache Sling Validation Framework Core Implementation  SUCCESS [13.019s]
[INFO] Apache Sling Validation Framework Testing Services  SUCCESS [2.260s]
[INFO] Apache Sling Validation Framework Integration Tests  SUCCESS [20.423s]
[INFO] Apache Sling Validation Framework Examples ........ SUCCESS [1.954s]
[INFO] Apache Sling Validation Framework Builder ......... SUCCESS [0.148s]
[INFO] Apache Sling Models API ........................... SUCCESS [1.992s]
[INFO] Apache Sling Models Implementation ................ SUCCESS [4.941s]
[INFO] Apache Sling Test Tools ........................... SUCCESS [2.820s]
[INFO] Apache Sling Models Integration Tests ............. SUCCESS [24.793s]
[INFO] Apache Sling JUnit Core ........................... SUCCESS [3.029s]
[INFO] Apache Sling JUnit Scriptable Tests Provider ...... SUCCESS [2.373s]
[INFO] Apache Sling JUnit Health Checks .................. SUCCESS [2.133s]
[INFO] Apache Sling JUnit Remote Tests Runners ........... SUCCESS [1.948s]
[INFO] Apache Sling JUnit Performance .................... SUCCESS [2.577s]
[INFO] Apache Sling Testing Resource Resolver Mock ....... SUCCESS [2.282s]
[INFO] Apache Sling Testing OSGi Mock .................... SUCCESS [3.558s]
[INFO] Apache Sling Testing Sling Mock ................... SUCCESS [5.585s]
[INFO] Apache Sling Pax Exam Utilities ................... SUCCESS [20.354s]
[INFO] Apache Sling Sample Server-Side Tests ............. SUCCESS [1.783s]
[INFO] Apache Sling Failing Server-Side Tests ............ SUCCESS [1.633s]
[INFO] Apache Sling Launchpad Base ....................... SUCCESS [12.481s]
[INFO] Apache Sling Launchpad Application Builder ........ SUCCESS [15.755s]
[INFO] Apache Sling Sample Integration Tests ............. SUCCESS [1:09.571s]
[INFO] Apache Sling Testing Modules Reactor .............. SUCCESS [1.004s]
[INFO] Apache Sling Installer ............................ SUCCESS [3.207s]
[INFO] Apache Sling Installer WebConsole Plugin .......... SUCCESS [1.725s]
[INFO] Apache Sling File Installer ....................... SUCCESS [1.626s]
[INFO] Apache Sling JCR Installer ........................ SUCCESS [1:54.945s]
[INFO] Apache Sling Installer Configuration Admin Support  SUCCESS [2.226s]
[INFO] Apache Sling Deployment Package Installer ......... SUCCESS [1.618s]
[INFO] Apache Sling Subsystems Installer ................. SUCCESS [1.688s]
[INFO] Apache Sling Installer Integration Tests .......... SUCCESS [41.944s]
[INFO] Apache Sling Launchpad API ........................ SUCCESS [1.587s]
[INFO] Apache Sling Launchpad Installer .................. SUCCESS [11.884s]
[INFO] Apache Sling Launchpad Content .................... SUCCESS [1.595s]
[INFO] Apache Sling Launchpad Testing Services ........... SUCCESS [4.007s]
[INFO] Apache Sling Launchpad Testing Services WAR ....... SUCCESS [2.247s]
[INFO] Apache Sling Launchpad Testing Fragment Bundle .... SUCCESS [1.668s]
[INFO] Apache Sling Launchpad Test Bundles ............... SUCCESS [3.175s]
[INFO] Apache Sling Integration Tests .................... SUCCESS [4.910s]
[INFO] Apache Sling Launchpad Testing .................... FAILURE [0.942s]
[INFO] Apache Sling (Builder) ............................ SKIPPED
[INFO] ------------------------------------------------------------------------
[INFO] BUILD FAILURE
[INFO] ------------------------------------------------------------------------
[INFO] Total time: 31:53.637s
[INFO] Finished at: Fri Apr 10 14:18:10 UTC 2015
[INFO] Final Memory: 205M/467M
[INFO] ------------------------------------------------------------------------
[JENKINS] Archiving disabled
[JENKINS] Archiving disabled
[JENKINS] Archiving disabled
[JENKINS] Archiving disabled
[JENKINS] Archiving disabled
[JENKINS] Archiving disabled
[JENKINS] Archiving disabled
[JENKINS] Archiving disabled
[JENKINS] Archiving disabled
[JENKINS] Archiving disabled
[JENKINS] Archiving disabled
[JENKINS] Archiving disabled
[JENKINS] Archiving disabled
[JENKINS] Archiving disabled
[JENKINS] Archiving disabled
[JENKINS] Archiving disabled
[JENKINS] Archiving disabled
[JENKINS] Archiving disabled
[JENKINS] Archiving disabled
[JENKINS] Archiving disabled
[JENKINS] Archiving disabled
[JENKINS] Archiving disabled
[JENKINS] Archiving disabled
[JENKINS] Archiving disabled
[JENKINS] Archiving disabled
[JENKINS] Archiving disabled
[JENKINS] Archiving disabled
[JENKINS] Archiving disabled
[JENKINS] Archiving disabled
[JENKINS] Archiving disabled
[JENKINS] Archiving disabled
[JENKINS] Archiving disabled
[JENKINS] Archiving disabled
[JENKINS] Archiving disabled
[JENKINS] Archiving disabled
[JENKINS] Archiving disabled
[JENKINS] Archiving disabled
[JENKINS] Archiving disabled
[JENKINS] Archiving disabled
[JENKINS] Archiving disabled
[JENKINS] Archiving disabled
[JENKINS] Archiving disabled
[JENKINS] Archiving disabled
[JENKINS] Archiving disabled
[JENKINS] Archiving disabled
[JENKINS] Archiving disabled
[JENKINS] Archiving disabled
[JENKINS] Archiving disabled
[JENKINS] Archiving disabled
[JENKINS] Archiving disabled
[JENKINS] Archiving disabled
[JENKINS] Archiving disabled
[JENKINS] Archiving disabled
[JENKINS] Archiving disabled
[JENKINS] Archiving disabled
[JENKINS] Archiving disabled
[JENKINS] Archiving disabled
[JENKINS] Archiving disabled
[JENKINS] Archiving disabled
[JENKINS] Archiving disabled
[JENKINS] Archiving disabled
[JENKINS] Archiving disabled
[JENKINS] Archiving disabled
[JENKINS] Archiving disabled
[JENKINS] Archiving disabled
[JENKINS] Archiving disabled
[JENKINS] Archiving disabled
[JENKINS] Archiving disabled
[JENKINS] Archiving disabled
[JENKINS] Archiving disabled
[JENKINS] Archiving disabled
[JENKINS] Archiving disabled
[JENKINS] Archiving disabled
[JENKINS] Archiving disabled
[JENKINS] Archiving disabled
[JENKINS] Archiving disabled
[JENKINS] Archiving disabled
[JENKINS] Archiving disabled
[JENKINS] Archiving disabled
[JENKINS] Archiving disabled
[JENKINS] Archiving disabled
[JENKINS] Archiving disabled
[JENKINS] Archiving disabled
[JENKINS] Archiving disabled
[JENKINS] Archiving disabled
[JENKINS] Archiving disabled
[JENKINS] Archiving disabled
[JENKINS] Archiving disabled
[JENKINS] Archiving disabled
[JENKINS] Archiving disabled
[JENKINS] Archiving disabled
[JENKINS] Archiving disabled
[JENKINS] Archiving disabled
[JENKINS] Archiving disabled
[JENKINS] Archiving disabled
[JENKINS] Archiving disabled
[JENKINS] Archiving disabled
[JENKINS] Archiving disabled
[JENKINS] Archiving disabled
[JENKINS] Archiving disabled
[JENKINS] Archiving disabled
[JENKINS] Archiving disabled
[JENKINS] Archiving disabled
[JENKINS] Archiving disabled
[JENKINS] Archiving disabled
[JENKINS] Archiving disabled
[JENKINS] Archiving disabled
[JENKINS] Archiving disabled
[JENKINS] Archiving disabled
[JENKINS] Archiving disabled
[JENKINS] Archiving disabled
[JENKINS] Archiving disabled
[JENKINS] Archiving disabled
[JENKINS] Archiving disabled
[JENKINS] Archiving disabled
[JENKINS] Archiving disabled
[JENKINS] Archiving disabled
[JENKINS] Archiving disabled
[JENKINS] Archiving disabled
[JENKINS] Archiving disabled
[JENKINS] Archiving disabled
[JENKINS] Archiving disabled
[JENKINS] Archiving disabled
[JENKINS] Archiving disabled
[JENKINS] Archiving disabled
[JENKINS] Archiving disabled
[JENKINS] Archiving disabled
[JENKINS] Archiving disabled
[JENKINS] Archiving disabled
[JENKINS] Archiving disabled
[JENKINS] Archiving disabled
[JENKINS] Archiving disabled
[JENKINS] Archiving disabled
Waiting for Jenkins to finish collecting data
[ERROR] Failed to execute goal org.apache.sling:slingstart-maven-plugin:1.0.5-SNAPSHOT:prepare (default-prepare) on project org.apache.sling.launchpad.testing: Unable to find dependency build artifact Dependency {groupId=org.apache.sling, artifactId=org.apache.sling.launchpad.test-bundles, version=0.0.1-SNAPSHOT, type=slingfeature} -> [Help 1]
[ERROR] 
[ERROR] To see the full stack trace of the errors, re-run Maven with the -e switch.
[ERROR] Re-run Maven using the -X switch to enable full debug logging.
[ERROR] 
[ERROR] For more information about the errors and possible solutions, please read the following articles:
[ERROR] [Help 1] http://cwiki.apache.org/confluence/display/MAVEN/MojoExecutionException
[ERROR] 
[ERROR] After correcting the problems, you can resume the build with the command
[ERROR]   mvn <goals> -rf :org.apache.sling.launchpad.testing
channel stopped

Build failed in Jenkins: sling-trunk-1.8 #960

Posted by Apache Jenkins Server <je...@builds.apache.org>.
See <https://builds.apache.org/job/sling-trunk-1.8/960/changes>

Changes:

[cziegeler] Correct snapshot dependency to resourceresolver

[cziegeler] Get dependent projects from build if build in the same build

[cziegeler] Correct snapshot versions for ras tests

[cziegeler] Correct health check dependencies

------------------------------------------
[...truncated 56652 lines...]
[INFO] Apache Sling JSON Library ......................... SUCCESS [4.415s]
[INFO] Apache Sling SLF4J Implementation (Logback) ....... SUCCESS [28.265s]
[INFO] Apache Sling OSGi LogService Implementation ....... SUCCESS [2.926s]
[INFO] Apache Sling MIME type mapping support ............ SUCCESS [6.193s]
[INFO] Apache Sling Commons OSGi support ................. SUCCESS [3.482s]
[INFO] Apache Sling Scheduler Support .................... SUCCESS [2.710s]
[INFO] Apache Sling Testing Utilities .................... SUCCESS [10.377s]
[INFO] Apache Sling Thread Dumper ........................ SUCCESS [2.211s]
[INFO] Apache Sling Thread Support ....................... SUCCESS [2.361s]
[INFO] Apache Sling Authentication Service ............... SUCCESS [3.497s]
[INFO] Apache Sling Form Based Authentication Handler .... SUCCESS [6.023s]
[INFO] Apache Sling Engine Implementation ................ SUCCESS [12.064s]
[INFO] Apache Sling Repository API Bundle ................ SUCCESS [1.904s]
[INFO] Apache Sling Testing JCR Mock ..................... SUCCESS [3.124s]
[INFO] Apache Sling JCR Base Bundle ...................... SUCCESS [3.215s]
[INFO] Apache Sling JCR ClassLoader ...................... SUCCESS [2.195s]
[INFO] Apache Sling Initial Content Loader ............... SUCCESS [3.431s]
[INFO] Apache Sling Jackrabbit Embedded Repository ....... SUCCESS [11.611s]
[INFO] Apache Sling Jackrabbit UserManager Support ....... SUCCESS [2.737s]
[INFO] Apache Sling Jackrabbit JSR-283 Access Control Manager Support  SUCCESS [2.217s]
[INFO] Apache Sling Wrapper Bundle for the JCR API ....... SUCCESS [1.813s]
[INFO] Apache Sling JCR Resource Resolver ................ SUCCESS [28.603s]
[INFO] Apache Sling Testing Sling Mock Jackrabbit-based Resource Resolver  SUCCESS [20.913s]
[INFO] Apache Sling Versioning Integration Tests ......... SUCCESS [7.197s]
[INFO] Apache Sling JCR Repository Registration .......... SUCCESS [3.645s]
[INFO] Apache Sling Simple WebDAV Access to repositories . SUCCESS [3.805s]
[INFO] Apache Sling DavEx Access to repositories ......... SUCCESS [3.111s]
[INFO] Apache Sling JCR WebConsole Bundle ................ SUCCESS [1.993s]
[INFO] Apache Sling Oak Repository Server ................ SUCCESS [3.465s]
[INFO] Apache Sling SlingRepository Integration Tests .... SUCCESS [44.803s]
[INFO] Apache Sling Servlet Resolver ..................... SUCCESS [3.916s]
[INFO] Apache Sling Default GET Servlets ................. SUCCESS [3.394s]
[INFO] Apache Sling Default POST Servlets ................ SUCCESS [3.712s]
[INFO] Apache Sling Compat Servlets ...................... SUCCESS [2.063s]
[INFO] Apache Sling Scripting Implementation API ......... SUCCESS [2.114s]
[INFO] Apache Sling Scripting Core implementation ........ SUCCESS [10.602s]
[INFO] Apache Sling Scripting JavaScript Support ......... SUCCESS [10.456s]
[INFO] Apache Sling Scripting JSP Support ................ SUCCESS [5.117s]
[INFO] Apache Sling JSP Tag Library ...................... SUCCESS [4.644s]
[INFO] Apache Sling JSP Standard Tag Library ............. SUCCESS [1.820s]
[INFO] Apache Sling Adapter Manager Implementation ....... SUCCESS [3.294s]
[INFO] Apache Sling Bundle Resource Provider ............. SUCCESS [1.846s]
[INFO] Apache Sling Distributed Event Admin .............. SUCCESS [4.191s]
[INFO] Apache Sling Discovery API ........................ SUCCESS [3.969s]
[INFO] Apache Sling Resource-Based Discovery Service ..... SUCCESS [4:09.984s]
[INFO] Apache Sling Discovery Support Bundle ............. SUCCESS [1.988s]
[INFO] Apache Sling Discovery Standalone Implementation .. SUCCESS [1.885s]
[INFO] Apache Sling Event Support ........................ SUCCESS [11:19.355s]
[INFO] Apache Sling Feature Flags ........................ SUCCESS [2.038s]
[INFO] Apache Sling Filesystem Resource Provider ......... SUCCESS [2.039s]
[INFO] Apache Sling javax.activation bundle .............. SUCCESS [2.008s]
[INFO] Apache Sling Service User Mapper .................. SUCCESS [2.886s]
[INFO] Apache Sling Settings ............................. SUCCESS [2.667s]
[INFO] Apache Sling Web Console Branding ................. SUCCESS [1.722s]
[INFO] Apache Sling Web Console Security Provider ........ SUCCESS [2.160s]
[INFO] Apache Sling Explorer ............................. SUCCESS [1.872s]
[INFO] Apache Sling Health Check Core .................... SUCCESS [7.636s]
[INFO] Apache Sling Health Check Annotations ............. SUCCESS [1.704s]
[INFO] Apache Sling Health Check Samples ................. SUCCESS [2.729s]
[INFO] Apache Sling Health Check Support Components ...... SUCCESS [3.390s]
[INFO] Apache Sling Health Check Webconsole Plugin ....... SUCCESS [2.015s]
[INFO] Apache Sling Health Check JUnit Bridge ............ SUCCESS [2.965s]
[INFO] Apache Sling Health Check Integration Tests ....... SUCCESS [24.991s]
[INFO] Apache Sling Health Check Reactor POM ............. SUCCESS [1.108s]
[INFO] Apache Sling Resource Access Security ............. SUCCESS [2.389s]
[INFO] Apache Sling Resource Access Security Integration Tests  SUCCESS [23.327s]
[INFO] Apache Sling Models API ........................... SUCCESS [3.454s]
[INFO] Apache Sling Models Implementation ................ SUCCESS [5.110s]
[INFO] Apache Sling Test Tools ........................... SUCCESS [2.967s]
[INFO] Apache Sling Models Integration Tests ............. SUCCESS [24.406s]
[INFO] Apache Sling JUnit Core ........................... SUCCESS [3.508s]
[INFO] Apache Sling JUnit Scriptable Tests Provider ...... SUCCESS [2.580s]
[INFO] Apache Sling JUnit Health Checks .................. SUCCESS [3.577s]
[INFO] Apache Sling JUnit Remote Tests Runners ........... SUCCESS [2.282s]
[INFO] Apache Sling JUnit Performance .................... SUCCESS [3.140s]
[INFO] Apache Sling Testing Resource Resolver Mock ....... SUCCESS [2.208s]
[INFO] Apache Sling Testing OSGi Mock .................... SUCCESS [3.974s]
[INFO] Apache Sling Testing Sling Mock ................... SUCCESS [5.539s]
[INFO] Apache Sling Pax Exam Utilities ................... SUCCESS [18.983s]
[INFO] Apache Sling Sample Server-Side Tests ............. SUCCESS [2.083s]
[INFO] Apache Sling Failing Server-Side Tests ............ SUCCESS [1.867s]
[INFO] Apache Sling Launchpad Base ....................... SUCCESS [11.073s]
[INFO] Apache Sling Launchpad Application Builder ........ SUCCESS [20.175s]
[INFO] Apache Sling Sample Integration Tests ............. SUCCESS [1:10.030s]
[INFO] Apache Sling Testing Modules Reactor .............. SUCCESS [0.973s]
[INFO] Apache Sling Installer ............................ SUCCESS [3.547s]
[INFO] Apache Sling Installer WebConsole Plugin .......... SUCCESS [1.957s]
[INFO] Apache Sling File Installer ....................... SUCCESS [1.900s]
[INFO] Apache Sling JCR Installer ........................ SUCCESS [1:55.486s]
[INFO] Apache Sling Installer Configuration Admin Support  SUCCESS [3.571s]
[INFO] Apache Sling Deployment Package Installer ......... SUCCESS [1.923s]
[INFO] Apache Sling Subsystems Installer ................. SUCCESS [1.991s]
[INFO] Apache Sling Installer Integration Tests .......... SUCCESS [42.147s]
[INFO] Apache Sling Launchpad API ........................ SUCCESS [2.093s]
[INFO] Apache Sling Launchpad Installer .................. SUCCESS [6.264s]
[INFO] Apache Sling Launchpad Content .................... SUCCESS [2.975s]
[INFO] Apache Sling Launchpad Testing Services ........... SUCCESS [4.405s]
[INFO] Apache Sling Launchpad Testing Services WAR ....... SUCCESS [2.423s]
[INFO] Apache Sling Launchpad Testing Fragment Bundle .... SUCCESS [2.483s]
[INFO] Apache Sling Launchpad Test Bundles ............... SUCCESS [2.763s]
[INFO] Apache Sling Integration Tests .................... SUCCESS [5.824s]
[INFO] Apache Sling Launchpad Testing .................... FAILURE [0.309s]
[INFO] Apache Sling (Builder) ............................ SKIPPED
[INFO] ------------------------------------------------------------------------
[INFO] BUILD FAILURE
[INFO] ------------------------------------------------------------------------
[INFO] Total time: 31:27.590s
[INFO] Finished at: Fri Apr 10 13:16:31 UTC 2015
[INFO] Final Memory: 187M/425M
[INFO] ------------------------------------------------------------------------
[JENKINS] Archiving disabled
[JENKINS] Archiving disabled
[JENKINS] Archiving disabled
[JENKINS] Archiving disabled
[JENKINS] Archiving disabled
[JENKINS] Archiving disabled
[JENKINS] Archiving disabled
[JENKINS] Archiving disabled
[JENKINS] Archiving disabled
[JENKINS] Archiving disabled
[JENKINS] Archiving disabled
[JENKINS] Archiving disabled
[JENKINS] Archiving disabled
[JENKINS] Archiving disabled
[JENKINS] Archiving disabled
[JENKINS] Archiving disabled
[JENKINS] Archiving disabled
[JENKINS] Archiving disabled
[JENKINS] Archiving disabled
[JENKINS] Archiving disabled
[JENKINS] Archiving disabled
[JENKINS] Archiving disabled
[JENKINS] Archiving disabled
[JENKINS] Archiving disabled
[JENKINS] Archiving disabled
[JENKINS] Archiving disabled
[JENKINS] Archiving disabled
[JENKINS] Archiving disabled
[JENKINS] Archiving disabled
[JENKINS] Archiving disabled
[JENKINS] Archiving disabled
[JENKINS] Archiving disabled
[JENKINS] Archiving disabled
[JENKINS] Archiving disabled
[JENKINS] Archiving disabled
[JENKINS] Archiving disabled
[JENKINS] Archiving disabled
[JENKINS] Archiving disabled
[JENKINS] Archiving disabled
[JENKINS] Archiving disabled
[JENKINS] Archiving disabled
[JENKINS] Archiving disabled
[JENKINS] Archiving disabled
[JENKINS] Archiving disabled
[JENKINS] Archiving disabled
[JENKINS] Archiving disabled
[JENKINS] Archiving disabled
[JENKINS] Archiving disabled
[JENKINS] Archiving disabled
[JENKINS] Archiving disabled
[JENKINS] Archiving disabled
[JENKINS] Archiving disabled
[JENKINS] Archiving disabled
[JENKINS] Archiving disabled
[JENKINS] Archiving disabled
[JENKINS] Archiving disabled
[JENKINS] Archiving disabled
[JENKINS] Archiving disabled
[JENKINS] Archiving disabled
[JENKINS] Archiving disabled
[JENKINS] Archiving disabled
[JENKINS] Archiving disabled
[JENKINS] Archiving disabled
[JENKINS] Archiving disabled
[JENKINS] Archiving disabled
[JENKINS] Archiving disabled
[JENKINS] Archiving disabled
[JENKINS] Archiving disabled
[JENKINS] Archiving disabled
[JENKINS] Archiving disabled
[JENKINS] Archiving disabled
[JENKINS] Archiving disabled
[JENKINS] Archiving disabled
[JENKINS] Archiving disabled
[JENKINS] Archiving disabled
[JENKINS] Archiving disabled
[JENKINS] Archiving disabled
[JENKINS] Archiving disabled
[JENKINS] Archiving disabled
[JENKINS] Archiving disabled
[JENKINS] Archiving disabled
[JENKINS] Archiving disabled
[JENKINS] Archiving disabled
[JENKINS] Archiving disabled
[JENKINS] Archiving disabled
[JENKINS] Archiving disabled
[JENKINS] Archiving disabled
[JENKINS] Archiving disabled
[JENKINS] Archiving disabled
[JENKINS] Archiving disabled
[JENKINS] Archiving disabled
[JENKINS] Archiving disabled
[JENKINS] Archiving disabled
[JENKINS] Archiving disabled
[JENKINS] Archiving disabled
[JENKINS] Archiving disabled
[JENKINS] Archiving disabled
[JENKINS] Archiving disabled
[JENKINS] Archiving disabled
[JENKINS] Archiving disabled
[JENKINS] Archiving disabled
[JENKINS] Archiving disabled
[JENKINS] Archiving disabled
[JENKINS] Archiving disabled
[JENKINS] Archiving disabled
[JENKINS] Archiving disabled
[JENKINS] Archiving disabled
[JENKINS] Archiving disabled
[JENKINS] Archiving disabled
[JENKINS] Archiving disabled
[JENKINS] Archiving disabled
[JENKINS] Archiving disabled
[JENKINS] Archiving disabled
[JENKINS] Archiving disabled
[JENKINS] Archiving disabled
[JENKINS] Archiving disabled
[JENKINS] Archiving disabled
[JENKINS] Archiving disabled
[JENKINS] Archiving disabled
[JENKINS] Archiving disabled
[JENKINS] Archiving disabled
[JENKINS] Archiving disabled
[JENKINS] Archiving disabled
[JENKINS] Archiving disabled
[JENKINS] Archiving disabled
[JENKINS] Archiving disabled
[JENKINS] Archiving disabled
Waiting for Jenkins to finish collecting data[ERROR] Failed to execute goal org.apache.sling:slingstart-maven-plugin:1.0.5-SNAPSHOT:prepare (default-prepare) on project org.apache.sling.launchpad.testing: Unable to find dependency build artifact Dependency {groupId=org.apache.sling, artifactId=org.apache.sling.launchpad.test-bundles, version=0.0.1-SNAPSHOT, type=slingfeature} -> [Help 1]
[ERROR] 
[ERROR] To see the full stack trace of the errors, re-run Maven with the -e switch.
[ERROR] Re-run Maven using the -X switch to enable full debug logging.
[ERROR] 
[ERROR] For more information about the errors and possible solutions, please read the following articles:
[ERROR] [Help 1] http://cwiki.apache.org/confluence/display/MAVEN/MojoExecutionException
[ERROR] 
[ERROR] After correcting the problems, you can resume the build with the command
[ERROR]   mvn <goals> -rf :org.apache.sling.launchpad.testing

channel stopped

Build failed in Jenkins: sling-trunk-1.8 #959

Posted by Apache Jenkins Server <je...@builds.apache.org>.
See <https://builds.apache.org/job/sling-trunk-1.8/959/changes>

Changes:

[cziegeler] Correct type of model artifact

[cziegeler] Use released versions

[cziegeler] Correct dependency to launchpad project

[cziegeler] Correct type/language of slingstart packaging

------------------------------------------
[...truncated 56688 lines...]
[INFO] Apache Sling Initial Content Loader ............... SUCCESS [4.759s]
[INFO] Apache Sling Jackrabbit Embedded Repository ....... SUCCESS [15.684s]
[INFO] Apache Sling Jackrabbit UserManager Support ....... SUCCESS [4.121s]
[INFO] Apache Sling Jackrabbit JSR-283 Access Control Manager Support  SUCCESS [2.957s]
[INFO] Apache Sling Wrapper Bundle for the JCR API ....... SUCCESS [2.262s]
[INFO] Apache Sling JCR Resource Resolver ................ SUCCESS [46.781s]
[INFO] Apache Sling Testing Sling Mock Jackrabbit-based Resource Resolver  SUCCESS [22.497s]
[INFO] Apache Sling Versioning Integration Tests ......... SUCCESS [7.683s]
[INFO] Apache Sling JCR Repository Registration .......... SUCCESS [4.200s]
[INFO] Apache Sling Simple WebDAV Access to repositories . SUCCESS [6.386s]
[INFO] Apache Sling DavEx Access to repositories ......... SUCCESS [3.412s]
[INFO] Apache Sling JCR WebConsole Bundle ................ SUCCESS [2.299s]
[INFO] Apache Sling Oak Repository Server ................ SUCCESS [3.158s]
[INFO] Apache Sling SlingRepository Integration Tests .... SUCCESS [45.154s]
[INFO] Apache Sling Servlet Resolver ..................... SUCCESS [4.298s]
[INFO] Apache Sling Default GET Servlets ................. SUCCESS [6.798s]
[INFO] Apache Sling Default POST Servlets ................ SUCCESS [4.089s]
[INFO] Apache Sling Compat Servlets ...................... SUCCESS [2.140s]
[INFO] Apache Sling Scripting Implementation API ......... SUCCESS [2.115s]
[INFO] Apache Sling Scripting Core implementation ........ SUCCESS [10.653s]
[INFO] Apache Sling Scripting JavaScript Support ......... SUCCESS [17.702s]
[INFO] Apache Sling Scripting JSP Support ................ SUCCESS [5.451s]
[INFO] Apache Sling JSP Tag Library ...................... SUCCESS [4.626s]
[INFO] Apache Sling JSP Standard Tag Library ............. SUCCESS [2.009s]
[INFO] Apache Sling Adapter Manager Implementation ....... SUCCESS [3.097s]
[INFO] Apache Sling Bundle Resource Provider ............. SUCCESS [2.394s]
[INFO] Apache Sling Distributed Event Admin .............. SUCCESS [4.380s]
[INFO] Apache Sling Discovery API ........................ SUCCESS [1.942s]
[INFO] Apache Sling Resource-Based Discovery Service ..... SUCCESS [4:19.069s]
[INFO] Apache Sling Discovery Support Bundle ............. SUCCESS [2.073s]
[INFO] Apache Sling Discovery Standalone Implementation .. SUCCESS [3.307s]
[INFO] Apache Sling Event Support ........................ SUCCESS [11:13.396s]
[INFO] Apache Sling Feature Flags ........................ SUCCESS [2.263s]
[INFO] Apache Sling Filesystem Resource Provider ......... SUCCESS [2.152s]
[INFO] Apache Sling javax.activation bundle .............. SUCCESS [2.140s]
[INFO] Apache Sling Service User Mapper .................. SUCCESS [5.053s]
[INFO] Apache Sling Settings ............................. SUCCESS [2.868s]
[INFO] Apache Sling Web Console Branding ................. SUCCESS [1.998s]
[INFO] Apache Sling Web Console Security Provider ........ SUCCESS [2.404s]
[INFO] Apache Sling Explorer ............................. SUCCESS [2.055s]
[INFO] Apache Sling Health Check Core .................... SUCCESS [7.626s]
[INFO] Apache Sling Health Check Annotations ............. SUCCESS [1.601s]
[INFO] Apache Sling Health Check Samples ................. SUCCESS [3.121s]
[INFO] Apache Sling Health Check Support Components ...... SUCCESS [2.891s]
[INFO] Apache Sling Health Check Webconsole Plugin ....... SUCCESS [2.038s]
[INFO] Apache Sling Health Check JUnit Bridge ............ SUCCESS [2.687s]
[INFO] Apache Sling Health Check Integration Tests ....... SUCCESS [23.955s]
[INFO] Apache Sling Health Check Reactor POM ............. SUCCESS [0.995s]
[INFO] Apache Sling Resource Access Security ............. SUCCESS [2.548s]
[INFO] Apache Sling Resource Access Security Integration Tests  SUCCESS [22.737s]
[INFO] Apache Sling Models API ........................... SUCCESS [3.384s]
[INFO] Apache Sling Models Implementation ................ SUCCESS [6.682s]
[INFO] Apache Sling Test Tools ........................... SUCCESS [4.319s]
[INFO] Apache Sling Models Integration Tests ............. SUCCESS [24.456s]
[INFO] Apache Sling JUnit Core ........................... SUCCESS [3.925s]
[INFO] Apache Sling JUnit Scriptable Tests Provider ...... SUCCESS [2.898s]
[INFO] Apache Sling JUnit Health Checks .................. SUCCESS [2.467s]
[INFO] Apache Sling JUnit Remote Tests Runners ........... SUCCESS [2.201s]
[INFO] Apache Sling JUnit Performance .................... SUCCESS [2.634s]
[INFO] Apache Sling Testing Resource Resolver Mock ....... SUCCESS [2.440s]
[INFO] Apache Sling Testing OSGi Mock .................... SUCCESS [3.746s]
[INFO] Apache Sling Testing Sling Mock ................... SUCCESS [6.035s]
[INFO] Apache Sling Pax Exam Utilities ................... SUCCESS [21.854s]
[INFO] Apache Sling Sample Server-Side Tests ............. SUCCESS [2.494s]
[INFO] Apache Sling Failing Server-Side Tests ............ SUCCESS [1.935s]
[INFO] Apache Sling Launchpad Base ....................... SUCCESS [11.159s]
[INFO] Apache Sling Launchpad Application Builder ........ SUCCESS [24.609s]
[INFO] Apache Sling Sample Integration Tests ............. SUCCESS [1:09.298s]
[INFO] Apache Sling Testing Modules Reactor .............. SUCCESS [1.020s]
[INFO] Apache Sling Installer ............................ SUCCESS [3.893s]
[INFO] Apache Sling Installer WebConsole Plugin .......... SUCCESS [1.946s]
[INFO] Apache Sling File Installer ....................... SUCCESS [1.931s]
[INFO] Apache Sling JCR Installer ........................ SUCCESS [1:54.943s]
[INFO] Apache Sling Installer Configuration Admin Support  SUCCESS [2.524s]
[INFO] Apache Sling Deployment Package Installer ......... SUCCESS [1.847s]
[INFO] Apache Sling Subsystems Installer ................. SUCCESS [2.057s]
[INFO] Apache Sling Installer Integration Tests .......... SUCCESS [41.741s]
[INFO] Apache Sling Launchpad API ........................ SUCCESS [2.134s]
[INFO] Apache Sling Launchpad Installer .................. SUCCESS [12.031s]
[INFO] Apache Sling Launchpad Content .................... SUCCESS [1.744s]
[INFO] Apache Sling Launchpad Testing Services ........... SUCCESS [4.463s]
[INFO] Apache Sling Launchpad Testing Services WAR ....... SUCCESS [2.414s]
[INFO] Apache Sling Launchpad Testing Fragment Bundle .... SUCCESS [1.845s]
[INFO] Apache Sling Launchpad Test Bundles ............... SUCCESS [2.673s]
[INFO] Apache Sling Integration Tests .................... SUCCESS [6.025s]
[INFO] Apache Sling Launchpad Testing .................... FAILURE [2.246s]
[INFO] Apache Sling (Builder) ............................ SKIPPED
[INFO] ------------------------------------------------------------------------
[INFO] BUILD FAILURE
[INFO] ------------------------------------------------------------------------
[INFO] Total time: 33:42.420s
[INFO] Finished at: Fri Apr 10 12:18:57 UTC 2015
[INFO] Final Memory: 184M/422M
[INFO] ------------------------------------------------------------------------
[JENKINS] Archiving disabled
[JENKINS] Archiving disabled
[JENKINS] Archiving disabled
[JENKINS] Archiving disabled
[JENKINS] Archiving disabled
[JENKINS] Archiving disabled
[JENKINS] Archiving disabled
[JENKINS] Archiving disabled
[JENKINS] Archiving disabled
[JENKINS] Archiving disabled
[JENKINS] Archiving disabled
[JENKINS] Archiving disabled
[JENKINS] Archiving disabled
[JENKINS] Archiving disabled
[JENKINS] Archiving disabled
[JENKINS] Archiving disabled
[JENKINS] Archiving disabled
[JENKINS] Archiving disabled
[JENKINS] Archiving disabled
[JENKINS] Archiving disabled
[JENKINS] Archiving disabled
[JENKINS] Archiving disabled
[JENKINS] Archiving disabled
[JENKINS] Archiving disabled
[JENKINS] Archiving disabled
[JENKINS] Archiving disabled
[JENKINS] Archiving disabled
[JENKINS] Archiving disabled
[JENKINS] Archiving disabled
[JENKINS] Archiving disabled
[JENKINS] Archiving disabled
[JENKINS] Archiving disabled
[JENKINS] Archiving disabled
[JENKINS] Archiving disabled
[JENKINS] Archiving disabled
[JENKINS] Archiving disabled
[JENKINS] Archiving disabled
[JENKINS] Archiving disabled
[JENKINS] Archiving disabled
[JENKINS] Archiving disabled
[JENKINS] Archiving disabled
[JENKINS] Archiving disabled
[JENKINS] Archiving disabled
[JENKINS] Archiving disabled
[JENKINS] Archiving disabled
[JENKINS] Archiving disabled
[JENKINS] Archiving disabled
[JENKINS] Archiving disabled
[JENKINS] Archiving disabled
[JENKINS] Archiving disabled
[JENKINS] Archiving disabled
[JENKINS] Archiving disabled
[JENKINS] Archiving disabled
[JENKINS] Archiving disabled
[JENKINS] Archiving disabled
[JENKINS] Archiving disabled
[JENKINS] Archiving disabled
[JENKINS] Archiving disabled
[JENKINS] Archiving disabled
[JENKINS] Archiving disabled
[JENKINS] Archiving disabled
[JENKINS] Archiving disabled
[JENKINS] Archiving disabled
[JENKINS] Archiving disabled
[JENKINS] Archiving disabled
[JENKINS] Archiving disabled
[JENKINS] Archiving disabled
[JENKINS] Archiving disabled
[JENKINS] Archiving disabled
[JENKINS] Archiving disabled
[JENKINS] Archiving disabled
[JENKINS] Archiving disabled
[JENKINS] Archiving disabled
[JENKINS] Archiving disabled
[JENKINS] Archiving disabled
[JENKINS] Archiving disabled
[JENKINS] Archiving disabled
[JENKINS] Archiving disabled
[JENKINS] Archiving disabled
[JENKINS] Archiving disabled
[JENKINS] Archiving disabled
[JENKINS] Archiving disabled
[JENKINS] Archiving disabled
[JENKINS] Archiving disabled
[JENKINS] Archiving disabled
[JENKINS] Archiving disabled
[JENKINS] Archiving disabled
[JENKINS] Archiving disabled
[JENKINS] Archiving disabled
[JENKINS] Archiving disabled
[JENKINS] Archiving disabled
[JENKINS] Archiving disabled
[JENKINS] Archiving disabled
[JENKINS] Archiving disabled
[JENKINS] Archiving disabled
[JENKINS] Archiving disabled
[JENKINS] Archiving disabled
[JENKINS] Archiving disabled
[JENKINS] Archiving disabled
[JENKINS] Archiving disabled
[JENKINS] Archiving disabled
[JENKINS] Archiving disabled
[JENKINS] Archiving disabled
[JENKINS] Archiving disabled
[JENKINS] Archiving disabled
[JENKINS] Archiving disabled
[JENKINS] Archiving disabled
[JENKINS] Archiving disabled
[JENKINS] Archiving disabled
[JENKINS] Archiving disabled
[JENKINS] Archiving disabled
[JENKINS] Archiving disabled
[JENKINS] Archiving disabled
[JENKINS] Archiving disabled
[JENKINS] Archiving disabled
[JENKINS] Archiving disabled
[JENKINS] Archiving disabled
[JENKINS] Archiving disabled
[JENKINS] Archiving disabled
[JENKINS] Archiving disabled
[JENKINS] Archiving disabled
[JENKINS] Archiving disabled
[JENKINS] Archiving disabled
[JENKINS] Archiving disabled
[JENKINS] Archiving disabled
[JENKINS] Archiving disabled
[JENKINS] Archiving disabled
Waiting for Jenkins to finish collecting data[ERROR] Failed to execute goal org.apache.sling:slingstart-maven-plugin:1.0.5-SNAPSHOT:prepare (default-prepare) on project org.apache.sling.launchpad.testing: Unable to get artifact for Dependency {groupId=org.apache.sling, artifactId=org.apache.sling.launchpad.test-bundles, version=0.0.1-SNAPSHOT, type=slingfeature}: Could not find artifact org.apache.sling:org.apache.sling.launchpad.test-bundles:txt:null:0.0.1-SNAPSHOT in Nexus (http://repository.apache.org/snapshots)
[ERROR] 
[ERROR] Try downloading the file manually from the project website.
[ERROR] 
[ERROR] Then, install it using the command:
[ERROR] mvn install:install-file -DgroupId=org.apache.sling -DartifactId=org.apache.sling.launchpad.test-bundles -Dversion=0.0.1-SNAPSHOT -Dclassifier=null -Dpackaging=slingfeature -Dfile=/path/to/file
[ERROR] 
[ERROR] Alternatively, if you host your own repository you can deploy the file there:
[ERROR] mvn deploy:deploy-file -DgroupId=org.apache.sling -DartifactId=org.apache.sling.launchpad.test-bundles -Dversion=0.0.1-SNAPSHOT -Dclassifier=null -Dpackaging=slingfeature -Dfile=/path/to/file -Durl=[url] -DrepositoryId=[id]
[ERROR] 
[ERROR] 
[ERROR] org.apache.sling:org.apache.sling.launchpad.test-bundles:slingfeature:0.0.1-SNAPSHOT
[ERROR] 
[ERROR] from the specified remote repositories:
[ERROR] Nexus (http://repository.apache.org/snapshots, releases=false, snapshots=true),
[ERROR] central (http://repo.maven.apache.org/maven2, releases=true, snapshots=false)
[ERROR] -> [Help 1]
[ERROR] 
[ERROR] To see the full stack trace of the errors, re-run Maven with the -e switch.
[ERROR] Re-run Maven using the -X switch to enable full debug logging.
[ERROR] 
[ERROR] For more information about the errors and possible solutions, please read the following articles:
[ERROR] [Help 1] http://cwiki.apache.org/confluence/display/MAVEN/MojoExecutionException
[ERROR] 
[ERROR] After correcting the problems, you can resume the build with the command
[ERROR]   mvn <goals> -rf :org.apache.sling.launchpad.testing

channel stopped

Build failed in Jenkins: sling-trunk-1.8 #958

Posted by Apache Jenkins Server <je...@builds.apache.org>.
See <https://builds.apache.org/job/sling-trunk-1.8/958/changes>

Changes:

[cziegeler] Use latest snapshot of commons testing during release vote

[cziegeler] [maven-release-plugin] prepare for next development iteration

[cziegeler] [maven-release-plugin] prepare release org.apache.sling.commons.testing-2.0.18

[cziegeler] Delay resolving of reactor projects until project is built

[radu] releng: updated dependencies after release staging

------------------------------------------
Started by an SCM change
Building remotely on H10 (Ubuntu ubuntu) in workspace <https://builds.apache.org/job/sling-trunk-1.8/ws/>
Updating http://svn.apache.org/repos/asf/sling/trunk at revision '2015-04-10T09:44:44.669 +0000'
U         bundles/commons/testing/pom.xml
U         launchpad/integration-tests/pom.xml
A         launchpad/test-bundles/src/main/provisioning
AU        launchpad/test-bundles/src/main/provisioning/bundles.txt
D         launchpad/testing/src/main/resources
U         contrib/extensions/i18n/src/main/java/org/apache/sling/i18n/impl/JcrResourceBundle.java
U         contrib/scripting/sightly/testing/pom.xml
U         tooling/maven/slingstart-maven-plugin/src/main/java/org/apache/sling/maven/slingstart/DependencyLifecycleParticipant.java
AU        tooling/maven/slingstart-maven-plugin/src/main/java/org/apache/sling/maven/slingstart/PrepareSlingStartMojo.java
U         tooling/maven/slingstart-maven-plugin/src/main/java/org/apache/sling/maven/slingstart/PreparePackageMojo.java
U         tooling/maven/slingstart-maven-plugin/src/main/java/org/apache/sling/maven/slingstart/ModelUtils.java
U         tooling/maven/slingstart-maven-plugin/src/main/java/org/apache/sling/maven/slingstart/AbstractSlingStartMojo.java
U         tooling/maven/slingstart-maven-plugin/src/main/resources/META-INF/plexus/components.xml
At revision 1672599
Parsing POMs
Modules changed, recalculating dependency graph
maven3-agent.jar already up to date
maven3-interceptor.jar already up to date
maven3-interceptor-commons.jar already up to date
[trunk] $ /home/jenkins/jenkins-slave/tools/hudson.model.JDK/jdk-1.8.0/bin/java -Xmx512M -XX:MaxPermSize=256M -enableassertions -cp /home/jenkins/jenkins-slave/maven3-agent.jar:/home/jenkins/jenkins-slave/tools/hudson.tasks.Maven_MavenInstallation/Maven_3.0.5/boot/plexus-classworlds-2.4.jar org.jvnet.hudson.maven3.agent.Maven3Main /home/jenkins/jenkins-slave/tools/hudson.tasks.Maven_MavenInstallation/Maven_3.0.5 /home/jenkins/jenkins-slave/slave.jar /home/jenkins/jenkins-slave/maven3-interceptor.jar /home/jenkins/jenkins-slave/maven3-interceptor-commons.jar 57608
Java HotSpot(TM) 64-Bit Server VM warning: ignoring option MaxPermSize=256M; support was removed in 8.0
<===[JENKINS REMOTING CAPACITY]===>   channel started
Executing Maven:  -B -f <https://builds.apache.org/job/sling-trunk-1.8/ws/trunk/pom.xml> -Dmaven.repo.local=/home/jenkins/jenkins-slave/maven-repositories/0 -DobrRepository=false clean install -DHttpTestBase.readyTimeoutSeconds=300
[INFO] Scanning for projects...
[WARNING] 
[WARNING] Some problems were encountered while building the effective model for org.apache.sling:org.apache.sling.discovery.impl:bundle:1.1.1-SNAPSHOT
[WARNING] 'dependencies.dependency.(groupId:artifactId:type:classifier)' must be unique: org.apache.sling:org.apache.sling.testing.tools:jar -> duplicate declaration of version 1.0.2 @ line 259, column 21
[WARNING] 
[WARNING] It is highly recommended to fix these problems because they threaten the stability of your build.
[WARNING] 
[WARNING] For this reason, future Maven versions might no longer support building such malformed projects.
[WARNING] 
[INFO] Searching for slingstart projects...
[ERROR] Unable to determine plugin-based dependencies: No launchpad feature found. -> [Help 1]
[ERROR] 
[ERROR] To see the full stack trace of the errors, re-run Maven with the -e switch.
[ERROR] Re-run Maven using the -X switch to enable full debug logging.
[ERROR] 
[ERROR] For more information about the errors and possible solutions, please read the following articles:
[ERROR] [Help 1] http://cwiki.apache.org/confluence/display/MAVEN/MavenExecutionException
channel stopped

Build failed in Jenkins: sling-trunk-1.8 #957

Posted by Apache Jenkins Server <je...@builds.apache.org>.
See <https://builds.apache.org/job/sling-trunk-1.8/957/changes>

Changes:

[cziegeler] Remove unused code and add failing project to exception

[cziegeler] SLING-4598 : Migrate launchpad testing to provisioning model

[cziegeler] Revert release

[cziegeler] [maven-release-plugin] prepare for next development iteration

[cziegeler] [maven-release-plugin] prepare release org.apache.sling.commons.testing-2.0.18

[cziegeler] SLING-4598 : Migrate launchpad testing to provisioning model

------------------------------------------
[...truncated 11779 lines...]
A         testing/samples/sample-tests/src/main/java/org/apache/sling/extensions
A         testing/samples/sample-tests/src/main/java/org/apache/sling/extensions/junit
A         testing/samples/sample-tests/src/main/java/org/apache/sling/extensions/junit/testbundle
A         testing/samples/integration-tests
A         testing/samples/integration-tests/.gitignore
A         testing/samples/integration-tests/src
A         testing/samples/integration-tests/src/test
A         testing/samples/integration-tests/src/test/java
A         testing/samples/integration-tests/src/test/java/org
A         testing/samples/integration-tests/src/test/java/org/apache
A         testing/samples/integration-tests/src/test/java/org/apache/sling
A         testing/samples/integration-tests/src/test/java/org/apache/sling/testing
A         testing/samples/integration-tests/src/test/java/org/apache/sling/testing/samples
A         testing/samples/integration-tests/src/test/java/org/apache/sling/testing/samples/integrationtests
A         testing/samples/integration-tests/src/test/java/org/apache/sling/testing/samples/integrationtests/http
A         testing/samples/integration-tests/src/test/java/org/apache/sling/testing/samples/integrationtests/http/MultipleOsgiConsoleTest.java
AU        testing/samples/integration-tests/src/test/java/org/apache/sling/testing/samples/integrationtests/http/OsgiConsoleTest.java
A         testing/samples/integration-tests/src/test/java/org/apache/sling/testing/samples/integrationtests/serverside
AU        testing/samples/integration-tests/src/test/java/org/apache/sling/testing/samples/integrationtests/serverside/FailingTestsTest.java
A         testing/samples/integration-tests/src/test/java/org/apache/sling/testing/samples/integrationtests/serverside/sling
AU        testing/samples/integration-tests/src/test/java/org/apache/sling/testing/samples/integrationtests/serverside/sling/SlingServerSideTestsBase.java
AU        testing/samples/integration-tests/src/test/java/org/apache/sling/testing/samples/integrationtests/serverside/sling/SlingServerSideTest.java
AU        testing/samples/integration-tests/src/test/java/org/apache/sling/testing/samples/integrationtests/serverside/sling/SlingServerSideSingleMethodTest.java
A         testing/samples/integration-tests/src/test/java/org/apache/sling/testing/samples/integrationtests/serverside/sling/post
AU        testing/samples/integration-tests/src/test/java/org/apache/sling/testing/samples/integrationtests/serverside/sling/post/SlingPostChunkUploadTest.java
AU        testing/samples/integration-tests/src/test/java/org/apache/sling/testing/samples/integrationtests/serverside/ServerSideSampleTest.java
AU        testing/samples/integration-tests/src/test/java/org/apache/sling/testing/samples/integrationtests/serverside/SingleServerSideMethodTest.java
AU        testing/samples/integration-tests/src/test/java/org/apache/sling/testing/samples/integrationtests/serverside/DontCareForTestsCountTest.java
AU        testing/samples/integration-tests/src/test/java/org/apache/sling/testing/samples/integrationtests/serverside/JSONResponseTest.java
A         testing/samples/integration-tests/src/test/java/org/apache/sling/testing/samples/integrationtests/serverside/scriptable
AU        testing/samples/integration-tests/src/test/java/org/apache/sling/testing/samples/integrationtests/serverside/scriptable/ScriptableTestsTest.java
AU        testing/samples/integration-tests/src/test/java/org/apache/sling/testing/samples/integrationtests/serverside/ServerSideTestsBase.java
AU        testing/samples/integration-tests/pom.xml
AU        testing/samples/integration-tests/README.txt
A         testing/junit
A         testing/junit/core
AU        testing/junit/core/pom.xml
A         testing/junit/core/src
A         testing/junit/core/src/main
A         testing/junit/core/src/main/java
A         testing/junit/core/src/main/java/org
A         testing/junit/core/src/main/java/org/apache
A         testing/junit/core/src/main/java/org/apache/sling
A         testing/junit/core/src/main/java/org/apache/sling/junit
A         testing/junit/core/src/main/java/org/apache/sling/junit/rules
A         testing/junit/core/src/main/java/org/apache/sling/junit/rules/Service.java
AU        testing/junit/core/src/main/java/org/apache/sling/junit/Activator.java
A         testing/junit/core/src/main/java/org/apache/sling/junit/SlingTestContextProvider.java
AU        testing/junit/core/src/main/java/org/apache/sling/junit/TestsManager.java
AU        testing/junit/core/src/main/java/org/apache/sling/junit/TestsProvider.java
A         testing/junit/core/src/main/java/org/apache/sling/junit/annotations
AU        testing/junit/core/src/main/java/org/apache/sling/junit/annotations/TestReference.java
AU        testing/junit/core/src/main/java/org/apache/sling/junit/annotations/AutoDetect.java
AU        testing/junit/core/src/main/java/org/apache/sling/junit/annotations/SlingAnnotationsTestRunner.java
A         testing/junit/core/src/main/java/org/apache/sling/junit/RendererFactory.java
AU        testing/junit/core/src/main/java/org/apache/sling/junit/TestSelector.java
A         testing/junit/core/src/main/java/org/apache/sling/junit/SlingTestContext.java
A         testing/junit/core/src/main/java/org/apache/sling/junit/impl
A         testing/junit/core/src/main/java/org/apache/sling/junit/impl/servlet
AU        testing/junit/core/src/main/java/org/apache/sling/junit/impl/servlet/HtmlFilter.java
AU        testing/junit/core/src/main/java/org/apache/sling/junit/impl/servlet/HtmlRenderer.java
AU        testing/junit/core/src/main/java/org/apache/sling/junit/impl/servlet/SlingJUnitServlet.java
AU        testing/junit/core/src/main/java/org/apache/sling/junit/impl/servlet/JUnitServlet.java
AU        testing/junit/core/src/main/java/org/apache/sling/junit/impl/servlet/PlainTextRenderer.java
AU        testing/junit/core/src/main/java/org/apache/sling/junit/impl/servlet/JsonRenderer.java
AU        testing/junit/core/src/main/java/org/apache/sling/junit/impl/servlet/JacocoServlet.java
AU        testing/junit/core/src/main/java/org/apache/sling/junit/impl/servlet/TestLogServlet.java
AU        testing/junit/core/src/main/java/org/apache/sling/junit/impl/servlet/XmlRenderer.java
AU        testing/junit/core/src/main/java/org/apache/sling/junit/impl/BundleTestsProvider.java
AU        testing/junit/core/src/main/java/org/apache/sling/junit/impl/RendererSelectorImpl.java
AU        testing/junit/core/src/main/java/org/apache/sling/junit/impl/AnnotationsProcessor.java
AU        testing/junit/core/src/main/java/org/apache/sling/junit/impl/TestsManagerImpl.java
A         testing/junit/core/src/main/java/org/apache/sling/junit/impl/TestContextRunListenerWrapper.java
AU        testing/junit/core/src/main/java/org/apache/sling/junit/RequestParser.java
AU        testing/junit/core/src/main/java/org/apache/sling/junit/Renderer.java
AU        testing/junit/core/src/main/java/org/apache/sling/junit/TestObjectProcessor.java
AU        testing/junit/core/src/main/java/org/apache/sling/junit/RendererSelector.java
A         testing/junit/core/src/main/resources
A         testing/junit/core/src/main/resources/OSGI-INF
A         testing/junit/core/src/main/resources/OSGI-INF/metatype
AU        testing/junit/core/src/main/resources/OSGI-INF/metatype/metatype.properties
AU        testing/junit/core/src/main/resources/junit.css
A         testing/junit/core/src/test
A         testing/junit/core/src/test/java
A         testing/junit/core/src/test/java/org
A         testing/junit/core/src/test/java/org/apache
A         testing/junit/core/src/test/java/org/apache/sling
A         testing/junit/core/src/test/java/org/apache/sling/junit
AU        testing/junit/core/src/test/java/org/apache/sling/junit/RequestParserTest.java
A         testing/junit/scriptable
A         testing/junit/scriptable/src
A         testing/junit/scriptable/src/test
A         testing/junit/scriptable/src/test/java
A         testing/junit/scriptable/src/test/java/org
A         testing/junit/scriptable/src/test/java/org/apache
A         testing/junit/scriptable/src/test/java/org/apache/sling
A         testing/junit/scriptable/src/test/java/org/apache/sling/junit
A         testing/junit/scriptable/src/test/java/org/apache/sling/junit/tests
AU        testing/junit/scriptable/src/test/java/org/apache/sling/junit/tests/TestAllPathsTest.java
A         testing/junit/scriptable/src/main
A         testing/junit/scriptable/src/main/resources
A         testing/junit/scriptable/src/main/resources/SLING-INF
A         testing/junit/scriptable/src/main/resources/SLING-INF/nodetypes
AU        testing/junit/scriptable/src/main/resources/SLING-INF/nodetypes/slingtest.cnd
A         testing/junit/scriptable/src/main/java
A         testing/junit/scriptable/src/main/java/org
A         testing/junit/scriptable/src/main/java/org/apache
A         testing/junit/scriptable/src/main/java/org/apache/sling
A         testing/junit/scriptable/src/main/java/org/apache/sling/junit
A         testing/junit/scriptable/src/main/java/org/apache/sling/junit/scriptable
AU        testing/junit/scriptable/src/main/java/org/apache/sling/junit/scriptable/HttpResponse.java
AU        testing/junit/scriptable/src/main/java/org/apache/sling/junit/scriptable/TestServletOutputStream.java
AU        testing/junit/scriptable/src/main/java/org/apache/sling/junit/scriptable/ExplainTests.java
AU        testing/junit/scriptable/src/main/java/org/apache/sling/junit/scriptable/ScriptableTestsProvider.java
AU        testing/junit/scriptable/src/main/java/org/apache/sling/junit/scriptable/HttpRequest.java
AU        testing/junit/scriptable/src/main/java/org/apache/sling/junit/scriptable/TestAllPaths.java
AU        testing/junit/scriptable/pom.xml
A         testing/junit/remote
A         testing/junit/remote/src
A         testing/junit/remote/src/main
A         testing/junit/remote/src/main/java
A         testing/junit/remote/src/main/java/org
A         testing/junit/remote/src/main/java/org/apache
A         testing/junit/remote/src/main/java/org/apache/sling
A         testing/junit/remote/src/main/java/org/apache/sling/junit
A         testing/junit/remote/src/main/java/org/apache/sling/junit/remote
A         testing/junit/remote/src/main/java/org/apache/sling/junit/remote/testrunner
AU        testing/junit/remote/src/main/java/org/apache/sling/junit/remote/testrunner/SlingRemoteTestRunner.java
AU        testing/junit/remote/src/main/java/org/apache/sling/junit/remote/testrunner/SlingRemoteTest.java
AU        testing/junit/remote/src/main/java/org/apache/sling/junit/remote/testrunner/SlingRemoteTestParameters.java
AU        testing/junit/remote/src/main/java/org/apache/sling/junit/remote/testrunner/SlingTestsCountChecker.java
A         testing/junit/remote/src/main/java/org/apache/sling/junit/remote/exported
A         testing/junit/remote/src/main/java/org/apache/sling/junit/remote/exported/package-info.java
AU        testing/junit/remote/src/main/java/org/apache/sling/junit/remote/exported/ExampleRemoteTest.java
A         testing/junit/remote/src/main/java/org/apache/sling/junit/remote/httpclient
AU        testing/junit/remote/src/main/java/org/apache/sling/junit/remote/httpclient/RemoteTestHttpClient.java
A         testing/junit/remote/src/main/java/org/apache/sling/junit/remote/ide
AU        testing/junit/remote/src/main/java/org/apache/sling/junit/remote/ide/SlingRemoteExecutionRule.java
A         testing/junit/remote/src/main/java/org/apache/sling/junit/remote/ide/package-info.java
AU        testing/junit/remote/src/main/java/org/apache/sling/junit/remote/ide/ExecutionResult.java
AU        testing/junit/remote/src/main/java/org/apache/sling/junit/remote/ide/SerializedRenderer.java
AU        testing/junit/remote/pom.xml
A         testing/junit/performance
A         testing/junit/performance/src
A         testing/junit/performance/src/main
A         testing/junit/performance/src/main/java
A         testing/junit/performance/src/main/java/org
A         testing/junit/performance/src/main/java/org/apache
A         testing/junit/performance/src/main/java/org/apache/sling
A         testing/junit/performance/src/main/java/org/apache/sling/junit
A         testing/junit/performance/src/main/java/org/apache/sling/junit/performance
A         testing/junit/performance/src/main/java/org/apache/sling/junit/performance/impl
A         testing/junit/performance/src/main/java/org/apache/sling/junit/performance/impl/RunWarmUpStartedEvents.java
A         testing/junit/performance/src/main/java/org/apache/sling/junit/performance/impl/RunWarmUpIterationFinishedEvents.java
A         testing/junit/performance/src/main/java/org/apache/sling/junit/performance/impl/RunWarmUpFinishedEvents.java
A         testing/junit/performance/src/main/java/org/apache/sling/junit/performance/impl/RunExecutionIterationStartedEvents.java
A         testing/junit/performance/src/main/java/org/apache/sling/junit/performance/impl/RunExecutionStartedEvents.java
A         testing/junit/performance/src/main/java/org/apache/sling/junit/performance/impl/RunSerial.java
A         testing/junit/performance/src/main/java/org/apache/sling/junit/performance/impl/RunExecutionIterationFinishedEvents.java
A         testing/junit/performance/src/main/java/org/apache/sling/junit/performance/impl/RunIterations.java
A         testing/junit/performance/src/main/java/org/apache/sling/junit/performance/impl/RunExecutionFinishedEvents.java
A         testing/junit/performance/src/main/java/org/apache/sling/junit/performance/impl/Listeners.java
A         testing/junit/performance/src/main/java/org/apache/sling/junit/performance/impl/RunAfters.java
A         testing/junit/performance/src/main/java/org/apache/sling/junit/performance/impl/RunBefores.java
A         testing/junit/performance/src/main/java/org/apache/sling/junit/performance/impl/RunWarmUpIterationStartedEvents.java
A         testing/junit/performance/src/main/java/org/apache/sling/junit/performance/listener
A         testing/junit/performance/src/main/java/org/apache/sling/junit/performance/listener/StatisticsListener.java
A         testing/junit/performance/src/main/java/org/apache/sling/junit/performance/runner
A         testing/junit/performance/src/main/java/org/apache/sling/junit/performance/runner/BeforePerformanceTest.java
A         testing/junit/performance/src/main/java/org/apache/sling/junit/performance/runner/Listener.java
A         testing/junit/performance/src/main/java/org/apache/sling/junit/performance/runner/PerformanceRunner.java
A         testing/junit/performance/src/main/java/org/apache/sling/junit/performance/runner/AfterWarmUpIteration.java
A         testing/junit/performance/src/main/java/org/apache/sling/junit/performance/runner/AfterWarmUp.java
A         testing/junit/performance/src/main/java/org/apache/sling/junit/performance/runner/BeforeWarmUpIteration.java
A         testing/junit/performance/src/main/java/org/apache/sling/junit/performance/runner/BeforeWarmUp.java
A         testing/junit/performance/src/main/java/org/apache/sling/junit/performance/runner/Listen.java
A         testing/junit/performance/src/main/java/org/apache/sling/junit/performance/runner/PerformanceTest.java
A         testing/junit/performance/src/main/java/org/apache/sling/junit/performance/runner/AfterPerformanceIteration.java
A         testing/junit/performance/src/main/java/org/apache/sling/junit/performance/runner/AfterPerformanceTest.java
A         testing/junit/performance/src/main/java/org/apache/sling/junit/performance/runner/BeforePerformanceIteration.java
A         testing/junit/performance/src/test
A         testing/junit/performance/src/test/java
A         testing/junit/performance/src/test/java/org
A         testing/junit/performance/src/test/java/org/apache
A         testing/junit/performance/src/test/java/org/apache/sling
A         testing/junit/performance/src/test/java/org/apache/sling/junit
A         testing/junit/performance/src/test/java/org/apache/sling/junit/performance
A         testing/junit/performance/src/test/java/org/apache/sling/junit/performance/runner
A         testing/junit/performance/src/test/java/org/apache/sling/junit/performance/runner/PerformanceRunnerTest.java
A         testing/junit/performance/src/test/java/org/apache/sling/junit/performance/runner/PerformanceRunnerDynamicsTest.java
A         testing/junit/performance/pom.xml
A         testing/junit/healthcheck
A         testing/junit/healthcheck/src
A         testing/junit/healthcheck/src/test
A         testing/junit/healthcheck/src/test/java
A         testing/junit/healthcheck/src/test/java/org
A         testing/junit/healthcheck/src/test/java/org/apache
A         testing/junit/healthcheck/src/test/java/org/apache/sling
A         testing/junit/healthcheck/src/test/java/org/apache/sling/junit
A         testing/junit/healthcheck/src/test/java/org/apache/sling/junit/healthcheck
A         testing/junit/healthcheck/src/test/java/org/apache/sling/junit/healthcheck/impl
AU        testing/junit/healthcheck/src/test/java/org/apache/sling/junit/healthcheck/impl/JUnitTestSelectorTest.java
A         testing/junit/healthcheck/src/main
A         testing/junit/healthcheck/src/main/resources
A         testing/junit/healthcheck/src/main/resources/OSGI-INF
A         testing/junit/healthcheck/src/main/resources/OSGI-INF/metatype
AU        testing/junit/healthcheck/src/main/resources/OSGI-INF/metatype/metatype.properties
A         testing/junit/healthcheck/src/main/java
A         testing/junit/healthcheck/src/main/java/org
A         testing/junit/healthcheck/src/main/java/org/apache
A         testing/junit/healthcheck/src/main/java/org/apache/sling
A         testing/junit/healthcheck/src/main/java/org/apache/sling/junit
A         testing/junit/healthcheck/src/main/java/org/apache/sling/junit/healthcheck
A         testing/junit/healthcheck/src/main/java/org/apache/sling/junit/healthcheck/impl
AU        testing/junit/healthcheck/src/main/java/org/apache/sling/junit/healthcheck/impl/JUnitTestSelector.java
AU        testing/junit/healthcheck/src/main/java/org/apache/sling/junit/healthcheck/impl/JUnitHealthCheck.java
AU        testing/junit/healthcheck/pom.xml
A         testing/pom.xml
A         .mvn
A         .mvn/jvm.config
 U        .
At revision 1672574
Parsing POMs
Modules changed, recalculating dependency graph
maven3-agent.jar already up to date
maven3-interceptor.jar already up to date
maven3-interceptor-commons.jar already up to date
[trunk] $ /jenkins/tools/hudson.model.JDK/jdk-1.8.0/bin/java -Xmx512M -XX:MaxPermSize=256M -enableassertions -cp /jenkins/maven3-agent.jar:/jenkins/tools/hudson.tasks.Maven_MavenInstallation/Maven_3.0.5/boot/plexus-classworlds-2.4.jar org.jvnet.hudson.maven3.agent.Maven3Main /jenkins/tools/hudson.tasks.Maven_MavenInstallation/Maven_3.0.5 /jenkins/slave.jar /jenkins/maven3-interceptor.jar /jenkins/maven3-interceptor-commons.jar 33578
Java HotSpot(TM) 64-Bit Server VM warning: ignoring option MaxPermSize=256M; support was removed in 8.0
<===[JENKINS REMOTING CAPACITY]===>   channel started
Executing Maven:  -B -f <https://builds.apache.org/job/sling-trunk-1.8/ws/trunk/pom.xml> -Dmaven.repo.local=/jenkins/maven-repositories/0 -DobrRepository=false clean install -DHttpTestBase.readyTimeoutSeconds=300
[INFO] Scanning for projects...
[WARNING] 
[WARNING] Some problems were encountered while building the effective model for org.apache.sling:org.apache.sling.discovery.impl:bundle:1.1.1-SNAPSHOT
[WARNING] 'dependencies.dependency.(groupId:artifactId:type:classifier)' must be unique: org.apache.sling:org.apache.sling.testing.tools:jar -> duplicate declaration of version 1.0.2 @ line 259, column 21
[WARNING] 
[WARNING] It is highly recommended to fix these problems because they threaten the stability of your build.
[WARNING] 
[WARNING] For this reason, future Maven versions might no longer support building such malformed projects.
[WARNING] 
[INFO] Searching for slingstart projects...
[ERROR] Unable to determine plugin-based dependencies: No launchpad feature found. -> [Help 1]
[ERROR] 
[ERROR] To see the full stack trace of the errors, re-run Maven with the -e switch.
[ERROR] Re-run Maven using the -X switch to enable full debug logging.
[ERROR] 
[ERROR] For more information about the errors and possible solutions, please read the following articles:
[ERROR] [Help 1] http://cwiki.apache.org/confluence/display/MAVEN/MavenExecutionException
channel stopped

Build failed in Jenkins: sling-trunk-1.8 #956

Posted by Apache Jenkins Server <je...@builds.apache.org>.
See <https://builds.apache.org/job/sling-trunk-1.8/956/changes>

Changes:

[cziegeler] SLING-4598 : Migrate launchpad testing to provisioning model

[cziegeler] SLING-4600 : Migrate launchpad/test-bundles to provisioning model

[cziegeler] SLING-4579 : Regression introduced by SLING-4512 : JCR API used in i18n implementation

------------------------------------------
Started by an SCM change
Building remotely on ubuntu-6 (docker Ubuntu ubuntu) in workspace <https://builds.apache.org/job/sling-trunk-1.8/ws/>
Updating http://svn.apache.org/repos/asf/sling/trunk at revision '2015-04-10T06:55:35.586 +0000'
U         bundles/commons/classloader/pom.xml
U         bundles/commons/logservice/src/test/java/org/apache/sling/commons/logservice/internal/LogSupportTest.java
U         bundles/commons/logservice/src/main/java/org/apache/sling/commons/logservice/internal/Activator.java
U         bundles/commons/logservice/src/main/java/org/apache/sling/commons/logservice/internal/LogSupport.java
U         bundles/jcr/resource/src/main/java/org/apache/sling/jcr/resource/internal/helper/jcr/JcrNodeResourceIterator.java
U         bundles/jcr/resource/src/test/java/org/apache/sling/jcr/resource/internal/helper/JcrNodeResourceIteratorTest.java
U         bundles/extensions/event/src/main/java/org/apache/sling/event/impl/jobs/config/JobManagerConfiguration.java
U         bundles/extensions/event/src/main/java/org/apache/sling/event/impl/jobs/JobManagerImpl.java
U         bundles/extensions/event/src/main/java/org/apache/sling/event/impl/jobs/queues/JobQueueImpl.java
U         bundles/extensions/event/src/main/java/org/apache/sling/event/impl/jobs/tasks/CheckTopologyTask.java
U         bundles/extensions/event/src/main/java/org/apache/sling/event/impl/jobs/stats/TopicStatisticsImpl.java
U         bundles/extensions/event/src/main/java/org/apache/sling/event/impl/jobs/stats/StatisticsManager.java
U         installer/providers/jcr/pom.xml
D         launchpad/slingstart
D         launchpad/builder/src/main/config
D         launchpad/builder/src/main/appended-resources
D         launchpad/builder/src/main/bundles
D         launchpad/builder/src/main/sling
D         launchpad/builder/src/main/assembly
A         launchpad/builder/src/main/provisioning
AU        launchpad/builder/src/main/provisioning/launchpad.txt
AU        launchpad/builder/src/main/provisioning/boot.txt
AU        launchpad/builder/src/main/provisioning/standalone.txt
AU        launchpad/builder/src/main/provisioning/oak.txt
AU        launchpad/builder/src/main/provisioning/jackrabbit.txt
AU        launchpad/builder/src/main/provisioning/sling.txt
U         launchpad/builder/pom.xml
D         launchpad/test-bundles/src/main/bundles
D         launchpad/test-bundles/src/main/java
A         launchpad/test-bundles/src/main/provisioning
AU        launchpad/test-bundles/src/main/provisioning/bundles.txt
U         launchpad/test-bundles/pom.xml
D         launchpad/testing/src/main/config
A         launchpad/testing/src/main/provisioning
AU        launchpad/testing/src/main/provisioning/model.txt
U         launchpad/testing/pom.xml
U         launchpad/integration-tests/pom.xml
D         contrib/extensions/validation/org.apache.sling.validation
U         contrib/extensions/i18n/src/main/java/org/apache/sling/i18n/impl/JcrResourceBundle.java
U         contrib/extensions/i18n/src/test/java/org/apache/sling/i18n/impl/JcrResourceBundleTest.java
U         contrib/scripting/sightly/testing-content/src/main/resources/SLING-INF/apps/sightly/scripts/useinheritance.json
U         contrib/scripting/sightly/testing/pom.xml
U         contrib/scripting/sightly/js-use-provider/pom.xml
U         contrib/scripting/sightly/js-use-provider/src/main/java/org/apache/sling/scripting/sightly/js/impl/JsEnvironment.java
U         tooling/maven/slingstart-maven-plugin/src/main/resources/META-INF/plexus/components.xml
U         tooling/maven/slingstart-maven-plugin/src/main/java/org/apache/sling/maven/slingstart/DependencyLifecycleParticipant.java
At revision 1672563
Parsing POMs
Modules changed, recalculating dependency graph
maven3-agent.jar already up to date
maven3-interceptor.jar already up to date
maven3-interceptor-commons.jar already up to date
[trunk] $ /home/jenkins/jenkins-slave/tools/hudson.model.JDK/jdk-1.8.0/bin/java -Xmx512M -XX:MaxPermSize=256M -enableassertions -cp /home/jenkins/jenkins-slave/maven3-agent.jar:/home/jenkins/jenkins-slave/tools/hudson.tasks.Maven_MavenInstallation/Maven_3.0.5/boot/plexus-classworlds-2.4.jar org.jvnet.hudson.maven3.agent.Maven3Main /home/jenkins/jenkins-slave/tools/hudson.tasks.Maven_MavenInstallation/Maven_3.0.5 /home/jenkins/jenkins-slave/slave.jar /home/jenkins/jenkins-slave/maven3-interceptor.jar /home/jenkins/jenkins-slave/maven3-interceptor-commons.jar 56285
Java HotSpot(TM) 64-Bit Server VM warning: ignoring option MaxPermSize=256M; support was removed in 8.0
<===[JENKINS REMOTING CAPACITY]===>   channel started
Executing Maven:  -B -f <https://builds.apache.org/job/sling-trunk-1.8/ws/trunk/pom.xml> -Dmaven.repo.local=/home/jenkins/jenkins-slave/maven-repositories/0 -DobrRepository=false clean install -DHttpTestBase.readyTimeoutSeconds=300
[INFO] Scanning for projects...
Downloading: http://repository.apache.org/snapshots/org/apache/sling/slingstart-maven-plugin/1.0.5-SNAPSHOT/maven-metadata.xml
Downloaded: http://repository.apache.org/snapshots/org/apache/sling/slingstart-maven-plugin/1.0.5-SNAPSHOT/maven-metadata.xml (1011 B at 3.1 KB/sec)
Downloading: http://repository.apache.org/snapshots/org/apache/sling/slingstart-maven-plugin/1.0.5-SNAPSHOT/slingstart-maven-plugin-1.0.5-20150409.140740-126.pom
Downloaded: http://repository.apache.org/snapshots/org/apache/sling/slingstart-maven-plugin/1.0.5-SNAPSHOT/slingstart-maven-plugin-1.0.5-20150409.140740-126.pom (7 KB at 77.0 KB/sec)
Downloading: http://repository.apache.org/snapshots/org/apache/sling/slingstart-maven-plugin/1.0.5-SNAPSHOT/slingstart-maven-plugin-1.0.5-20150409.140740-126.jar
Downloaded: http://repository.apache.org/snapshots/org/apache/sling/slingstart-maven-plugin/1.0.5-SNAPSHOT/slingstart-maven-plugin-1.0.5-20150409.140740-126.jar (76 KB at 459.0 KB/sec)
[WARNING] 
[WARNING] Some problems were encountered while building the effective model for org.apache.sling:org.apache.sling.discovery.impl:bundle:1.1.1-SNAPSHOT
[WARNING] 'dependencies.dependency.(groupId:artifactId:type:classifier)' must be unique: org.apache.sling:org.apache.sling.testing.tools:jar -> duplicate declaration of version 1.0.2 @ line 259, column 21
[WARNING] 
[WARNING] It is highly recommended to fix these problems because they threaten the stability of your build.
[WARNING] 
[WARNING] For this reason, future Maven versions might no longer support building such malformed projects.
[WARNING] 
[INFO] Searching for slingstart projects...
[ERROR] Unable to determine plugin-based dependencies: No launchpad feature found. -> [Help 1]
[ERROR] 
[ERROR] To see the full stack trace of the errors, re-run Maven with the -e switch.
[ERROR] Re-run Maven using the -X switch to enable full debug logging.
[ERROR] 
[ERROR] For more information about the errors and possible solutions, please read the following articles:
[ERROR] [Help 1] http://cwiki.apache.org/confluence/display/MAVEN/MavenExecutionException
channel stopped

Build failed in Jenkins: sling-trunk-1.8 #955

Posted by Apache Jenkins Server <je...@builds.apache.org>.
See <https://builds.apache.org/job/sling-trunk-1.8/955/changes>

Changes:

[radu] [maven-release-plugin] prepare for next development iteration

[radu] [maven-release-plugin] prepare release org.apache.sling.scripting.sightly.testing-1.0.4

[radu] [maven-release-plugin] prepare for next development iteration

[radu] [maven-release-plugin] prepare release org.apache.sling.scripting.sightly.testing-content-1.0.4

[radu] releng: prepare sightly dependencies pre-release

[radu] [maven-release-plugin] prepare for next development iteration

[radu] [maven-release-plugin] prepare release org.apache.sling.scripting.sightly.js.provider-1.0.4

------------------------------------------
Started by an SCM change
Building remotely on H10 (Ubuntu ubuntu) in workspace <https://builds.apache.org/job/sling-trunk-1.8/ws/>
Updating http://svn.apache.org/repos/asf/sling/trunk at revision '2015-04-09T16:42:10.394 +0000'
U         launchpad/testing/pom.xml
U         contrib/scripting/sightly/testing-content/src/main/resources/SLING-INF/apps/sightly/scripts/useinheritance.json
U         contrib/scripting/sightly/testing/pom.xml
U         contrib/scripting/sightly/js-use-provider/src/main/java/org/apache/sling/scripting/sightly/js/impl/JsEnvironment.java
U         contrib/scripting/sightly/js-use-provider/pom.xml
At revision 1672419
Parsing POMs
Modules changed, recalculating dependency graph
maven3-agent.jar already up to date
maven3-interceptor.jar already up to date
maven3-interceptor-commons.jar already up to date
[trunk] $ /home/jenkins/jenkins-slave/tools/hudson.model.JDK/jdk-1.8.0/bin/java -Xmx512M -XX:MaxPermSize=256M -enableassertions -cp /home/jenkins/jenkins-slave/maven3-agent.jar:/home/jenkins/jenkins-slave/tools/hudson.tasks.Maven_MavenInstallation/Maven_3.0.5/boot/plexus-classworlds-2.4.jar org.jvnet.hudson.maven3.agent.Maven3Main /home/jenkins/jenkins-slave/tools/hudson.tasks.Maven_MavenInstallation/Maven_3.0.5 /home/jenkins/jenkins-slave/slave.jar /home/jenkins/jenkins-slave/maven3-interceptor.jar /home/jenkins/jenkins-slave/maven3-interceptor-commons.jar 41767
Java HotSpot(TM) 64-Bit Server VM warning: ignoring option MaxPermSize=256M; support was removed in 8.0
<===[JENKINS REMOTING CAPACITY]===>   channel started
Executing Maven:  -B -f <https://builds.apache.org/job/sling-trunk-1.8/ws/trunk/pom.xml> -Dmaven.repo.local=/home/jenkins/jenkins-slave/maven-repositories/0 -DobrRepository=false clean install -DHttpTestBase.readyTimeoutSeconds=300
[INFO] Scanning for projects...
[WARNING] 
[WARNING] Some problems were encountered while building the effective model for org.apache.sling:org.apache.sling.discovery.impl:bundle:1.1.1-SNAPSHOT
[WARNING] 'dependencies.dependency.(groupId:artifactId:type:classifier)' must be unique: org.apache.sling:org.apache.sling.testing.tools:jar -> duplicate declaration of version 1.0.2 @ line 259, column 21
[WARNING] 
[WARNING] It is highly recommended to fix these problems because they threaten the stability of your build.
[WARNING] 
[WARNING] For this reason, future Maven versions might no longer support building such malformed projects.
[WARNING] 
[INFO] Searching for slingstart projects...
[ERROR] Unable to determine plugin-based dependencies: No model files found in <https://builds.apache.org/job/sling-trunk-1.8/ws/trunk/launchpad/test-bundles/src/main/provisioning> -> [Help 1]
[ERROR] 
[ERROR] To see the full stack trace of the errors, re-run Maven with the -e switch.
[ERROR] Re-run Maven using the -X switch to enable full debug logging.
[ERROR] 
[ERROR] For more information about the errors and possible solutions, please read the following articles:
[ERROR] [Help 1] http://cwiki.apache.org/confluence/display/MAVEN/MavenExecutionException
channel stopped