You are viewing a plain text version of this content. The canonical link for it is here.
Posted to dev@synapse.apache.org by Apache Jenkins Server <je...@builds.apache.org> on 2011/08/02 11:04:51 UTC
Build failed in Jenkins: Synapse - Trunk #3871
See <https://builds.apache.org/job/Synapse%20-%20Trunk/3871/changes>
Changes:
[supun] deleting the endpoints, since using the transport URL endpoints
[supun] using the url endpoints from transports project
------------------------------------------
[...truncated 2648 lines...]
[WARNING] import org.apache.axis2.transport.base.endpoint.URLEndpointsConfiguration;
[WARNING] ^
[WARNING] <https://builds.apache.org/job/Synapse%20-%20Trunk/ws/java/modules/transports/core/nhttp/src/main/java/org/apache/synapse/transport/nhttp/ListenerContext.java>:31: package org.apache.axis2.transport.base.endpoint.config does not exist
[WARNING] import org.apache.axis2.transport.base.endpoint.config.URLEndpointsConfigurationFactory;
[WARNING] ^
[WARNING] <https://builds.apache.org/job/Synapse%20-%20Trunk/ws/java/modules/transports/core/nhttp/src/main/java/org/apache/synapse/transport/nhttp/ListenerContext.java>:87: cannot find symbol
[WARNING] symbol : class URLEndpointsConfiguration
[WARNING] location: class org.apache.synapse.transport.nhttp.ListenerContext
[WARNING] private URLEndpointsConfiguration endpoints = null;
[WARNING] ^
[WARNING] <https://builds.apache.org/job/Synapse%20-%20Trunk/ws/java/modules/transports/core/nhttp/src/main/java/org/apache/synapse/transport/nhttp/ListenerContext.java>:316: cannot find symbol
[WARNING] symbol : class URLEndpointsConfiguration
[WARNING] location: class org.apache.synapse.transport.nhttp.ListenerContext
[WARNING] public URLEndpointsConfiguration getEndpoints() {
[WARNING] ^
[WARNING] <https://builds.apache.org/job/Synapse%20-%20Trunk/ws/java/modules/transports/core/nhttp/src/main/java/org/apache/synapse/transport/nhttp/ServerWorker.java>:33: package org.apache.axis2.transport.base.endpoint does not exist
[WARNING] import org.apache.axis2.transport.base.endpoint.URLEndpoint;
[WARNING] ^
[WARNING] <https://builds.apache.org/job/Synapse%20-%20Trunk/ws/java/modules/transports/core/nhttp/src/main/java/org/apache/synapse/transport/nhttp/ServerWorker.java>:34: package org.apache.axis2.transport.base.endpoint does not exist
[WARNING] import org.apache.axis2.transport.base.endpoint.URLEndpointsConfiguration;
[WARNING] ^
[WARNING] <https://builds.apache.org/job/Synapse%20-%20Trunk/ws/java/modules/transports/core/nhttp/src/main/java/org/apache/synapse/transport/nhttp/ServerWorker.java>:86: cannot find symbol
[WARNING] symbol : class URLEndpointsConfiguration
[WARNING] location: class org.apache.synapse.transport.nhttp.ServerWorker
[WARNING] private URLEndpointsConfiguration endpointsConfiguration = null;
[WARNING] ^
[WARNING] <https://builds.apache.org/job/Synapse%20-%20Trunk/ws/java/modules/transports/core/nhttp/src/main/java/org/apache/synapse/transport/nhttp/HttpCoreNIOSSLListener.java>:65: warning - @return tag has no arguments.
[WARNING] <https://builds.apache.org/job/Synapse%20-%20Trunk/ws/java/modules/core/src/main/java/org/apache/synapse/message/processors/MessageProcessor.java>:67: warning - @return tag has no arguments.
[WARNING] <https://builds.apache.org/job/Synapse%20-%20Trunk/ws/java/modules/core/src/main/java/org/apache/synapse/message/processors/MessageProcessor.java>:73: warning - @return tag has no arguments.
[WARNING] <https://builds.apache.org/job/Synapse%20-%20Trunk/ws/java/modules/core/src/main/java/org/apache/synapse/message/processors/forward/MessageForwardingProcessorViewMBean.java>:50: warning - @return tag cannot be used in method with void return type.
[WARNING] <https://builds.apache.org/job/Synapse%20-%20Trunk/ws/java/modules/core/src/main/java/org/apache/synapse/message/processors/forward/ScheduledMessageForwardingProcessor.java>:147: warning - @return tag has no arguments.
[WARNING] <https://builds.apache.org/job/Synapse%20-%20Trunk/ws/java/modules/core/src/main/java/org/apache/synapse/message/processors/sampler/SamplingProcessorViewMBean.java>:41: warning - @return tag has no arguments.
[WARNING] <https://builds.apache.org/job/Synapse%20-%20Trunk/ws/java/modules/core/src/main/java/org/apache/synapse/eventing/builders/ResponseMessageBuilder.java>:258: warning - @return tag has no arguments.
[WARNING] <https://builds.apache.org/job/Synapse%20-%20Trunk/ws/java/modules/core/src/main/java/org/apache/synapse/eventing/builders/ResponseMessageBuilder.java>:207: warning - @return tag has no arguments.
[WARNING] <https://builds.apache.org/job/Synapse%20-%20Trunk/ws/java/modules/core/src/main/java/org/apache/synapse/eventing/builders/ResponseMessageBuilder.java>:167: warning - @return tag has no arguments.
[WARNING] <https://builds.apache.org/job/Synapse%20-%20Trunk/ws/java/modules/core/src/main/java/org/apache/synapse/eventing/builders/ResponseMessageBuilder.java>:87: warning - @return tag has no arguments.
[WARNING] <https://builds.apache.org/job/Synapse%20-%20Trunk/ws/java/modules/core/src/main/java/org/apache/synapse/eventing/builders/ResponseMessageBuilder.java>:133: warning - @return tag has no arguments.
[WARNING] <https://builds.apache.org/job/Synapse%20-%20Trunk/ws/java/modules/core/src/main/java/org/apache/synapse/endpoints/Endpoint.java>:125: warning - @param argument "onFaultMessageStore," is not a parameter name.
[WARNING] <https://builds.apache.org/job/Synapse%20-%20Trunk/ws/java/modules/core/src/main/java/org/apache/synapse/config/xml/ConfigurationFactoryAndSerializerFinder.java>:179: warning - @return tag has no arguments.
[WARNING] <https://builds.apache.org/job/Synapse%20-%20Trunk/ws/java/modules/core/src/main/java/org/apache/synapse/config/xml/endpoints/EndpointFactory.java>:285: warning - @return tag has no arguments.
[WARNING] <https://builds.apache.org/job/Synapse%20-%20Trunk/ws/java/modules/core/src/main/java/org/apache/synapse/util/jaxp/ResultBuilder.java>:43: warning - Tag @link: can't find getNode() in org.apache.synapse.util.jaxp.ResultBuilder
[WARNING] <https://builds.apache.org/job/Synapse%20-%20Trunk/ws/java/modules/core/src/main/java/org/apache/synapse/util/jaxp/ResultBuilderFactory.java>:48: warning - Tag @link: can't find getNode() in org.apache.synapse.util.jaxp.ResultBuilder
[WARNING] <https://builds.apache.org/job/Synapse%20-%20Trunk/ws/java/modules/samples/src/main/java/samples/common/StockQuoteHandler.java>:329: warning - @return tag has no arguments.
[WARNING] <https://builds.apache.org/job/Synapse%20-%20Trunk/ws/java/modules/samples/src/main/java/samples/common/StockQuoteHandler.java>:242: warning - @return tag has no arguments.
[WARNING] <https://builds.apache.org/job/Synapse%20-%20Trunk/ws/java/modules/samples/src/main/java/samples/common/StockQuoteHandler.java>:181: warning - @return tag has no arguments.
[WARNING] <https://builds.apache.org/job/Synapse%20-%20Trunk/ws/java/modules/xar-maven-plugin/src/main/java/org/apache/synapse/maven/xar/AbstractXarMojo.java>:97: warning - @parameter is an unknown tag.
[WARNING] <https://builds.apache.org/job/Synapse%20-%20Trunk/ws/java/modules/xar-maven-plugin/src/main/java/org/apache/synapse/maven/xar/AbstractXarMojo.java>:97: warning - @required is an unknown tag.
[WARNING] <https://builds.apache.org/job/Synapse%20-%20Trunk/ws/java/modules/xar-maven-plugin/src/main/java/org/apache/synapse/maven/xar/AbstractXarMojo.java>:97: warning - @readonly is an unknown tag.
[WARNING] <https://builds.apache.org/job/Synapse%20-%20Trunk/ws/java/modules/xar-maven-plugin/src/main/java/org/apache/synapse/maven/xar/XarExplodedMojo.java>:37: warning - @goal is an unknown tag.
[WARNING] <https://builds.apache.org/job/Synapse%20-%20Trunk/ws/java/modules/xar-maven-plugin/src/main/java/org/apache/synapse/maven/xar/XarExplodedMojo.java>:37: warning - @phase is an unknown tag.
[WARNING] <https://builds.apache.org/job/Synapse%20-%20Trunk/ws/java/modules/xar-maven-plugin/src/main/java/org/apache/synapse/maven/xar/XarExplodedMojo.java>:37: warning - @requiresDependencyResolution is an unknown tag.
[WARNING] <https://builds.apache.org/job/Synapse%20-%20Trunk/ws/java/modules/xar-maven-plugin/src/main/java/org/apache/synapse/maven/xar/XarMojo.java>:39: warning - @goal is an unknown tag.
[WARNING] <https://builds.apache.org/job/Synapse%20-%20Trunk/ws/java/modules/xar-maven-plugin/src/main/java/org/apache/synapse/maven/xar/XarMojo.java>:39: warning - @phase is an unknown tag.
[WARNING] <https://builds.apache.org/job/Synapse%20-%20Trunk/ws/java/modules/xar-maven-plugin/src/main/java/org/apache/synapse/maven/xar/XarMojo.java>:39: warning - @requiresDependencyResolution is an unknown tag.
[WARNING] <https://builds.apache.org/job/Synapse%20-%20Trunk/ws/java/modules/transports/core/pipe/src/main/java/org/apache/synapse/transport/pipe/package-info.java>:63: warning - Tag @link: reference not found: org.apache.synapse.transport.base.ManagementSupport
[INFO] Generating "Project License" report.
[INFO] Generating "Dependency Convergence" report.
[INFO] Generating "Source Repository" report.
[INFO] Generating "Continuous Integration" report.
[INFO] Generating "Plugin Management" report.
[INFO] Generating "Issue Tracking" report.
[INFO] Generating "Project Team" report.
[INFO] Generating "Mailing Lists" report.
[INFO] Generating "Project Plugins" report.
[INFO] Generating "Project Summary" report.
[INFO] Generating "Dependency Management" report.
[INFO] Generating "Dependencies" report.
[FINDBUGS] Using set difference to compute new warnings
[FINDBUGS] Not changing build status, since no threshold has been exceeded
[JENKINS] Archiving site from <https://builds.apache.org/job/Synapse%20-%20Trunk/ws/java/target/site> to /home/hudson/hudson/jobs/Synapse - Trunk/site
[JENKINS] Archiving <https://builds.apache.org/job/Synapse%20-%20Trunk/ws/java/pom.xml> to /home/hudson/hudson/jobs/Synapse - Trunk/modules/org.apache.synapse$Apache-Synapse/builds/2011-08-02_09-00-56/archive/org.apache.synapse/Apache-Synapse/2.1.0-SNAPSHOT/Apache-Synapse-2.1.0-SNAPSHOT.pom
[INFO] ------------------------------------------------------------------------
[INFO] Building Apache Synapse - Commons classes
[INFO] task-segment: [clean, install, site]
[INFO] ------------------------------------------------------------------------
[INFO] [clean:clean {execution: default-clean}]
[INFO] Deleting directory <https://builds.apache.org/job/Synapse%20-%20Trunk/ws/java/modules/commons/target>
[INFO] [remote-resources:process {execution: default}]
[INFO] [resources:resources {execution: default-resources}]
[INFO] Using encoding: 'UTF-8' to copy filtered resources.
[INFO] [compiler:compile {execution: default-compile}]
Compiling 82 source files to <https://builds.apache.org/job/Synapse%20-%20Trunk/ws/java/modules/commons/target/classes>
[INFO] [resources:testResources {execution: default-testResources}]
[INFO] Using encoding: 'UTF-8' to copy filtered resources.
[INFO] [compiler:testCompile {execution: default-testCompile}]
Compiling 11 source files to <https://builds.apache.org/job/Synapse%20-%20Trunk/ws/java/modules/commons/target/test-classes>
[INFO] [surefire:test {execution: default-test}]
[INFO] Surefire report directory: <https://builds.apache.org/job/Synapse%20-%20Trunk/ws/java/modules/commons/target/surefire-reports>
-------------------------------------------------------
T E S T S
-------------------------------------------------------
Running org.apache.synapse.commons.evaluators.source.SourceTextRetrieverTest
log4j:WARN No appenders could be found for logger (org.apache.axiom.om.util.StAXUtils).
log4j:WARN Please initialize the log4j system properly.
Tests run: 5, Failures: 0, Errors: 0, Skipped: 0, Time elapsed: 0.218 sec
Running org.apache.synapse.commons.executors.queues.FixedQueueTest
Tests run: 6, Failures: 0, Errors: 0, Skipped: 0, Time elapsed: 0.009 sec
Running org.apache.synapse.util.TemporaryDataTest
Tests run: 5, Failures: 0, Errors: 0, Skipped: 0, Time elapsed: 0.04 sec
Running org.apache.synapse.commons.evaluators.config.MatchBuilderTest
Tests run: 4, Failures: 0, Errors: 0, Skipped: 0, Time elapsed: 0.008 sec
Running org.apache.synapse.commons.evaluators.config.MatchSerializerTest
Tests run: 4, Failures: 0, Errors: 0, Skipped: 0, Time elapsed: 0.189 sec
Running org.apache.synapse.commons.evaluators.config.EqualSerializerTest
Tests run: 4, Failures: 0, Errors: 0, Skipped: 0, Time elapsed: 0.015 sec
Running org.apache.synapse.commons.evaluators.config.EqualBuilderTest
Tests run: 4, Failures: 0, Errors: 0, Skipped: 0, Time elapsed: 0.007 sec
Running org.apache.synapse.commons.executors.MultiPriorityBlockingQueueTest
Tests run: 8, Failures: 0, Errors: 0, Skipped: 0, Time elapsed: 0.321 sec
Running org.apache.synapse.commons.executors.MultiPriorityBlockingQueueStressTest
Tests run: 5, Failures: 0, Errors: 0, Skipped: 0, Time elapsed: 0.191 sec
Results :
Tests run: 45, Failures: 0, Errors: 0, Skipped: 0
[JENKINS] Recording test results
[INFO] [bundle:bundle {execution: default-bundle}]
[INFO] [install:install {execution: default-install}]
[INFO] Installing <https://builds.apache.org/job/Synapse%20-%20Trunk/ws/java/modules/commons/target/synapse-commons-2.1.0-SNAPSHOT.jar> to <https://builds.apache.org/job/Synapse%20-%20Trunk/ws/.repository/org/apache/synapse/synapse-commons/2.1.0-SNAPSHOT/synapse-commons-2.1.0-SNAPSHOT.jar>
[INFO] [bundle:install {execution: default-install}]
[INFO] Parsing <https://builds.apache.org/job/Synapse%20-%20Trunk/ws/.repository/repository.xml>
[INFO] Installing org/apache/synapse/synapse-commons/2.1.0-SNAPSHOT/synapse-commons-2.1.0-SNAPSHOT.jar
[INFO] Writing OBR metadata
[INFO] [site:site {execution: default-site}]
[INFO] Unable to load parent project from a relative path: Could not find the model file '<https://builds.apache.org/job/Synapse%20-%20Trunk/ws/java/../pom.xml'.> for project unknown
[INFO] Parent project loaded from repository.
[INFO] Generating "Project License" report.
[INFO] Generating "Dependency Convergence" report.
[INFO] Generating "Source Repository" report.
[INFO] Generating "Continuous Integration" report.
[INFO] Generating "Plugin Management" report.
[INFO] Generating "Issue Tracking" report.
[INFO] Generating "Project Team" report.
[INFO] Generating "Mailing Lists" report.
[INFO] Generating "About" report.
[INFO] Generating "Project Plugins" report.
[INFO] Generating "Project Summary" report.
[INFO] Generating "Dependency Management" report.
[INFO] Generating "Dependencies" report.
[FINDBUGS] Using set difference to compute new warnings
[FINDBUGS] Not changing build status, since no threshold has been exceeded
[JENKINS] Archiving site from <https://builds.apache.org/job/Synapse%20-%20Trunk/ws/java/modules/commons/target/site> to /home/hudson/hudson/jobs/Synapse - Trunk/site/synapse-commons
[JENKINS] Archiving <https://builds.apache.org/job/Synapse%20-%20Trunk/ws/java/modules/commons/pom.xml> to /home/hudson/hudson/jobs/Synapse - Trunk/modules/org.apache.synapse$synapse-commons/builds/2011-08-02_09-00-56/archive/org.apache.synapse/synapse-commons/2.1.0-SNAPSHOT/synapse-commons-2.1.0-SNAPSHOT.pom
[JENKINS] Archiving <https://builds.apache.org/job/Synapse%20-%20Trunk/ws/java/modules/commons/target/synapse-commons-2.1.0-SNAPSHOT.jar> to /home/hudson/hudson/jobs/Synapse - Trunk/modules/org.apache.synapse$synapse-commons/builds/2011-08-02_09-00-56/archive/org.apache.synapse/synapse-commons/2.1.0-SNAPSHOT/synapse-commons-2.1.0-SNAPSHOT.jar
[INFO] ------------------------------------------------------------------------
[INFO] Building Apache Synapse - Transports
[INFO] task-segment: [clean, install, site]
[INFO] ------------------------------------------------------------------------
[INFO] [clean:clean {execution: default-clean}]
[INFO] Deleting directory <https://builds.apache.org/job/Synapse%20-%20Trunk/ws/java/modules/transports/target>
[INFO] [remote-resources:process {execution: default}]
[INFO] [site:attach-descriptor {execution: default-attach-descriptor}]
[INFO] [install:install {execution: default-install}]
[INFO] Installing <https://builds.apache.org/job/Synapse%20-%20Trunk/ws/java/modules/transports/pom.xml> to <https://builds.apache.org/job/Synapse%20-%20Trunk/ws/.repository/org/apache/synapse/synapse-transports/2.1.0-SNAPSHOT/synapse-transports-2.1.0-SNAPSHOT.pom>
[INFO] [site:site {execution: default-site}]
[INFO] Unable to load parent project from a relative path: Could not find the model file '<https://builds.apache.org/job/Synapse%20-%20Trunk/ws/java/../pom.xml'.> for project unknown
[INFO] Parent project loaded from repository.
[INFO] Generating "Project License" report.
[INFO] Generating "Dependency Convergence" report.
[INFO] Generating "Source Repository" report.
[INFO] Generating "Continuous Integration" report.
[INFO] Generating "Plugin Management" report.
[INFO] Generating "Issue Tracking" report.
[INFO] Generating "Project Team" report.
[INFO] Generating "Mailing Lists" report.
[INFO] Generating "About" report.
[INFO] Generating "Project Plugins" report.
[INFO] Generating "Project Summary" report.
[INFO] Generating "Dependency Management" report.
[INFO] Generating "Dependencies" report.
[FINDBUGS] Using set difference to compute new warnings
[FINDBUGS] Not changing build status, since no threshold has been exceeded
[JENKINS] Archiving site from <https://builds.apache.org/job/Synapse%20-%20Trunk/ws/java/modules/transports/target/site> to /home/hudson/hudson/jobs/Synapse - Trunk/site/synapse-transports
[JENKINS] Archiving <https://builds.apache.org/job/Synapse%20-%20Trunk/ws/java/modules/transports/pom.xml> to /home/hudson/hudson/jobs/Synapse - Trunk/modules/org.apache.synapse$synapse-transports/builds/2011-08-02_09-00-56/archive/org.apache.synapse/synapse-transports/2.1.0-SNAPSHOT/synapse-transports-2.1.0-SNAPSHOT.pom
[INFO] ------------------------------------------------------------------------
[INFO] Building Apache Synapse - Non-blocking HTTP/s Transport
[INFO] task-segment: [clean, install, site]
[INFO] ------------------------------------------------------------------------
[INFO] [clean:clean {execution: default-clean}]
[INFO] Deleting directory <https://builds.apache.org/job/Synapse%20-%20Trunk/ws/java/modules/transports/core/nhttp/target>
[INFO] [remote-resources:process {execution: default}]
[INFO] [resources:resources {execution: default-resources}]
[INFO] Using encoding: 'UTF-8' to copy filtered resources.
[INFO] [compiler:compile {execution: default-compile}]
Compiling 42 source files to <https://builds.apache.org/job/Synapse%20-%20Trunk/ws/java/modules/transports/core/nhttp/target/classes>
[JENKINS] Archiving <https://builds.apache.org/job/Synapse%20-%20Trunk/ws/java/modules/transports/core/nhttp/pom.xml> to /home/hudson/hudson/jobs/Synapse - Trunk/modules/org.apache.synapse$synapse-nhttp-transport/builds/2011-08-02_09-00-56/archive/org.apache.synapse/synapse-nhttp-transport/2.1.0-SNAPSHOT/synapse-nhttp-transport-2.1.0-SNAPSHOT.pom
[INFO] ------------------------------------------------------------------------
[ERROR] BUILD FAILURE
[INFO] ------------------------------------------------------------------------
[INFO] Compilation failure
<https://builds.apache.org/job/Synapse%20-%20Trunk/ws/java/modules/transports/core/nhttp/src/main/java/org/apache/synapse/transport/nhttp/ListenerContext.java>:[30,48] package org.apache.axis2.transport.base.endpoint does not exist
<https://builds.apache.org/job/Synapse%20-%20Trunk/ws/java/modules/transports/core/nhttp/src/main/java/org/apache/synapse/transport/nhttp/ListenerContext.java>:[31,55] package org.apache.axis2.transport.base.endpoint.config does not exist
<https://builds.apache.org/job/Synapse%20-%20Trunk/ws/java/modules/transports/core/nhttp/src/main/java/org/apache/synapse/transport/nhttp/ListenerContext.java>:[87,12] cannot find symbol
symbol : class URLEndpointsConfiguration
location: class org.apache.synapse.transport.nhttp.ListenerContext
<https://builds.apache.org/job/Synapse%20-%20Trunk/ws/java/modules/transports/core/nhttp/src/main/java/org/apache/synapse/transport/nhttp/ListenerContext.java>:[316,11] cannot find symbol
symbol : class URLEndpointsConfiguration
location: class org.apache.synapse.transport.nhttp.ListenerContext
<https://builds.apache.org/job/Synapse%20-%20Trunk/ws/java/modules/transports/core/nhttp/src/main/java/org/apache/synapse/transport/nhttp/ServerWorker.java>:[33,48] package org.apache.axis2.transport.base.endpoint does not exist
<https://builds.apache.org/job/Synapse%20-%20Trunk/ws/java/modules/transports/core/nhttp/src/main/java/org/apache/synapse/transport/nhttp/ServerWorker.java>:[34,48] package org.apache.axis2.transport.base.endpoint does not exist
<https://builds.apache.org/job/Synapse%20-%20Trunk/ws/java/modules/transports/core/nhttp/src/main/java/org/apache/synapse/transport/nhttp/ServerWorker.java>:[86,12] cannot find symbol
symbol : class URLEndpointsConfiguration
location: class org.apache.synapse.transport.nhttp.ServerWorker
<https://builds.apache.org/job/Synapse%20-%20Trunk/ws/java/modules/transports/core/nhttp/src/main/java/org/apache/synapse/transport/nhttp/ListenerContext.java>:[160,28] cannot find symbol
symbol : class URLEndpointsConfigurationFactory
location: class org.apache.synapse.transport.nhttp.ListenerContext
<https://builds.apache.org/job/Synapse%20-%20Trunk/ws/java/modules/transports/core/nhttp/src/main/java/org/apache/synapse/transport/nhttp/ServerWorker.java>:[409,16] cannot find symbol
symbol : class URLEndpoint
location: class org.apache.synapse.transport.nhttp.ServerWorker
<https://builds.apache.org/job/Synapse%20-%20Trunk/ws/java/modules/transports/core/nhttp/src/main/java/org/apache/synapse/transport/nhttp/ServerWorker.java>:[493,16] cannot find symbol
symbol : class URLEndpoint
location: class org.apache.synapse.transport.nhttp.ServerWorker
[INFO] ------------------------------------------------------------------------
[INFO] For more information, run Maven with the -e switch
[INFO] ------------------------------------------------------------------------
[INFO] Total time: 3 minutes 13 seconds
[INFO] Finished at: Tue Aug 02 09:04:50 UTC 2011
[INFO] Final Memory: 85M/185M
[INFO] ------------------------------------------------------------------------
[FINDBUGS] Aggregating results of Apache Synapse - Secure vault
[FINDBUGS] Using set difference to compute new warnings
[FINDBUGS] Not changing build status, since no threshold has been exceeded
[FINDBUGS] Aggregating results of Apache Synapse
[FINDBUGS] Using set difference to compute new warnings
[FINDBUGS] Not changing build status, since no threshold has been exceeded
[FINDBUGS] Aggregating results of Apache Synapse - Commons classes
[FINDBUGS] Using set difference to compute new warnings
[FINDBUGS] Not changing build status, since no threshold has been exceeded
[FINDBUGS] Aggregating results of Apache Synapse - Transports
[FINDBUGS] Using set difference to compute new warnings
[FINDBUGS] Not changing build status, since no threshold has been exceeded
Sending e-mails to: dev@synapse.apache.org
channel stopped
[locks-and-latches] Releasing all the locks
[locks-and-latches] All the locks released
---------------------------------------------------------------------
To unsubscribe, e-mail: dev-unsubscribe@synapse.apache.org
For additional commands, e-mail: dev-help@synapse.apache.org
Jenkins build is back to normal : Synapse - Trunk #3873
Posted by Apache Jenkins Server <je...@builds.apache.org>.
See <https://builds.apache.org/job/Synapse%20-%20Trunk/3873/>
---------------------------------------------------------------------
To unsubscribe, e-mail: dev-unsubscribe@synapse.apache.org
For additional commands, e-mail: dev-help@synapse.apache.org
Build failed in Jenkins: Synapse - Trunk #3872
Posted by Apache Jenkins Server <je...@builds.apache.org>.
See <https://builds.apache.org/job/Synapse%20-%20Trunk/3872/>
------------------------------------------
[...truncated 3097 lines...]
[INFO] Copying addressing-1.7.0-SNAPSHOT.mar to <https://builds.apache.org/job/Synapse%20-%20Trunk/ws/java/modules/core/target/test_repos/synapse/modules/addressing-1.7.0-SNAPSHOT.mar>
[INFO] [antrun:run {execution: create_repo}]
[INFO] Executing tasks
[echo] *** Creating a testing repository ***
[mkdir] Created dir: <https://builds.apache.org/job/Synapse%20-%20Trunk/ws/java/modules/core/target/test_repos/synapse/services>
[mkdir] Created dir: <https://builds.apache.org/job/Synapse%20-%20Trunk/ws/java/modules/core/target/test_repos/client/modules>
[INFO] Executed tasks
[INFO] [resources:testResources {execution: default-testResources}]
[INFO] Using encoding: 'UTF-8' to copy filtered resources.
[INFO] [compiler:testCompile {execution: default-testCompile}]
Compiling 90 source files to <https://builds.apache.org/job/Synapse%20-%20Trunk/ws/java/modules/core/target/test-classes>
[INFO] [surefire:test {execution: default-test}]
[INFO] Surefire report directory: <https://builds.apache.org/job/Synapse%20-%20Trunk/ws/java/modules/core/target/surefire-reports>
-------------------------------------------------------
T E S T S
-------------------------------------------------------
Running org.apache.synapse.config.xml.HeaderMediatorConfigurationTest
Tests run: 4, Failures: 0, Errors: 0, Skipped: 0, Time elapsed: 0.126 sec
Running org.apache.synapse.config.xml.IterateMediatorSerializationTest
Tests run: 6, Failures: 0, Errors: 0, Skipped: 0, Time elapsed: 0.402 sec
Running org.apache.synapse.mediators.ext.ClassMediatorTest
Tests run: 4, Failures: 0, Errors: 0, Skipped: 0, Time elapsed: 0.169 sec
Running org.apache.synapse.mediators.TestMediator
Tests run: 0, Failures: 0, Errors: 0, Skipped: 0, Time elapsed: 0.009 sec
Running org.apache.synapse.TestMessageContextBuilder
Tests run: 0, Failures: 0, Errors: 0, Skipped: 0, Time elapsed: 0.009 sec
Running org.apache.synapse.mediators.builtin.ValidateMediatorSerializationTest
Tests run: 2, Failures: 0, Errors: 0, Skipped: 0, Time elapsed: 0.42 sec
Running org.apache.synapse.mediators.TestUtils
Tests run: 0, Failures: 0, Errors: 0, Skipped: 0, Time elapsed: 0.009 sec
Running org.apache.synapse.config.xml.RMSequenceMediatorSerializationTest
Tests run: 2, Failures: 0, Errors: 0, Skipped: 0, Time elapsed: 0.335 sec
Running org.apache.synapse.config.xml.AggregateMediatorSerializationTest
Tests run: 1, Failures: 0, Errors: 0, Skipped: 0, Time elapsed: 0.376 sec
Running org.apache.synapse.config.xml.TransactionMediatorSerializationTest
Tests run: 1, Failures: 0, Errors: 0, Skipped: 0, Time elapsed: 0.308 sec
Running org.apache.synapse.registry.url.SimpleURLRegistryTest
Tests run: 3, Failures: 0, Errors: 0, Skipped: 0, Time elapsed: 4.626 sec
Running org.apache.synapse.util.SimpleMapTest
<ax:map xmlns:ax="http://ws.apache.org/commons/ns/payload"><ax:entry name="key1" type="int">123</ax:entry><ax:entry name="key3" type="string">hello</ax:entry><ax:entry name="key2" type="double">23.45</ax:entry><ax:entry name="key4" type="byte">115</ax:entry></ax:map>
Tests run: 2, Failures: 0, Errors: 0, Skipped: 0, Time elapsed: 0.155 sec
Running org.apache.synapse.mediators.db.DBReportMediatorTest
Tests run: 1, Failures: 0, Errors: 0, Skipped: 0, Time elapsed: 6.126 sec
Running org.apache.synapse.util.TextFileDataSourceTest
Tests run: 3, Failures: 0, Errors: 0, Skipped: 0, Time elapsed: 0.116 sec
Running org.apache.synapse.mediators.filters.FilterMediatorTest
Tests run: 6, Failures: 0, Errors: 0, Skipped: 0, Time elapsed: 0.24 sec
Running org.apache.synapse.config.xml.endpoints.AddressEndpointSerializationTest
Tests run: 4, Failures: 0, Errors: 0, Skipped: 0, Time elapsed: 0.318 sec
Running org.apache.synapse.config.xml.FilterMediatorSerializationTest
Tests run: 7, Failures: 0, Errors: 0, Skipped: 0, Time elapsed: 0.408 sec
Running org.apache.synapse.config.xml.SendMediatorSerializationTest
Tests run: 5, Failures: 0, Errors: 0, Skipped: 0, Time elapsed: 0.458 sec
Running org.apache.synapse.config.xml.CloneMediatorSerializationTest
Tests run: 4, Failures: 0, Errors: 0, Skipped: 0, Time elapsed: 0.402 sec
Running org.apache.synapse.endpoints.algorithms.WeightedRRLCAlgorithmTest
Tests run: 2, Failures: 0, Errors: 0, Skipped: 0, Time elapsed: 0.105 sec
Running org.apache.synapse.core.axis2.ProxyServiceTest
Tests run: 3, Failures: 0, Errors: 0, Skipped: 0, Time elapsed: 0.845 sec
Running org.apache.synapse.config.xml.endpoints.LoadBalanceEndpointSerializationTest
Tests run: 1, Failures: 0, Errors: 0, Skipped: 0, Time elapsed: 0.307 sec
Running org.apache.synapse.config.xml.XSLTMediatorSerializationTest
Tests run: 3, Failures: 0, Errors: 0, Skipped: 0, Time elapsed: 0.355 sec
Running org.apache.synapse.eventing.builders.MessageBuilderTest
Tests run: 5, Failures: 0, Errors: 0, Skipped: 0, Time elapsed: 0.221 sec
Running org.apache.synapse.config.xml.HeaderMediatorSerializationTest
Tests run: 2, Failures: 0, Errors: 0, Skipped: 0, Time elapsed: 0.293 sec
Running org.apache.synapse.mediators.eip.CloneMediatorTest
Tests run: 2, Failures: 0, Errors: 0, Skipped: 0, Time elapsed: 0.471 sec
Running org.apache.synapse.config.xml.OutMediatorSerializationTest
Tests run: 1, Failures: 0, Errors: 0, Skipped: 0, Time elapsed: 0.324 sec
Running org.apache.synapse.config.xml.MessageStoreSerializationTest
Tests run: 1, Failures: 0, Errors: 0, Skipped: 0, Time elapsed: 0.308 sec
Running org.apache.synapse.mediators.base.SequenceMediatorTest
Tests run: 2, Failures: 0, Errors: 0, Skipped: 0, Time elapsed: 0.205 sec
Running org.apache.synapse.config.xml.LocalEntryConfigurationTest
Testing text entry with markup characters; Coalesced parsing: true
Testing text entry with markup characters; Coalesced parsing: false
Testing text entry with nested CDATA elements; Coalesced parsing: true
Testing text entry with nested CDATA elements; Coalesced parsing: false
Testing large text entry with markup characters; Coalesced parsing: true
Testing large text entry with markup characters; Coalesced parsing: false
Testing simple XML entry with CDATA elements; Coalesced parsing: true
Testing simple XML entry with CDATA elements; Coalesced parsing: false
Tests run: 8, Failures: 0, Errors: 0, Skipped: 0, Time elapsed: 0.382 sec
Running org.apache.synapse.registry.DynamicResourceTest
Initializing in-memory registry for dynamic resource tests...
Testing dynamic sequence lookup...
Testing basic registry lookup functionality...
Testing basic sequence caching...
Testing advanced sequence caching...
Waiting for the cache to expire...
Testing sequence reloading...
Waiting for the cache to expire...
Testing for non-existing sequences...
Dynamic sequence lookup tests were successful...
Initializing in-memory registry for dynamic resource tests...
Testing dynamic endpoint lookup...
Testing basic registry lookup functionality...
Testing basic endpoint caching...
Testing advanced endpoint caching...
Waiting for the cache to expire...
Testing endpoint reloading...
Waiting for the cache to expire...
Testing for non-existing endpoints...
Dynamic endpoint lookup tests were successful...
Tests run: 2, Failures: 0, Errors: 0, Skipped: 0, Time elapsed: 34.233 sec
Running org.apache.synapse.util.SynapseXPathTest
Tests run: 10, Failures: 0, Errors: 0, Skipped: 0, Time elapsed: 0.256 sec
Running org.apache.synapse.config.xml.ClassMediatorSerializationTest
Tests run: 3, Failures: 0, Errors: 0, Skipped: 0, Time elapsed: 0.317 sec
Running org.apache.synapse.mediators.eip.IterateMediatorTest
Tests run: 2, Failures: 0, Errors: 0, Skipped: 0, Time elapsed: 0.479 sec
Running org.apache.synapse.mediators.transform.FaultMediatorTest
Tests run: 1, Failures: 0, Errors: 0, Skipped: 0, Time elapsed: 0.208 sec
Running org.apache.synapse.mediators.builtin.DropMediatorTest
Tests run: 1, Failures: 0, Errors: 0, Skipped: 0, Time elapsed: 0.186 sec
Running org.apache.synapse.mediators.transform.XSLTMediatorTest
Tests run: 29, Failures: 0, Errors: 0, Skipped: 0, Time elapsed: 17.052 sec
Running org.apache.synapse.mediators.ext.AnnotatedCommandMediatorTest
Tests run: 3, Failures: 0, Errors: 0, Skipped: 0, Time elapsed: 0.273 sec
Running org.apache.synapse.mediators.transform.url.URLRewriteMediatorTest
Tests run: 8, Failures: 0, Errors: 0, Skipped: 0, Time elapsed: 0.255 sec
Running org.apache.synapse.eventing.filters.EventFilterTest
Tests run: 2, Failures: 0, Errors: 0, Skipped: 0, Time elapsed: 0.245 sec
Running org.apache.synapse.config.xml.InMediatorSerializationTest
Tests run: 1, Failures: 0, Errors: 0, Skipped: 0, Time elapsed: 0.308 sec
Running org.apache.synapse.config.xml.SequenceMediatorSerializationTest
Tests run: 7, Failures: 0, Errors: 0, Skipped: 0, Time elapsed: 0.363 sec
Running org.apache.synapse.config.xml.POJOCommandMediatorSerializationTest
Tests run: 11, Failures: 0, Errors: 0, Skipped: 0, Time elapsed: 0.391 sec
Running org.apache.synapse.config.xml.EntrySerializationTest
Tests run: 3, Failures: 0, Errors: 0, Skipped: 0, Time elapsed: 0.3 sec
Running org.apache.synapse.config.xml.RegistrySerializationTest
Tests run: 1, Failures: 0, Errors: 0, Skipped: 0, Time elapsed: 0.293 sec
Running org.apache.synapse.n2n.SynapseCommodityServiceTest
Tests run: 1, Failures: 0, Errors: 0, Skipped: 0, Time elapsed: 1.718 sec
Running org.apache.synapse.config.xml.PropertyMediatorSerializationTest
Tests run: 8, Failures: 0, Errors: 0, Skipped: 0, Time elapsed: 0.36 sec
Running org.apache.synapse.config.xml.MultiXMLConfigurationBuilderTest
Using SYNAPSE_CONFIG_HOME=<https://builds.apache.org/job/Synapse%20-%20Trunk/ws/java/modules/core/target/test-classes/synapse-config>
Tests run: 1, Failures: 0, Errors: 0, Skipped: 0, Time elapsed: 0.275 sec
Running org.apache.synapse.config.xml.DropMediatorSerializationTest
Tests run: 1, Failures: 0, Errors: 0, Skipped: 0, Time elapsed: 0.294 sec
Running org.apache.synapse.config.xml.DBLookupMediatorSerializationTest
Tests run: 3, Failures: 0, Errors: 0, Skipped: 0, Time elapsed: 0.371 sec
Running org.apache.synapse.config.xml.LogMediatorSerializationTest
Tests run: 3, Failures: 0, Errors: 0, Skipped: 0, Time elapsed: 0.35 sec
Running org.apache.synapse.config.xml.TestMediator
Tests run: 0, Failures: 0, Errors: 0, Skipped: 0, Time elapsed: 0.009 sec
Running org.apache.synapse.mediators.db.DBLookupMediatorTest
Tests run: 2, Failures: 0, Errors: 0, Skipped: 0, Time elapsed: 1.53 sec
Running org.apache.synapse.config.xml.StartupSerializationTest
Tests run: 2, Failures: 0, Errors: 0, Skipped: 0, Time elapsed: 0.313 sec
Running org.apache.synapse.mediators.builtin.PropertyMediatorTest
All property values are correctly in place - Test SUCCESSFUL
Tests run: 5, Failures: 0, Errors: 0, Skipped: 0, Time elapsed: 0.303 sec
Running org.apache.synapse.util.MessageHelperTest
Tests run: 2, Failures: 0, Errors: 0, Skipped: 0, Time elapsed: 0.045 sec
Running org.apache.synapse.util.TestTask
Tests run: 0, Failures: 0, Errors: 0, Skipped: 0, Time elapsed: 0.009 sec
Running org.apache.synapse.eventing.builders.ResponseMessageBuilderTest
Tests run: 4, Failures: 0, Errors: 0, Skipped: 0, Time elapsed: 0.396 sec
Running org.apache.synapse.TestMessageContext
Tests run: 0, Failures: 0, Errors: 0, Skipped: 0, Time elapsed: 0.009 sec
Running org.apache.synapse.config.xml.ProxyServiceSerializationTest
Tests run: 6, Failures: 0, Errors: 0, Skipped: 0, Time elapsed: 0.386 sec
Running org.apache.synapse.core.axis2.Axis2MessageContextTest
Tests run: 2, Failures: 0, Errors: 0, Skipped: 0, Time elapsed: 0.225 sec
Running org.apache.synapse.config.xml.SwitchMediatorSerializationTest
Tests run: 2, Failures: 0, Errors: 0, Skipped: 0, Time elapsed: 0.368 sec
Running org.apache.synapse.config.xml.ConditionalRouterMediatorSerializationTest
Tests run: 4, Failures: 0, Errors: 0, Skipped: 0, Time elapsed: 0.382 sec
Running org.apache.synapse.mediators.transform.HeaderMediatorTest
Tests run: 3, Failures: 0, Errors: 0, Skipped: 0, Time elapsed: 0.229 sec
Running org.apache.synapse.mediators.builtin.ValidateMediatorTest
Tests run: 9, Failures: 0, Errors: 0, Skipped: 0, Time elapsed: 0.661 sec
Running org.apache.synapse.config.xml.FaultMediatorSerializationTest
Tests run: 5, Failures: 0, Errors: 0, Skipped: 0, Time elapsed: 0.338 sec
Running org.apache.synapse.config.xml.CacheMediatorSerializationTest
Tests run: 3, Failures: 0, Errors: 0, Skipped: 0, Time elapsed: 0.343 sec
Running org.apache.synapse.mediators.filters.SwitchMediatorTest
Tests run: 3, Failures: 0, Errors: 0, Skipped: 0, Time elapsed: 0.243 sec
Running org.apache.synapse.config.xml.URLRewriteMediatorSerializationTest
Tests run: 3, Failures: 0, Errors: 0, Skipped: 0, Time elapsed: 0.341 sec
Running org.apache.synapse.config.xml.CalloutMediatorSerializationTest
Tests run: 2, Failures: 0, Errors: 0, Skipped: 0, Time elapsed: 0.349 sec
Running org.apache.synapse.config.SynapseObserverTest
Tests run: 1, Failures: 0, Errors: 0, Skipped: 0, Time elapsed: 0.062 sec
Running org.apache.synapse.config.xml.DBReportMediatorSerializationTest
Tests run: 3, Failures: 0, Errors: 0, Skipped: 0, Time elapsed: 0.369 sec
Running org.apache.synapse.core.axis2.SOAPConversionTest
[JENKINS] Recording test resultsTests run: 2, Failures: 0, Errors: 0, Skipped: 0, Time elapsed: 0.388 sec
Running org.apache.synapse.eventing.SynapseEventSourceTest
Tests run: 1, Failures: 0, Errors: 0, Skipped: 0, Time elapsed: 0.234 sec
Running org.apache.synapse.mediators.ext.POJOCommandMediatorTest
Tests run: 8, Failures: 0, Errors: 0, Skipped: 0, Time elapsed: 0.245 sec
Results :
Tests run: 258, Failures: 0, Errors: 0, Skipped: 0
Build timed out (after 315 minutes). Marking the build as failed.
[FINDBUGS] Aggregating results of Apache Synapse - Secure vault
[FINDBUGS] Using set difference to compute new warnings
[FINDBUGS] Not changing build status, since no threshold has been exceeded
[FINDBUGS] Aggregating results of Apache Synapse
[FINDBUGS] Using set difference to compute new warnings
[FINDBUGS] Not changing build status, since no threshold has been exceeded
[FINDBUGS] Aggregating results of Apache Synapse - Commons classes
[FINDBUGS] Using set difference to compute new warnings
[FINDBUGS] Not changing build status, since no threshold has been exceeded
[FINDBUGS] Aggregating results of Apache Synapse - Transports
[FINDBUGS] Using set difference to compute new warnings
[FINDBUGS] Not changing build status, since no threshold has been exceeded
[FINDBUGS] Aggregating results of Apache Synapse - Non-blocking HTTP/s Transport
[FINDBUGS] Using set difference to compute new warnings
[FINDBUGS] Not changing build status, since no threshold has been exceeded
[FINDBUGS] Aggregating results of Apache Synapse - PIPE Transport
[FINDBUGS] Using set difference to compute new warnings
[FINDBUGS] Not changing build status, since no threshold has been exceeded
[FINDBUGS] Aggregating results of Apache Synapse - VFS Transport
[FINDBUGS] Using set difference to compute new warnings
[FINDBUGS] Not changing build status, since no threshold has been exceeded
[FINDBUGS] Aggregating results of Apache Synapse - Tasks classes
[FINDBUGS] Using set difference to compute new warnings
[FINDBUGS] Not changing build status, since no threshold has been exceeded
Sending e-mails to: dev@synapse.apache.org
[locks-and-latches] Releasing all the locks
[locks-and-latches] All the locks released
FATAL: channel is already closed
hudson.remoting.ChannelClosedException: channel is already closed
at hudson.remoting.Channel.send(Channel.java:480)
at hudson.remoting.Request.call(Request.java:105)
at hudson.remoting.Channel.call(Channel.java:661)
at hudson.Launcher$RemoteLauncher.kill(Launcher.java:812)
at hudson.model.AbstractBuild$AbstractRunner.run(AbstractBuild.java:452)
at hudson.model.Run.run(Run.java:1374)
at hudson.maven.MavenModuleSetBuild.run(MavenModuleSetBuild.java:467)
at hudson.model.ResourceController.execute(ResourceController.java:88)
at hudson.model.Executor.run(Executor.java:145)
Caused by: java.io.IOException: Unexpected termination of the channel
at hudson.remoting.Channel$ReaderThread.run(Channel.java:1019)
Caused by: java.io.EOFException
at java.io.ObjectInputStream$BlockDataInputStream.peekByte(ObjectInputStream.java:2553)
at java.io.ObjectInputStream.readObject0(ObjectInputStream.java:1296)
at java.io.ObjectInputStream.readObject(ObjectInputStream.java:350)
at hudson.remoting.Channel$ReaderThread.run(Channel.java:1013)
---------------------------------------------------------------------
To unsubscribe, e-mail: dev-unsubscribe@synapse.apache.org
For additional commands, e-mail: dev-help@synapse.apache.org