You are viewing a plain text version of this content. The canonical link for it is here.
Posted to notifications@commons.apache.org by Apache Jenkins Server <je...@builds.apache.org> on 2026/07/02 14:43:22 UTC
Build failed in Jenkins: Commons » commons-net-windows » Apache Commons Net #313
See <https://ci-builds.apache.org/job/Commons/job/commons-net-windows/commons-net$commons-net/313/display/redirect?page=changes>
Changes:
[dxbjavid] reject CR/LF in FTP, POP3, NNTP and SMTP command senders
[garydgregory] Sort members
[garydgregory] Reject CR/LF in FTP, POP3, NNTP and SMTP command senders (#400).
------------------------------------------
Established TCP socket on 62830
maven35-agent.jar already up to date
maven35-interceptor.jar already up to date
maven3-interceptor-commons.jar already up to date
<===[JENKINS REMOTING CAPACITY]===> channel started
Executing Maven: -B -f <https://ci-builds.apache.org/job/Commons/job/commons-net-windows/commons-net$commons-net/ws/pom.xml> -V clean install --no-transfer-progress --batch-mode -Pjava-1.8
[1mApache Maven 3.9.11 (3e54c93a704957b63ee3494413a2b544fd3d825b)[m
Maven home: F:\jenkins\tools\maven\latest
Java version: 17.0.7, vendor: Eclipse Adoptium, runtime: F:\jenkins\tools\java\latest17
Default locale: en_US, platform encoding: Cp1252
OS name: "windows server 2019", version: "10.0", arch: "amd64", family: "windows"
[INFO] Scanning for projects...
[HUDSON] Collecting dependencies info
[INFO]
[INFO] ----------------------< commons-net:commons-net >-----------------------
[INFO] Building Apache Commons Net 3.13.1-SNAPSHOT
[INFO] from pom.xml
[INFO] --------------------------------[ jar ]---------------------------------
[INFO]
[INFO] --- clean:3.5.0:clean (default-clean) @ commons-net ---
[INFO]
[INFO] --- enforcer:3.6.2:enforce (enforce-maven-version) @ commons-net ---
[INFO] Rule 0: org.apache.maven.enforcer.rules.version.RequireMavenVersion passed
[INFO]
[INFO] --- enforcer:3.6.2:enforce (enforce-java-version) @ commons-net ---
[INFO] Rule 0: org.apache.maven.enforcer.rules.version.RequireJavaVersion passed
[INFO]
[INFO] --- apache-rat:0.18:check (rat-check) @ commons-net ---
[ERROR] Could not create report parent directory <https://ci-builds.apache.org/job/Commons/job/commons-net-windows/commons-net$commons-net/ws/f>:\jenkins\jenkins-home\712657a4\workspace\Commons\commons-net-windows\target\rat.txt
[WARNING] Unable to create directory: <https://ci-builds.apache.org/job/Commons/job/commons-net-windows/commons-net$commons-net/ws/f>:\jenkins\jenkins-home\712657a4\workspace\Commons\commons-net-windows\target
[WARNING] Attempt to (de-)serialize anonymous class org.jfrog.hudson.maven2.MavenDependenciesRecorder$1; see: https://jenkins.io/redirect/serialization-of-anonymous-classes/
Build failed in Jenkins: Commons » commons-net-windows » Apache Commons Net #356
Posted by Apache Jenkins Server <je...@builds.apache.org>.
See <https://ci-builds.apache.org/job/Commons/job/commons-net-windows/commons-net$commons-net/356/display/redirect?page=changes>
Changes:
[garydgregory] Bump ossf/scorecard-action from 2.4.4 to 2.5.0
------------------------------------------
Established TCP socket on 54141
maven35-agent.jar already up to date
maven35-interceptor.jar already up to date
maven3-interceptor-commons.jar already up to date
<===[JENKINS REMOTING CAPACITY]===> channel started
Executing Maven: -B -f <https://ci-builds.apache.org/job/Commons/job/commons-net-windows/commons-net$commons-net/ws/pom.xml> -V clean install --no-transfer-progress --batch-mode -Pjava-1.8
[1mApache Maven 3.9.16 (2bdd9fddda4b155ebf8000e807eb73fd829a51d5)[m
Maven home: F:\jenkins\tools\maven\latest
Java version: 17.0.7, vendor: Eclipse Adoptium, runtime: F:\jenkins\tools\java\latest17
Default locale: en_US, platform encoding: Cp1252
OS name: "windows server 2019", version: "10.0", arch: "amd64", family: "windows"
[INFO] Scanning for projects...
[HUDSON] Collecting dependencies info
[INFO]
[INFO] ----------------------< commons-net:commons-net >-----------------------
[INFO] Building Apache Commons Net 3.13.1-SNAPSHOT
[INFO] from pom.xml
[INFO] --------------------------------[ jar ]---------------------------------
[INFO] Downloading from central: https://repo.maven.apache.org/maven2/org/codehaus/mojo/build-helper-maven-plugin/3.6.2/build-helper-maven-plugin-3.6.2.pom
[INFO] Downloaded from central: https://repo.maven.apache.org/maven2/org/codehaus/mojo/build-helper-maven-plugin/3.6.2/build-helper-maven-plugin-3.6.2.pom (7.9 kB at 18 kB/s)
[INFO] Downloading from central: https://repo.maven.apache.org/maven2/org/codehaus/mojo/mojo-parent/97/mojo-parent-97.pom
[INFO] Downloaded from central: https://repo.maven.apache.org/maven2/org/codehaus/mojo/mojo-parent/97/mojo-parent-97.pom (39 kB at 344 kB/s)
[INFO] Downloading from central: https://repo.maven.apache.org/maven2/org/codehaus/mojo/build-helper-maven-plugin/3.6.2/build-helper-maven-plugin-3.6.2.jar
[INFO] Downloaded from central: https://repo.maven.apache.org/maven2/org/codehaus/mojo/build-helper-maven-plugin/3.6.2/build-helper-maven-plugin-3.6.2.jar (72 kB at 635 kB/s)
[INFO] Downloading from central: https://repo.maven.apache.org/maven2/org/codehaus/mojo/exec-maven-plugin/3.6.4/exec-maven-plugin-3.6.4.pom
[INFO] Downloaded from central: https://repo.maven.apache.org/maven2/org/codehaus/mojo/exec-maven-plugin/3.6.4/exec-maven-plugin-3.6.4.pom (16 kB at 166 kB/s)
[INFO] Downloading from central: https://repo.maven.apache.org/maven2/org/codehaus/mojo/exec-maven-plugin/3.6.4/exec-maven-plugin-3.6.4.jar
[INFO] Downloaded from central: https://repo.maven.apache.org/maven2/org/codehaus/mojo/exec-maven-plugin/3.6.4/exec-maven-plugin-3.6.4.jar (94 kB at 1.2 MB/s)
[INFO] Downloading from central: https://repo.maven.apache.org/maven2/org/apache/maven/plugins/maven-artifact-plugin/3.7.0/maven-artifact-plugin-3.7.0.pom
[INFO] Downloaded from central: https://repo.maven.apache.org/maven2/org/apache/maven/plugins/maven-artifact-plugin/3.7.0/maven-artifact-plugin-3.7.0.pom (9.8 kB at 97 kB/s)
[INFO] Downloading from central: https://repo.maven.apache.org/maven2/org/apache/maven/plugins/maven-artifact-plugin/3.7.0/maven-artifact-plugin-3.7.0.jar
[INFO] Downloaded from central: https://repo.maven.apache.org/maven2/org/apache/maven/plugins/maven-artifact-plugin/3.7.0/maven-artifact-plugin-3.7.0.jar (85 kB at 929 kB/s)
[INFO] Downloading from central: https://repo.maven.apache.org/maven2/org/apache/felix/maven-bundle-plugin/6.2.0/maven-bundle-plugin-6.2.0.pom
[INFO] Downloaded from central: https://repo.maven.apache.org/maven2/org/apache/felix/maven-bundle-plugin/6.2.0/maven-bundle-plugin-6.2.0.pom (12 kB at 141 kB/s)
[INFO] Downloading from central: https://repo.maven.apache.org/maven2/org/apache/felix/maven-bundle-plugin/6.2.0/maven-bundle-plugin-6.2.0.jar
[INFO] Downloaded from central: https://repo.maven.apache.org/maven2/org/apache/felix/maven-bundle-plugin/6.2.0/maven-bundle-plugin-6.2.0.jar (215 kB at 2.3 MB/s)
[INFO] Downloading from central: https://repo.maven.apache.org/maven2/org/cyclonedx/cyclonedx-maven-plugin/2.9.3/cyclonedx-maven-plugin-2.9.3.pom
[INFO] Downloaded from central: https://repo.maven.apache.org/maven2/org/cyclonedx/cyclonedx-maven-plugin/2.9.3/cyclonedx-maven-plugin-2.9.3.pom (19 kB at 224 kB/s)
[INFO] Downloading from central: https://repo.maven.apache.org/maven2/org/cyclonedx/cyclonedx-maven-plugin/2.9.3/cyclonedx-maven-plugin-2.9.3.jar
[INFO] Downloaded from central: https://repo.maven.apache.org/maven2/org/cyclonedx/cyclonedx-maven-plugin/2.9.3/cyclonedx-maven-plugin-2.9.3.jar (52 kB at 579 kB/s)
[INFO] Downloading from central: https://repo.maven.apache.org/maven2/org/apache/maven/plugins/maven-install-plugin/3.2.0/maven-install-plugin-3.2.0.pom
[INFO] Downloaded from central: https://repo.maven.apache.org/maven2/org/apache/maven/plugins/maven-install-plugin/3.2.0/maven-install-plugin-3.2.0.pom (7.9 kB at 113 kB/s)
[INFO] Downloading from central: https://repo.maven.apache.org/maven2/org/apache/maven/plugins/maven-install-plugin/3.2.0/maven-install-plugin-3.2.0.jar
[INFO] Downloaded from central: https://repo.maven.apache.org/maven2/org/apache/maven/plugins/maven-install-plugin/3.2.0/maven-install-plugin-3.2.0.jar (37 kB at 130 kB/s)
[INFO] Downloading from central: https://repo.maven.apache.org/maven2/org/apache/commons/commons-collections4/4.6.0/commons-collections4-4.6.0.pom
[INFO] Downloaded from central: https://repo.maven.apache.org/maven2/org/apache/commons/commons-collections4/4.6.0/commons-collections4-4.6.0.pom (28 kB at 299 kB/s)
[INFO] Downloading from central: https://repo.maven.apache.org/maven2/org/apache/commons/commons-collections4/4.6.0/commons-collections4-4.6.0.jar
[INFO] Downloaded from central: https://repo.maven.apache.org/maven2/org/apache/commons/commons-collections4/4.6.0/commons-collections4-4.6.0.jar (934 kB at 6.8 MB/s)
[INFO]
[INFO] --- clean:3.5.0:clean (default-clean) @ commons-net ---
[INFO]
[INFO] --- enforcer:3.6.3:enforce (enforce-maven-version) @ commons-net ---
[INFO] Rule 0: org.apache.maven.enforcer.rules.version.RequireMavenVersion passed
[INFO]
[INFO] --- enforcer:3.6.3:enforce (enforce-java-version) @ commons-net ---
[INFO] Rule 0: org.apache.maven.enforcer.rules.version.RequireJavaVersion passed
[INFO]
[INFO] --- apache-rat:0.18:check (rat-check) @ commons-net ---
[ERROR] Could not create report parent directory <https://ci-builds.apache.org/job/Commons/job/commons-net-windows/commons-net$commons-net/ws/f>:\jenkins\jenkins-home\712657a4\workspace\Commons\commons-net-windows\target\rat.txt
[WARNING] Unable to create directory: <https://ci-builds.apache.org/job/Commons/job/commons-net-windows/commons-net$commons-net/ws/f>:\jenkins\jenkins-home\712657a4\workspace\Commons\commons-net-windows\target
[WARNING] Attempt to (de-)serialize anonymous class org.jfrog.hudson.maven2.MavenDependenciesRecorder$1; see: https://jenkins.io/redirect/serialization-of-anonymous-classes/
Build failed in Jenkins: Commons » commons-net-windows » Apache Commons Net #355
Posted by Apache Jenkins Server <je...@builds.apache.org>.
See <https://ci-builds.apache.org/job/Commons/job/commons-net-windows/commons-net$commons-net/355/display/redirect?page=changes>
Changes:
[garydgregory] Bump github/codeql-action from 4.38.3 to 4.39.0
------------------------------------------
Established TCP socket on 63587
maven35-agent.jar already up to date
maven35-interceptor.jar already up to date
maven3-interceptor-commons.jar already up to date
<===[JENKINS REMOTING CAPACITY]===> channel started
Executing Maven: -B -f <https://ci-builds.apache.org/job/Commons/job/commons-net-windows/commons-net$commons-net/ws/pom.xml> -V clean install --no-transfer-progress --batch-mode -Pjava-1.8
[1mApache Maven 3.9.16 (2bdd9fddda4b155ebf8000e807eb73fd829a51d5)[m
Maven home: F:\jenkins\tools\maven\latest
Java version: 17.0.7, vendor: Eclipse Adoptium, runtime: F:\jenkins\tools\java\latest17
Default locale: en_US, platform encoding: Cp1252
OS name: "windows server 2019", version: "10.0", arch: "amd64", family: "windows"
[INFO] Scanning for projects...
[HUDSON] Collecting dependencies info
[INFO]
[INFO] ----------------------< commons-net:commons-net >-----------------------
[INFO] Building Apache Commons Net 3.13.1-SNAPSHOT
[INFO] from pom.xml
[INFO] --------------------------------[ jar ]---------------------------------
[INFO]
[INFO] --- clean:3.5.0:clean (default-clean) @ commons-net ---
[INFO]
[INFO] --- enforcer:3.6.3:enforce (enforce-maven-version) @ commons-net ---
[INFO] Rule 0: org.apache.maven.enforcer.rules.version.RequireMavenVersion passed
[INFO]
[INFO] --- enforcer:3.6.3:enforce (enforce-java-version) @ commons-net ---
[INFO] Rule 0: org.apache.maven.enforcer.rules.version.RequireJavaVersion passed
[INFO]
[INFO] --- apache-rat:0.18:check (rat-check) @ commons-net ---
[ERROR] Could not create report parent directory <https://ci-builds.apache.org/job/Commons/job/commons-net-windows/commons-net$commons-net/ws/f>:\jenkins\jenkins-home\712657a4\workspace\Commons\commons-net-windows\target\rat.txt
[WARNING] Unable to create directory: <https://ci-builds.apache.org/job/Commons/job/commons-net-windows/commons-net$commons-net/ws/f>:\jenkins\jenkins-home\712657a4\workspace\Commons\commons-net-windows\target
[WARNING] Attempt to (de-)serialize anonymous class org.jfrog.hudson.maven2.MavenDependenciesRecorder$1; see: https://jenkins.io/redirect/serialization-of-anonymous-classes/
Build failed in Jenkins: Commons » commons-net-windows » Apache Commons Net #354
Posted by Apache Jenkins Server <je...@builds.apache.org>.
See <https://ci-builds.apache.org/job/Commons/job/commons-net-windows/commons-net$commons-net/354/display/redirect?page=changes>
Changes:
[garydgregory] Bump actions/setup-java from 6.0.1 to 6.1.0
------------------------------------------
Established TCP socket on 53924
maven35-agent.jar already up to date
maven35-interceptor.jar already up to date
maven3-interceptor-commons.jar already up to date
<===[JENKINS REMOTING CAPACITY]===> channel started
Executing Maven: -B -f <https://ci-builds.apache.org/job/Commons/job/commons-net-windows/commons-net$commons-net/ws/pom.xml> -V clean install --no-transfer-progress --batch-mode -Pjava-1.8
[1mApache Maven 3.9.16 (2bdd9fddda4b155ebf8000e807eb73fd829a51d5)[m
Maven home: F:\jenkins\tools\maven\latest
Java version: 17.0.7, vendor: Eclipse Adoptium, runtime: F:\jenkins\tools\java\latest17
Default locale: en_US, platform encoding: Cp1252
OS name: "windows server 2019", version: "10.0", arch: "amd64", family: "windows"
[INFO] Scanning for projects...
[HUDSON] Collecting dependencies info
[INFO]
[INFO] ----------------------< commons-net:commons-net >-----------------------
[INFO] Building Apache Commons Net 3.13.1-SNAPSHOT
[INFO] from pom.xml
[INFO] --------------------------------[ jar ]---------------------------------
[INFO]
[INFO] --- clean:3.5.0:clean (default-clean) @ commons-net ---
[INFO]
[INFO] --- enforcer:3.6.3:enforce (enforce-maven-version) @ commons-net ---
[INFO] Rule 0: org.apache.maven.enforcer.rules.version.RequireMavenVersion passed
[INFO]
[INFO] --- enforcer:3.6.3:enforce (enforce-java-version) @ commons-net ---
[INFO] Rule 0: org.apache.maven.enforcer.rules.version.RequireJavaVersion passed
[INFO]
[INFO] --- apache-rat:0.18:check (rat-check) @ commons-net ---
[ERROR] Could not create report parent directory <https://ci-builds.apache.org/job/Commons/job/commons-net-windows/commons-net$commons-net/ws/f>:\jenkins\jenkins-home\712657a4\workspace\Commons\commons-net-windows\target\rat.txt
[WARNING] Unable to create directory: <https://ci-builds.apache.org/job/Commons/job/commons-net-windows/commons-net$commons-net/ws/f>:\jenkins\jenkins-home\712657a4\workspace\Commons\commons-net-windows\target
[WARNING] Attempt to (de-)serialize anonymous class org.jfrog.hudson.maven2.MavenDependenciesRecorder$1; see: https://jenkins.io/redirect/serialization-of-anonymous-classes/
Build failed in Jenkins: Commons » commons-net-windows » Apache Commons Net #353
Posted by Apache Jenkins Server <je...@builds.apache.org>.
See <https://ci-builds.apache.org/job/Commons/job/commons-net-windows/commons-net$commons-net/353/display/redirect?page=changes>
Changes:
[github] Bump Apache Commons Parent from 105 to 106 (#411)
[garydgregory] Bump org.apache.commons:commons-parent from 105 to 106
------------------------------------------
Established TCP socket on 65451
maven35-agent.jar already up to date
maven35-interceptor.jar already up to date
maven3-interceptor-commons.jar already up to date
<===[JENKINS REMOTING CAPACITY]===> channel started
Executing Maven: -B -f <https://ci-builds.apache.org/job/Commons/job/commons-net-windows/commons-net$commons-net/ws/pom.xml> -V clean install --no-transfer-progress --batch-mode -Pjava-1.8
[1mApache Maven 3.9.16 (2bdd9fddda4b155ebf8000e807eb73fd829a51d5)[m
Maven home: F:\jenkins\tools\maven\latest
Java version: 17.0.7, vendor: Eclipse Adoptium, runtime: F:\jenkins\tools\java\latest17
Default locale: en_US, platform encoding: Cp1252
OS name: "windows server 2019", version: "10.0", arch: "amd64", family: "windows"
[INFO] Scanning for projects...
[HUDSON] Collecting dependencies info
[INFO]
[INFO] ----------------------< commons-net:commons-net >-----------------------
[INFO] Building Apache Commons Net 3.13.1-SNAPSHOT
[INFO] from pom.xml
[INFO] --------------------------------[ jar ]---------------------------------
[INFO] Downloading from central: https://repo.maven.apache.org/maven2/org/codehaus/mojo/build-helper-maven-plugin/3.6.2/build-helper-maven-plugin-3.6.2.pom
[INFO] Downloaded from central: https://repo.maven.apache.org/maven2/org/codehaus/mojo/build-helper-maven-plugin/3.6.2/build-helper-maven-plugin-3.6.2.pom (7.9 kB at 18 kB/s)
[INFO] Downloading from central: https://repo.maven.apache.org/maven2/org/codehaus/mojo/mojo-parent/97/mojo-parent-97.pom
[INFO] Downloaded from central: https://repo.maven.apache.org/maven2/org/codehaus/mojo/mojo-parent/97/mojo-parent-97.pom (39 kB at 344 kB/s)
[INFO] Downloading from central: https://repo.maven.apache.org/maven2/org/codehaus/mojo/build-helper-maven-plugin/3.6.2/build-helper-maven-plugin-3.6.2.jar
[INFO] Downloaded from central: https://repo.maven.apache.org/maven2/org/codehaus/mojo/build-helper-maven-plugin/3.6.2/build-helper-maven-plugin-3.6.2.jar (72 kB at 780 kB/s)
[INFO] Downloading from central: https://repo.maven.apache.org/maven2/org/codehaus/mojo/exec-maven-plugin/3.6.4/exec-maven-plugin-3.6.4.pom
[INFO] Downloaded from central: https://repo.maven.apache.org/maven2/org/codehaus/mojo/exec-maven-plugin/3.6.4/exec-maven-plugin-3.6.4.pom (16 kB at 159 kB/s)
[INFO] Downloading from central: https://repo.maven.apache.org/maven2/org/codehaus/mojo/exec-maven-plugin/3.6.4/exec-maven-plugin-3.6.4.jar
[INFO] Downloaded from central: https://repo.maven.apache.org/maven2/org/codehaus/mojo/exec-maven-plugin/3.6.4/exec-maven-plugin-3.6.4.jar (94 kB at 1.1 MB/s)
[INFO] Downloading from central: https://repo.maven.apache.org/maven2/org/apache/maven/plugins/maven-artifact-plugin/3.7.0/maven-artifact-plugin-3.7.0.pom
[INFO] Downloaded from central: https://repo.maven.apache.org/maven2/org/apache/maven/plugins/maven-artifact-plugin/3.7.0/maven-artifact-plugin-3.7.0.pom (9.8 kB at 97 kB/s)
[INFO] Downloading from central: https://repo.maven.apache.org/maven2/org/apache/maven/plugins/maven-artifact-plugin/3.7.0/maven-artifact-plugin-3.7.0.jar
[INFO] Downloaded from central: https://repo.maven.apache.org/maven2/org/apache/maven/plugins/maven-artifact-plugin/3.7.0/maven-artifact-plugin-3.7.0.jar (85 kB at 881 kB/s)
[INFO] Downloading from central: https://repo.maven.apache.org/maven2/org/apache/felix/maven-bundle-plugin/6.2.0/maven-bundle-plugin-6.2.0.pom
[INFO] Downloaded from central: https://repo.maven.apache.org/maven2/org/apache/felix/maven-bundle-plugin/6.2.0/maven-bundle-plugin-6.2.0.pom (12 kB at 162 kB/s)
[INFO] Downloading from central: https://repo.maven.apache.org/maven2/org/apache/felix/maven-bundle-plugin/6.2.0/maven-bundle-plugin-6.2.0.jar
[INFO] Downloaded from central: https://repo.maven.apache.org/maven2/org/apache/felix/maven-bundle-plugin/6.2.0/maven-bundle-plugin-6.2.0.jar (215 kB at 2.7 MB/s)
[INFO] Downloading from central: https://repo.maven.apache.org/maven2/org/cyclonedx/cyclonedx-maven-plugin/2.9.3/cyclonedx-maven-plugin-2.9.3.pom
[INFO] Downloaded from central: https://repo.maven.apache.org/maven2/org/cyclonedx/cyclonedx-maven-plugin/2.9.3/cyclonedx-maven-plugin-2.9.3.pom (19 kB at 268 kB/s)
[INFO] Downloading from central: https://repo.maven.apache.org/maven2/org/cyclonedx/cyclonedx-maven-plugin/2.9.3/cyclonedx-maven-plugin-2.9.3.jar
[INFO] Downloaded from central: https://repo.maven.apache.org/maven2/org/cyclonedx/cyclonedx-maven-plugin/2.9.3/cyclonedx-maven-plugin-2.9.3.jar (52 kB at 704 kB/s)
[INFO] Downloading from central: https://repo.maven.apache.org/maven2/org/apache/maven/plugins/maven-install-plugin/3.2.0/maven-install-plugin-3.2.0.pom
[INFO] Downloaded from central: https://repo.maven.apache.org/maven2/org/apache/maven/plugins/maven-install-plugin/3.2.0/maven-install-plugin-3.2.0.pom (7.9 kB at 142 kB/s)
[INFO] Downloading from central: https://repo.maven.apache.org/maven2/org/apache/maven/plugins/maven-install-plugin/3.2.0/maven-install-plugin-3.2.0.jar
[INFO] Downloaded from central: https://repo.maven.apache.org/maven2/org/apache/maven/plugins/maven-install-plugin/3.2.0/maven-install-plugin-3.2.0.jar (37 kB at 125 kB/s)
[INFO] Downloading from central: https://repo.maven.apache.org/maven2/org/apache/commons/commons-lang3/3.21.0/commons-lang3-3.21.0.pom
[INFO] Downloaded from central: https://repo.maven.apache.org/maven2/org/apache/commons/commons-lang3/3.21.0/commons-lang3-3.21.0.pom (36 kB at 462 kB/s)
[INFO] Downloading from central: https://repo.maven.apache.org/maven2/org/apache/commons/commons-collections4/4.6.0/commons-collections4-4.6.0.pom
[INFO] Downloaded from central: https://repo.maven.apache.org/maven2/org/apache/commons/commons-collections4/4.6.0/commons-collections4-4.6.0.pom (28 kB at 427 kB/s)
[INFO] Downloading from central: https://repo.maven.apache.org/maven2/org/apache/commons/commons-lang3/3.21.0/commons-lang3-3.21.0.jar
[INFO] Downloaded from central: https://repo.maven.apache.org/maven2/org/apache/commons/commons-lang3/3.21.0/commons-lang3-3.21.0.jar (749 kB at 6.6 MB/s)
[INFO] Downloading from central: https://repo.maven.apache.org/maven2/org/apache/commons/commons-collections4/4.6.0/commons-collections4-4.6.0.jar
[INFO] Downloaded from central: https://repo.maven.apache.org/maven2/org/apache/commons/commons-collections4/4.6.0/commons-collections4-4.6.0.jar (934 kB at 8.5 MB/s)
[INFO]
[INFO] --- clean:3.5.0:clean (default-clean) @ commons-net ---
[INFO]
[INFO] --- enforcer:3.6.3:enforce (enforce-maven-version) @ commons-net ---
[INFO] Rule 0: org.apache.maven.enforcer.rules.version.RequireMavenVersion passed
[INFO]
[INFO] --- enforcer:3.6.3:enforce (enforce-java-version) @ commons-net ---
[INFO] Rule 0: org.apache.maven.enforcer.rules.version.RequireJavaVersion passed
[INFO]
[INFO] --- apache-rat:0.18:check (rat-check) @ commons-net ---
[ERROR] Could not create report parent directory <https://ci-builds.apache.org/job/Commons/job/commons-net-windows/commons-net$commons-net/ws/f>:\jenkins\jenkins-home\712657a4\workspace\Commons\commons-net-windows\target\rat.txt
[WARNING] Unable to create directory: <https://ci-builds.apache.org/job/Commons/job/commons-net-windows/commons-net$commons-net/ws/f>:\jenkins\jenkins-home\712657a4\workspace\Commons\commons-net-windows\target
[WARNING] Attempt to (de-)serialize anonymous class org.jfrog.hudson.maven2.MavenDependenciesRecorder$1; see: https://jenkins.io/redirect/serialization-of-anonymous-classes/
Build failed in Jenkins: Commons » commons-net-windows » Apache Commons Net #352
Posted by Apache Jenkins Server <je...@builds.apache.org>.
See <https://ci-builds.apache.org/job/Commons/job/commons-net-windows/commons-net$commons-net/352/display/redirect>
Changes:
------------------------------------------
Established TCP socket on 63529
maven35-agent.jar already up to date
maven35-interceptor.jar already up to date
maven3-interceptor-commons.jar already up to date
<===[JENKINS REMOTING CAPACITY]===> channel started
Executing Maven: -B -f <https://ci-builds.apache.org/job/Commons/job/commons-net-windows/commons-net$commons-net/ws/pom.xml> -V clean install --no-transfer-progress --batch-mode -Pjava-1.8
[1mApache Maven 3.9.16 (2bdd9fddda4b155ebf8000e807eb73fd829a51d5)[m
Maven home: F:\jenkins\tools\maven\latest
Java version: 17.0.7, vendor: Eclipse Adoptium, runtime: F:\jenkins\tools\java\latest17
Default locale: en_US, platform encoding: Cp1252
OS name: "windows server 2019", version: "10.0", arch: "amd64", family: "windows"
[INFO] Scanning for projects...
[HUDSON] Collecting dependencies info
[INFO]
[INFO] ----------------------< commons-net:commons-net >-----------------------
[INFO] Building Apache Commons Net 3.13.1-SNAPSHOT
[INFO] from pom.xml
[INFO] --------------------------------[ jar ]---------------------------------
[INFO]
[INFO] --- clean:3.5.0:clean (default-clean) @ commons-net ---
[INFO]
[INFO] --- enforcer:3.6.3:enforce (enforce-maven-version) @ commons-net ---
[INFO] Rule 0: org.apache.maven.enforcer.rules.version.RequireMavenVersion passed
[INFO]
[INFO] --- enforcer:3.6.3:enforce (enforce-java-version) @ commons-net ---
[INFO] Rule 0: org.apache.maven.enforcer.rules.version.RequireJavaVersion passed
[INFO]
[INFO] --- apache-rat:0.18:check (rat-check) @ commons-net ---
[ERROR] Could not create report parent directory <https://ci-builds.apache.org/job/Commons/job/commons-net-windows/commons-net$commons-net/ws/f>:\jenkins\jenkins-home\712657a4\workspace\Commons\commons-net-windows\target\rat.txt
[WARNING] Unable to create directory: <https://ci-builds.apache.org/job/Commons/job/commons-net-windows/commons-net$commons-net/ws/f>:\jenkins\jenkins-home\712657a4\workspace\Commons\commons-net-windows\target
[WARNING] Attempt to (de-)serialize anonymous class org.jfrog.hudson.maven2.MavenDependenciesRecorder$1; see: https://jenkins.io/redirect/serialization-of-anonymous-classes/
Build failed in Jenkins: Commons » commons-net-windows » Apache Commons Net #351
Posted by Apache Jenkins Server <je...@builds.apache.org>.
See <https://ci-builds.apache.org/job/Commons/job/commons-net-windows/commons-net$commons-net/351/display/redirect?page=changes>
Changes:
[garydgregory] Bump actions/upload-artifact from 7.0.1 to 7.0.2
[garydgregory] Bump github/codeql-action/analyze from 4.37.5 to 4.38.3
[garydgregory] Revert "Bump github/codeql-action/analyze from 4.37.5 to 4.38.3"
[garydgregory] Bump github/codeql-action/analyze from 4.37.5 to 4.38.3
------------------------------------------
Established TCP socket on 63483
maven35-agent.jar already up to date
maven35-interceptor.jar already up to date
maven3-interceptor-commons.jar already up to date
<===[JENKINS REMOTING CAPACITY]===> channel started
Executing Maven: -B -f <https://ci-builds.apache.org/job/Commons/job/commons-net-windows/commons-net$commons-net/ws/pom.xml> -V clean install --no-transfer-progress --batch-mode -Pjava-1.8
[1mApache Maven 3.9.16 (2bdd9fddda4b155ebf8000e807eb73fd829a51d5)[m
Maven home: F:\jenkins\tools\maven\latest
Java version: 17.0.7, vendor: Eclipse Adoptium, runtime: F:\jenkins\tools\java\latest17
Default locale: en_US, platform encoding: Cp1252
OS name: "windows server 2019", version: "10.0", arch: "amd64", family: "windows"
[INFO] Scanning for projects...
[HUDSON] Collecting dependencies info
[INFO]
[INFO] ----------------------< commons-net:commons-net >-----------------------
[INFO] Building Apache Commons Net 3.13.1-SNAPSHOT
[INFO] from pom.xml
[INFO] --------------------------------[ jar ]---------------------------------
[INFO]
[INFO] --- clean:3.5.0:clean (default-clean) @ commons-net ---
[INFO]
[INFO] --- enforcer:3.6.3:enforce (enforce-maven-version) @ commons-net ---
[INFO] Rule 0: org.apache.maven.enforcer.rules.version.RequireMavenVersion passed
[INFO]
[INFO] --- enforcer:3.6.3:enforce (enforce-java-version) @ commons-net ---
[INFO] Rule 0: org.apache.maven.enforcer.rules.version.RequireJavaVersion passed
[INFO]
[INFO] --- apache-rat:0.18:check (rat-check) @ commons-net ---
[ERROR] Could not create report parent directory <https://ci-builds.apache.org/job/Commons/job/commons-net-windows/commons-net$commons-net/ws/f>:\jenkins\jenkins-home\712657a4\workspace\Commons\commons-net-windows\target\rat.txt
[WARNING] Unable to create directory: <https://ci-builds.apache.org/job/Commons/job/commons-net-windows/commons-net$commons-net/ws/f>:\jenkins\jenkins-home\712657a4\workspace\Commons\commons-net-windows\target
[WARNING] Attempt to (de-)serialize anonymous class org.jfrog.hudson.maven2.MavenDependenciesRecorder$1; see: https://jenkins.io/redirect/serialization-of-anonymous-classes/
Build failed in Jenkins: Commons » commons-net-windows » Apache Commons Net #350
Posted by Apache Jenkins Server <je...@builds.apache.org>.
See <https://ci-builds.apache.org/job/Commons/job/commons-net-windows/commons-net$commons-net/350/display/redirect?page=changes>
Changes:
[garydgregory] Add github.autolink_jira
------------------------------------------
Established TCP socket on 56915
maven35-agent.jar already up to date
maven35-interceptor.jar already up to date
maven3-interceptor-commons.jar already up to date
<===[JENKINS REMOTING CAPACITY]===> channel started
Executing Maven: -B -f <https://ci-builds.apache.org/job/Commons/job/commons-net-windows/commons-net$commons-net/ws/pom.xml> -V clean install --no-transfer-progress --batch-mode -Pjava-1.8
[1mApache Maven 3.9.16 (2bdd9fddda4b155ebf8000e807eb73fd829a51d5)[m
Maven home: F:\jenkins\tools\maven\latest
Java version: 17.0.7, vendor: Eclipse Adoptium, runtime: F:\jenkins\tools\java\latest17
Default locale: en_US, platform encoding: Cp1252
OS name: "windows server 2019", version: "10.0", arch: "amd64", family: "windows"
[INFO] Scanning for projects...
[HUDSON] Collecting dependencies info
[INFO]
[INFO] ----------------------< commons-net:commons-net >-----------------------
[INFO] Building Apache Commons Net 3.13.1-SNAPSHOT
[INFO] from pom.xml
[INFO] --------------------------------[ jar ]---------------------------------
[INFO]
[INFO] --- clean:3.5.0:clean (default-clean) @ commons-net ---
[INFO]
[INFO] --- enforcer:3.6.3:enforce (enforce-maven-version) @ commons-net ---
[INFO] Rule 0: org.apache.maven.enforcer.rules.version.RequireMavenVersion passed
[INFO]
[INFO] --- enforcer:3.6.3:enforce (enforce-java-version) @ commons-net ---
[INFO] Rule 0: org.apache.maven.enforcer.rules.version.RequireJavaVersion passed
[INFO]
[INFO] --- apache-rat:0.18:check (rat-check) @ commons-net ---
[ERROR] Could not create report parent directory <https://ci-builds.apache.org/job/Commons/job/commons-net-windows/commons-net$commons-net/ws/f>:\jenkins\jenkins-home\712657a4\workspace\Commons\commons-net-windows\target\rat.txt
[WARNING] Unable to create directory: <https://ci-builds.apache.org/job/Commons/job/commons-net-windows/commons-net$commons-net/ws/f>:\jenkins\jenkins-home\712657a4\workspace\Commons\commons-net-windows\target
[WARNING] Attempt to (de-)serialize anonymous class org.jfrog.hudson.maven2.MavenDependenciesRecorder$1; see: https://jenkins.io/redirect/serialization-of-anonymous-classes/
Build failed in Jenkins: Commons » commons-net-windows » Apache Commons Net #349
Posted by Apache Jenkins Server <je...@builds.apache.org>.
See <https://ci-builds.apache.org/job/Commons/job/commons-net-windows/commons-net$commons-net/349/display/redirect?page=changes>
Changes:
[garydgregory] Add Java 27 to GH CI
------------------------------------------
Established TCP socket on 56258
maven35-agent.jar already up to date
maven35-interceptor.jar already up to date
maven3-interceptor-commons.jar already up to date
<===[JENKINS REMOTING CAPACITY]===> channel started
Executing Maven: -B -f <https://ci-builds.apache.org/job/Commons/job/commons-net-windows/commons-net$commons-net/ws/pom.xml> -V clean install --no-transfer-progress --batch-mode -Pjava-1.8
[1mApache Maven 3.9.16 (2bdd9fddda4b155ebf8000e807eb73fd829a51d5)[m
Maven home: F:\jenkins\tools\maven\latest
Java version: 17.0.7, vendor: Eclipse Adoptium, runtime: F:\jenkins\tools\java\latest17
Default locale: en_US, platform encoding: Cp1252
OS name: "windows server 2019", version: "10.0", arch: "amd64", family: "windows"
[INFO] Scanning for projects...
[HUDSON] Collecting dependencies info
[INFO]
[INFO] ----------------------< commons-net:commons-net >-----------------------
[INFO] Building Apache Commons Net 3.13.1-SNAPSHOT
[INFO] from pom.xml
[INFO] --------------------------------[ jar ]---------------------------------
[INFO] Downloading from central: https://repo.maven.apache.org/maven2/org/apache/commons/commons-lang3/3.21.0/commons-lang3-3.21.0.pom
[INFO] Downloaded from central: https://repo.maven.apache.org/maven2/org/apache/commons/commons-lang3/3.21.0/commons-lang3-3.21.0.pom (36 kB at 73 kB/s)
[INFO] Downloading from central: https://repo.maven.apache.org/maven2/org/apache/commons/commons-lang3/3.21.0/commons-lang3-3.21.0.jar
[INFO] Downloaded from central: https://repo.maven.apache.org/maven2/org/apache/commons/commons-lang3/3.21.0/commons-lang3-3.21.0.jar (749 kB at 4.3 MB/s)
[INFO]
[INFO] --- clean:3.5.0:clean (default-clean) @ commons-net ---
[INFO]
[INFO] --- enforcer:3.6.3:enforce (enforce-maven-version) @ commons-net ---
[INFO] Rule 0: org.apache.maven.enforcer.rules.version.RequireMavenVersion passed
[INFO]
[INFO] --- enforcer:3.6.3:enforce (enforce-java-version) @ commons-net ---
[INFO] Rule 0: org.apache.maven.enforcer.rules.version.RequireJavaVersion passed
[INFO]
[INFO] --- apache-rat:0.18:check (rat-check) @ commons-net ---
[ERROR] Could not create report parent directory <https://ci-builds.apache.org/job/Commons/job/commons-net-windows/commons-net$commons-net/ws/f>:\jenkins\jenkins-home\712657a4\workspace\Commons\commons-net-windows\target\rat.txt
[WARNING] Unable to create directory: <https://ci-builds.apache.org/job/Commons/job/commons-net-windows/commons-net$commons-net/ws/f>:\jenkins\jenkins-home\712657a4\workspace\Commons\commons-net-windows\target
[WARNING] Attempt to (de-)serialize anonymous class org.jfrog.hudson.maven2.MavenDependenciesRecorder$1; see: https://jenkins.io/redirect/serialization-of-anonymous-classes/
Build failed in Jenkins: Commons » commons-net-windows » Apache Commons Net #348
Posted by Apache Jenkins Server <je...@builds.apache.org>.
See <https://ci-builds.apache.org/job/Commons/job/commons-net-windows/commons-net$commons-net/348/display/redirect?page=changes>
Changes:
[github] Bump org.apache.commons:commons-lang3 from 3.20.0 to 3.21.0 (#409)
[garydgregory] [test] Bump org.apache.commons:commons-lang3 from 3.20.0 to 3.21.0
------------------------------------------
Established TCP socket on 58213
maven35-agent.jar already up to date
maven35-interceptor.jar already up to date
maven3-interceptor-commons.jar already up to date
<===[JENKINS REMOTING CAPACITY]===> channel started
Executing Maven: -B -f <https://ci-builds.apache.org/job/Commons/job/commons-net-windows/commons-net$commons-net/ws/pom.xml> -V clean install --no-transfer-progress --batch-mode -Pjava-1.8
[1mApache Maven 3.9.16 (2bdd9fddda4b155ebf8000e807eb73fd829a51d5)[m
Maven home: F:\jenkins\tools\maven\latest
Java version: 17.0.7, vendor: Eclipse Adoptium, runtime: F:\jenkins\tools\java\latest17
Default locale: en_US, platform encoding: Cp1252
OS name: "windows server 2019", version: "10.0", arch: "amd64", family: "windows"
[INFO] Scanning for projects...
[HUDSON] Collecting dependencies info
[INFO]
[INFO] ----------------------< commons-net:commons-net >-----------------------
[INFO] Building Apache Commons Net 3.13.1-SNAPSHOT
[INFO] from pom.xml
[INFO] --------------------------------[ jar ]---------------------------------
[INFO] Downloading from central: https://repo.maven.apache.org/maven2/org/apache/felix/maven-bundle-plugin/6.1.2/maven-bundle-plugin-6.1.2.pom
[INFO] Downloaded from central: https://repo.maven.apache.org/maven2/org/apache/felix/maven-bundle-plugin/6.1.2/maven-bundle-plugin-6.1.2.pom (12 kB at 25 kB/s)
[INFO] Downloading from central: https://repo.maven.apache.org/maven2/org/apache/felix/maven-bundle-plugin/6.1.2/maven-bundle-plugin-6.1.2.jar
[INFO] Downloaded from central: https://repo.maven.apache.org/maven2/org/apache/felix/maven-bundle-plugin/6.1.2/maven-bundle-plugin-6.1.2.jar (215 kB at 1.5 MB/s)
[INFO] Downloading from central: https://repo.maven.apache.org/maven2/org/cyclonedx/cyclonedx-maven-plugin/2.9.3/cyclonedx-maven-plugin-2.9.3.pom
[INFO] Downloaded from central: https://repo.maven.apache.org/maven2/org/cyclonedx/cyclonedx-maven-plugin/2.9.3/cyclonedx-maven-plugin-2.9.3.pom (19 kB at 235 kB/s)
[INFO] Downloading from central: https://repo.maven.apache.org/maven2/org/cyclonedx/cyclonedx-maven-plugin/2.9.3/cyclonedx-maven-plugin-2.9.3.jar
[INFO] Downloaded from central: https://repo.maven.apache.org/maven2/org/cyclonedx/cyclonedx-maven-plugin/2.9.3/cyclonedx-maven-plugin-2.9.3.jar (52 kB at 636 kB/s)
[INFO] Downloading from central: https://repo.maven.apache.org/maven2/org/spdx/spdx-maven-plugin/1.0.4/spdx-maven-plugin-1.0.4.pom
[INFO] Downloaded from central: https://repo.maven.apache.org/maven2/org/spdx/spdx-maven-plugin/1.0.4/spdx-maven-plugin-1.0.4.pom (14 kB at 129 kB/s)
[INFO] Downloading from central: https://repo.maven.apache.org/maven2/org/spdx/spdx-maven-plugin/1.0.4/spdx-maven-plugin-1.0.4.jar
[INFO] Downloaded from central: https://repo.maven.apache.org/maven2/org/spdx/spdx-maven-plugin/1.0.4/spdx-maven-plugin-1.0.4.jar (181 kB at 1.9 MB/s)
[INFO] Downloading from central: https://repo.maven.apache.org/maven2/org/apache/commons/commons-lang3/3.21.0/commons-lang3-3.21.0.pom
[INFO] Downloaded from central: https://repo.maven.apache.org/maven2/org/apache/commons/commons-lang3/3.21.0/commons-lang3-3.21.0.pom (36 kB at 434 kB/s)
[INFO] Downloading from central: https://repo.maven.apache.org/maven2/org/apache/commons/commons-collections4/4.6.0/commons-collections4-4.6.0.pom
[INFO] Downloaded from central: https://repo.maven.apache.org/maven2/org/apache/commons/commons-collections4/4.6.0/commons-collections4-4.6.0.pom (28 kB at 347 kB/s)
[INFO] Downloading from central: https://repo.maven.apache.org/maven2/org/apache/commons/commons-lang3/3.21.0/commons-lang3-3.21.0.jar
[INFO] Downloaded from central: https://repo.maven.apache.org/maven2/org/apache/commons/commons-lang3/3.21.0/commons-lang3-3.21.0.jar (749 kB at 6.5 MB/s)
[INFO] Downloading from central: https://repo.maven.apache.org/maven2/org/apache/commons/commons-collections4/4.6.0/commons-collections4-4.6.0.jar
[INFO] Downloaded from central: https://repo.maven.apache.org/maven2/org/apache/commons/commons-collections4/4.6.0/commons-collections4-4.6.0.jar (934 kB at 7.2 MB/s)
[INFO]
[INFO] --- clean:3.5.0:clean (default-clean) @ commons-net ---
[INFO]
[INFO] --- enforcer:3.6.3:enforce (enforce-maven-version) @ commons-net ---
[INFO] Rule 0: org.apache.maven.enforcer.rules.version.RequireMavenVersion passed
[INFO]
[INFO] --- enforcer:3.6.3:enforce (enforce-java-version) @ commons-net ---
[INFO] Rule 0: org.apache.maven.enforcer.rules.version.RequireJavaVersion passed
[INFO]
[INFO] --- apache-rat:0.18:check (rat-check) @ commons-net ---
[ERROR] Could not create report parent directory <https://ci-builds.apache.org/job/Commons/job/commons-net-windows/commons-net$commons-net/ws/f>:\jenkins\jenkins-home\712657a4\workspace\Commons\commons-net-windows\target\rat.txt
[WARNING] Unable to create directory: <https://ci-builds.apache.org/job/Commons/job/commons-net-windows/commons-net$commons-net/ws/f>:\jenkins\jenkins-home\712657a4\workspace\Commons\commons-net-windows\target
[WARNING] Attempt to (de-)serialize anonymous class org.jfrog.hudson.maven2.MavenDependenciesRecorder$1; see: https://jenkins.io/redirect/serialization-of-anonymous-classes/
Build failed in Jenkins: Commons » commons-net-windows » Apache Commons Net #347
Posted by Apache Jenkins Server <je...@builds.apache.org>.
See <https://ci-builds.apache.org/job/Commons/job/commons-net-windows/commons-net$commons-net/347/display/redirect?page=changes>
Changes:
[garydgregory] Bump github/codeql-action from 4.38.1 to 4.38.2
------------------------------------------
Established TCP socket on 53584
maven35-agent.jar already up to date
maven35-interceptor.jar already up to date
maven3-interceptor-commons.jar already up to date
<===[JENKINS REMOTING CAPACITY]===> channel started
Executing Maven: -B -f <https://ci-builds.apache.org/job/Commons/job/commons-net-windows/commons-net$commons-net/ws/pom.xml> -V clean install --no-transfer-progress --batch-mode -Pjava-1.8
[1mApache Maven 3.9.16 (2bdd9fddda4b155ebf8000e807eb73fd829a51d5)[m
Maven home: F:\jenkins\tools\maven\latest
Java version: 17.0.7, vendor: Eclipse Adoptium, runtime: F:\jenkins\tools\java\latest17
Default locale: en_US, platform encoding: Cp1252
OS name: "windows server 2019", version: "10.0", arch: "amd64", family: "windows"
[INFO] Scanning for projects...
[HUDSON] Collecting dependencies info
[INFO]
[INFO] ----------------------< commons-net:commons-net >-----------------------
[INFO] Building Apache Commons Net 3.13.1-SNAPSHOT
[INFO] from pom.xml
[INFO] --------------------------------[ jar ]---------------------------------
[INFO] Downloading from central: https://repo.maven.apache.org/maven2/org/apache/maven/plugins/maven-compiler-plugin/3.16.0/maven-compiler-plugin-3.16.0.pom
[INFO] Downloaded from central: https://repo.maven.apache.org/maven2/org/apache/maven/plugins/maven-compiler-plugin/3.16.0/maven-compiler-plugin-3.16.0.pom (9.7 kB at 21 kB/s)
[INFO] Downloading from central: https://repo.maven.apache.org/maven2/org/apache/maven/plugins/maven-compiler-plugin/3.16.0/maven-compiler-plugin-3.16.0.jar
[INFO] Downloaded from central: https://repo.maven.apache.org/maven2/org/apache/maven/plugins/maven-compiler-plugin/3.16.0/maven-compiler-plugin-3.16.0.jar (98 kB at 920 kB/s)
[INFO] Downloading from central: https://repo.maven.apache.org/maven2/org/apache/felix/maven-bundle-plugin/6.1.2/maven-bundle-plugin-6.1.2.pom
[INFO] Downloaded from central: https://repo.maven.apache.org/maven2/org/apache/felix/maven-bundle-plugin/6.1.2/maven-bundle-plugin-6.1.2.pom (12 kB at 139 kB/s)
[INFO] Downloading from central: https://repo.maven.apache.org/maven2/org/apache/felix/maven-bundle-plugin/6.1.2/maven-bundle-plugin-6.1.2.jar
[INFO] Downloaded from central: https://repo.maven.apache.org/maven2/org/apache/felix/maven-bundle-plugin/6.1.2/maven-bundle-plugin-6.1.2.jar (215 kB at 2.5 MB/s)
[INFO] Downloading from central: https://repo.maven.apache.org/maven2/org/apache/maven/plugins/maven-surefire-plugin/3.6.0/maven-surefire-plugin-3.6.0.pom
[INFO] Downloaded from central: https://repo.maven.apache.org/maven2/org/apache/maven/plugins/maven-surefire-plugin/3.6.0/maven-surefire-plugin-3.6.0.pom (4.3 kB at 77 kB/s)
[INFO] Downloading from central: https://repo.maven.apache.org/maven2/org/apache/maven/surefire/surefire/3.6.0/surefire-3.6.0.pom
[INFO] Downloaded from central: https://repo.maven.apache.org/maven2/org/apache/maven/surefire/surefire/3.6.0/surefire-3.6.0.pom (21 kB at 267 kB/s)
[INFO] Downloading from central: https://repo.maven.apache.org/maven2/org/apache/maven/plugins/maven-surefire-plugin/3.6.0/maven-surefire-plugin-3.6.0.jar
[INFO] Downloaded from central: https://repo.maven.apache.org/maven2/org/apache/maven/plugins/maven-surefire-plugin/3.6.0/maven-surefire-plugin-3.6.0.jar (49 kB at 191 kB/s)
[INFO] Downloading from central: https://repo.maven.apache.org/maven2/org/cyclonedx/cyclonedx-maven-plugin/2.9.3/cyclonedx-maven-plugin-2.9.3.pom
[INFO] Downloaded from central: https://repo.maven.apache.org/maven2/org/cyclonedx/cyclonedx-maven-plugin/2.9.3/cyclonedx-maven-plugin-2.9.3.pom (19 kB at 264 kB/s)
[INFO] Downloading from central: https://repo.maven.apache.org/maven2/org/cyclonedx/cyclonedx-maven-plugin/2.9.3/cyclonedx-maven-plugin-2.9.3.jar
[INFO] Downloaded from central: https://repo.maven.apache.org/maven2/org/cyclonedx/cyclonedx-maven-plugin/2.9.3/cyclonedx-maven-plugin-2.9.3.jar (52 kB at 745 kB/s)
[INFO] Downloading from central: https://repo.maven.apache.org/maven2/org/spdx/spdx-maven-plugin/1.0.4/spdx-maven-plugin-1.0.4.pom
[INFO] Downloaded from central: https://repo.maven.apache.org/maven2/org/spdx/spdx-maven-plugin/1.0.4/spdx-maven-plugin-1.0.4.pom (14 kB at 203 kB/s)
[INFO] Downloading from central: https://repo.maven.apache.org/maven2/org/spdx/spdx-maven-plugin/1.0.4/spdx-maven-plugin-1.0.4.jar
[INFO] Downloaded from central: https://repo.maven.apache.org/maven2/org/spdx/spdx-maven-plugin/1.0.4/spdx-maven-plugin-1.0.4.jar (181 kB at 2.5 MB/s)
[INFO] Downloading from central: https://repo.maven.apache.org/maven2/org/apache/commons/commons-collections4/4.6.0/commons-collections4-4.6.0.pom
[INFO] Downloaded from central: https://repo.maven.apache.org/maven2/org/apache/commons/commons-collections4/4.6.0/commons-collections4-4.6.0.pom (28 kB at 365 kB/s)
[INFO] Downloading from central: https://repo.maven.apache.org/maven2/org/apache/commons/commons-collections4/4.6.0/commons-collections4-4.6.0.jar
[INFO] Downloaded from central: https://repo.maven.apache.org/maven2/org/apache/commons/commons-collections4/4.6.0/commons-collections4-4.6.0.jar (934 kB at 8.3 MB/s)
[INFO]
[INFO] --- clean:3.5.0:clean (default-clean) @ commons-net ---
[INFO]
[INFO] --- enforcer:3.6.3:enforce (enforce-maven-version) @ commons-net ---
[INFO] Rule 0: org.apache.maven.enforcer.rules.version.RequireMavenVersion passed
[INFO]
[INFO] --- enforcer:3.6.3:enforce (enforce-java-version) @ commons-net ---
[INFO] Rule 0: org.apache.maven.enforcer.rules.version.RequireJavaVersion passed
[INFO]
[INFO] --- apache-rat:0.18:check (rat-check) @ commons-net ---
[ERROR] Could not create report parent directory <https://ci-builds.apache.org/job/Commons/job/commons-net-windows/commons-net$commons-net/ws/f>:\jenkins\jenkins-home\712657a4\workspace\Commons\commons-net-windows\target\rat.txt
[WARNING] Unable to create directory: <https://ci-builds.apache.org/job/Commons/job/commons-net-windows/commons-net$commons-net/ws/f>:\jenkins\jenkins-home\712657a4\workspace\Commons\commons-net-windows\target
[WARNING] Attempt to (de-)serialize anonymous class org.jfrog.hudson.maven2.MavenDependenciesRecorder$1; see: https://jenkins.io/redirect/serialization-of-anonymous-classes/
Build failed in Jenkins: Commons » commons-net-windows » Apache Commons Net #346
Posted by Apache Jenkins Server <je...@builds.apache.org>.
See <https://ci-builds.apache.org/job/Commons/job/commons-net-windows/commons-net$commons-net/346/display/redirect?page=changes>
Changes:
[garydgregory] Protect main branches
------------------------------------------
Established TCP socket on 56478
maven35-agent.jar already up to date
maven35-interceptor.jar already up to date
maven3-interceptor-commons.jar already up to date
<===[JENKINS REMOTING CAPACITY]===> channel started
Executing Maven: -B -f <https://ci-builds.apache.org/job/Commons/job/commons-net-windows/commons-net$commons-net/ws/pom.xml> -V clean install --no-transfer-progress --batch-mode -Pjava-1.8
[1mApache Maven 3.9.16 (2bdd9fddda4b155ebf8000e807eb73fd829a51d5)[m
Maven home: F:\jenkins\tools\maven\latest
Java version: 17.0.7, vendor: Eclipse Adoptium, runtime: F:\jenkins\tools\java\latest17
Default locale: en_US, platform encoding: Cp1252
OS name: "windows server 2019", version: "10.0", arch: "amd64", family: "windows"
[INFO] Scanning for projects...
[HUDSON] Collecting dependencies info
[INFO]
[INFO] ----------------------< commons-net:commons-net >-----------------------
[INFO] Building Apache Commons Net 3.13.1-SNAPSHOT
[INFO] from pom.xml
[INFO] --------------------------------[ jar ]---------------------------------
[INFO] Downloading from central: https://repo.maven.apache.org/maven2/org/apache/felix/maven-bundle-plugin/6.1.2/maven-bundle-plugin-6.1.2.pom
[INFO] Downloaded from central: https://repo.maven.apache.org/maven2/org/apache/felix/maven-bundle-plugin/6.1.2/maven-bundle-plugin-6.1.2.pom (12 kB at 22 kB/s)
[INFO] Downloading from central: https://repo.maven.apache.org/maven2/org/apache/felix/maven-bundle-plugin/6.1.2/maven-bundle-plugin-6.1.2.jar
[INFO] Downloaded from central: https://repo.maven.apache.org/maven2/org/apache/felix/maven-bundle-plugin/6.1.2/maven-bundle-plugin-6.1.2.jar (215 kB at 1.4 MB/s)
[INFO] Downloading from central: https://repo.maven.apache.org/maven2/org/cyclonedx/cyclonedx-maven-plugin/2.9.3/cyclonedx-maven-plugin-2.9.3.pom
[INFO] Downloaded from central: https://repo.maven.apache.org/maven2/org/cyclonedx/cyclonedx-maven-plugin/2.9.3/cyclonedx-maven-plugin-2.9.3.pom (19 kB at 203 kB/s)
[INFO] Downloading from central: https://repo.maven.apache.org/maven2/org/cyclonedx/cyclonedx-maven-plugin/2.9.3/cyclonedx-maven-plugin-2.9.3.jar
[INFO] Downloaded from central: https://repo.maven.apache.org/maven2/org/cyclonedx/cyclonedx-maven-plugin/2.9.3/cyclonedx-maven-plugin-2.9.3.jar (52 kB at 567 kB/s)
[INFO]
[INFO] --- clean:3.5.0:clean (default-clean) @ commons-net ---
[INFO]
[INFO] --- enforcer:3.6.3:enforce (enforce-maven-version) @ commons-net ---
[INFO] Rule 0: org.apache.maven.enforcer.rules.version.RequireMavenVersion passed
[INFO]
[INFO] --- enforcer:3.6.3:enforce (enforce-java-version) @ commons-net ---
[INFO] Rule 0: org.apache.maven.enforcer.rules.version.RequireJavaVersion passed
[INFO]
[INFO] --- apache-rat:0.18:check (rat-check) @ commons-net ---
[ERROR] Could not create report parent directory <https://ci-builds.apache.org/job/Commons/job/commons-net-windows/commons-net$commons-net/ws/f>:\jenkins\jenkins-home\712657a4\workspace\Commons\commons-net-windows\target\rat.txt
[WARNING] Unable to create directory: <https://ci-builds.apache.org/job/Commons/job/commons-net-windows/commons-net$commons-net/ws/f>:\jenkins\jenkins-home\712657a4\workspace\Commons\commons-net-windows\target
[WARNING] Attempt to (de-)serialize anonymous class org.jfrog.hudson.maven2.MavenDependenciesRecorder$1; see: https://jenkins.io/redirect/serialization-of-anonymous-classes/
Build failed in Jenkins: Commons » commons-net-windows » Apache Commons Net #345
Posted by Apache Jenkins Server <je...@builds.apache.org>.
See <https://ci-builds.apache.org/job/Commons/job/commons-net-windows/commons-net$commons-net/345/display/redirect?page=changes>
Changes:
[garydgregory] Bump actions/setup-java from 6.0.0 to 6.0.1
[garydgregory] Bump github/codeql-action/* from 4.37.9 to 4.38.1
------------------------------------------
Established TCP socket on 57111
maven35-agent.jar already up to date
maven35-interceptor.jar already up to date
maven3-interceptor-commons.jar already up to date
<===[JENKINS REMOTING CAPACITY]===> channel started
Executing Maven: -B -f <https://ci-builds.apache.org/job/Commons/job/commons-net-windows/commons-net$commons-net/ws/pom.xml> -V clean install --no-transfer-progress --batch-mode -Pjava-1.8
[1mApache Maven 3.9.16 (2bdd9fddda4b155ebf8000e807eb73fd829a51d5)[m
Maven home: F:\jenkins\tools\maven\latest
Java version: 17.0.7, vendor: Eclipse Adoptium, runtime: F:\jenkins\tools\java\latest17
Default locale: en_US, platform encoding: Cp1252
OS name: "windows server 2019", version: "10.0", arch: "amd64", family: "windows"
[INFO] Scanning for projects...
[HUDSON] Collecting dependencies info
[INFO]
[INFO] ----------------------< commons-net:commons-net >-----------------------
[INFO] Building Apache Commons Net 3.13.1-SNAPSHOT
[INFO] from pom.xml
[INFO] --------------------------------[ jar ]---------------------------------
[INFO]
[INFO] --- clean:3.5.0:clean (default-clean) @ commons-net ---
[INFO]
[INFO] --- enforcer:3.6.3:enforce (enforce-maven-version) @ commons-net ---
[INFO] Rule 0: org.apache.maven.enforcer.rules.version.RequireMavenVersion passed
[INFO]
[INFO] --- enforcer:3.6.3:enforce (enforce-java-version) @ commons-net ---
[INFO] Rule 0: org.apache.maven.enforcer.rules.version.RequireJavaVersion passed
[INFO]
[INFO] --- apache-rat:0.18:check (rat-check) @ commons-net ---
[ERROR] Could not create report parent directory <https://ci-builds.apache.org/job/Commons/job/commons-net-windows/commons-net$commons-net/ws/f>:\jenkins\jenkins-home\712657a4\workspace\Commons\commons-net-windows\target\rat.txt
[WARNING] Unable to create directory: <https://ci-builds.apache.org/job/Commons/job/commons-net-windows/commons-net$commons-net/ws/f>:\jenkins\jenkins-home\712657a4\workspace\Commons\commons-net-windows\target
[WARNING] Attempt to (de-)serialize anonymous class org.jfrog.hudson.maven2.MavenDependenciesRecorder$1; see: https://jenkins.io/redirect/serialization-of-anonymous-classes/
Build failed in Jenkins: Commons » commons-net-windows » Apache Commons Net #344
Posted by Apache Jenkins Server <je...@builds.apache.org>.
See <https://ci-builds.apache.org/job/Commons/job/commons-net-windows/commons-net$commons-net/344/display/redirect?page=changes>
Changes:
[garydgregory] Bump org.apache.commons:commons-parent from 104 to 105.
------------------------------------------
Established TCP socket on 62656
maven35-agent.jar already up to date
maven35-interceptor.jar already up to date
maven3-interceptor-commons.jar already up to date
<===[JENKINS REMOTING CAPACITY]===> channel started
Executing Maven: -B -f <https://ci-builds.apache.org/job/Commons/job/commons-net-windows/commons-net$commons-net/ws/pom.xml> -V clean install --no-transfer-progress --batch-mode -Pjava-1.8
[1mApache Maven 3.9.11 (3e54c93a704957b63ee3494413a2b544fd3d825b)[m
Maven home: F:\jenkins\tools\maven\latest
Java version: 17.0.7, vendor: Eclipse Adoptium, runtime: F:\jenkins\tools\java\latest17
Default locale: en_US, platform encoding: Cp1252
OS name: "windows server 2019", version: "10.0", arch: "amd64", family: "windows"
[INFO] Scanning for projects...
[HUDSON] Collecting dependencies info
[INFO]
[INFO] ----------------------< commons-net:commons-net >-----------------------
[INFO] Building Apache Commons Net 3.13.1-SNAPSHOT
[INFO] from pom.xml
[INFO] --------------------------------[ jar ]---------------------------------
[INFO] Downloading from central: https://repo.maven.apache.org/maven2/org/apache/maven/plugins/maven-jar-plugin/3.5.1/maven-jar-plugin-3.5.1.pom
[INFO] Downloaded from central: https://repo.maven.apache.org/maven2/org/apache/maven/plugins/maven-jar-plugin/3.5.1/maven-jar-plugin-3.5.1.pom (7.6 kB at 16 kB/s)
[INFO] Downloading from central: https://repo.maven.apache.org/maven2/org/apache/maven/plugins/maven-jar-plugin/3.5.1/maven-jar-plugin-3.5.1.jar
[INFO] Downloaded from central: https://repo.maven.apache.org/maven2/org/apache/maven/plugins/maven-jar-plugin/3.5.1/maven-jar-plugin-3.5.1.jar (35 kB at 107 kB/s)
[INFO] Downloading from central: https://repo.maven.apache.org/maven2/org/apache/maven/plugins/maven-compiler-plugin/3.16.0/maven-compiler-plugin-3.16.0.pom
[INFO] Downloaded from central: https://repo.maven.apache.org/maven2/org/apache/maven/plugins/maven-compiler-plugin/3.16.0/maven-compiler-plugin-3.16.0.pom (9.7 kB at 115 kB/s)
[INFO] Downloading from central: https://repo.maven.apache.org/maven2/org/apache/maven/plugins/maven-compiler-plugin/3.16.0/maven-compiler-plugin-3.16.0.jar
[INFO] Downloaded from central: https://repo.maven.apache.org/maven2/org/apache/maven/plugins/maven-compiler-plugin/3.16.0/maven-compiler-plugin-3.16.0.jar (98 kB at 1.2 MB/s)
[INFO] Downloading from central: https://repo.maven.apache.org/maven2/org/apache/felix/maven-bundle-plugin/6.1.2/maven-bundle-plugin-6.1.2.pom
[INFO] Downloaded from central: https://repo.maven.apache.org/maven2/org/apache/felix/maven-bundle-plugin/6.1.2/maven-bundle-plugin-6.1.2.pom (12 kB at 152 kB/s)
[INFO] Downloading from central: https://repo.maven.apache.org/maven2/org/apache/felix/maven-bundle-plugin/6.1.2/maven-bundle-plugin-6.1.2.jar
[INFO] Downloaded from central: https://repo.maven.apache.org/maven2/org/apache/felix/maven-bundle-plugin/6.1.2/maven-bundle-plugin-6.1.2.jar (215 kB at 1.9 MB/s)
[INFO] Downloading from central: https://repo.maven.apache.org/maven2/org/apache/maven/plugins/maven-surefire-plugin/3.6.0/maven-surefire-plugin-3.6.0.pom
[INFO] Downloaded from central: https://repo.maven.apache.org/maven2/org/apache/maven/plugins/maven-surefire-plugin/3.6.0/maven-surefire-plugin-3.6.0.pom (4.3 kB at 69 kB/s)
[INFO] Downloading from central: https://repo.maven.apache.org/maven2/org/apache/maven/surefire/surefire/3.6.0/surefire-3.6.0.pom
[INFO] Downloaded from central: https://repo.maven.apache.org/maven2/org/apache/maven/surefire/surefire/3.6.0/surefire-3.6.0.pom (21 kB at 293 kB/s)
[INFO] Downloading from central: https://repo.maven.apache.org/maven2/org/apache/maven/plugins/maven-surefire-plugin/3.6.0/maven-surefire-plugin-3.6.0.jar
[INFO] Downloaded from central: https://repo.maven.apache.org/maven2/org/apache/maven/plugins/maven-surefire-plugin/3.6.0/maven-surefire-plugin-3.6.0.jar (49 kB at 195 kB/s)
[INFO] Downloading from central: https://repo.maven.apache.org/maven2/org/cyclonedx/cyclonedx-maven-plugin/2.9.3/cyclonedx-maven-plugin-2.9.3.pom
[INFO] Downloaded from central: https://repo.maven.apache.org/maven2/org/cyclonedx/cyclonedx-maven-plugin/2.9.3/cyclonedx-maven-plugin-2.9.3.pom (19 kB at 190 kB/s)
[INFO] Downloading from central: https://repo.maven.apache.org/maven2/org/cyclonedx/cyclonedx-maven-plugin/2.9.3/cyclonedx-maven-plugin-2.9.3.jar
[INFO] Downloaded from central: https://repo.maven.apache.org/maven2/org/cyclonedx/cyclonedx-maven-plugin/2.9.3/cyclonedx-maven-plugin-2.9.3.jar (52 kB at 755 kB/s)
[INFO] Downloading from central: https://repo.maven.apache.org/maven2/org/spdx/spdx-maven-plugin/1.0.4/spdx-maven-plugin-1.0.4.pom
[INFO] Downloaded from central: https://repo.maven.apache.org/maven2/org/spdx/spdx-maven-plugin/1.0.4/spdx-maven-plugin-1.0.4.pom (14 kB at 203 kB/s)
[INFO] Downloading from central: https://repo.maven.apache.org/maven2/org/spdx/spdx-maven-plugin/1.0.4/spdx-maven-plugin-1.0.4.jar
[INFO] Downloaded from central: https://repo.maven.apache.org/maven2/org/spdx/spdx-maven-plugin/1.0.4/spdx-maven-plugin-1.0.4.jar (181 kB at 2.5 MB/s)
[INFO] Downloading from central: https://repo.maven.apache.org/maven2/org/apache/commons/commons-collections4/4.6.0/commons-collections4-4.6.0.pom
[INFO] Downloaded from central: https://repo.maven.apache.org/maven2/org/apache/commons/commons-collections4/4.6.0/commons-collections4-4.6.0.pom (28 kB at 339 kB/s)
[INFO] Downloading from central: https://repo.maven.apache.org/maven2/org/apache/commons/commons-collections4/4.6.0/commons-collections4-4.6.0.jar
[INFO] Downloaded from central: https://repo.maven.apache.org/maven2/org/apache/commons/commons-collections4/4.6.0/commons-collections4-4.6.0.jar (934 kB at 8.0 MB/s)
[INFO]
[INFO] --- clean:3.5.0:clean (default-clean) @ commons-net ---
[INFO]
[INFO] --- enforcer:3.6.3:enforce (enforce-maven-version) @ commons-net ---
[INFO] Rule 0: org.apache.maven.enforcer.rules.version.RequireMavenVersion passed
[INFO]
[INFO] --- enforcer:3.6.3:enforce (enforce-java-version) @ commons-net ---
[INFO] Rule 0: org.apache.maven.enforcer.rules.version.RequireJavaVersion passed
[INFO]
[INFO] --- apache-rat:0.18:check (rat-check) @ commons-net ---
[ERROR] Could not create report parent directory <https://ci-builds.apache.org/job/Commons/job/commons-net-windows/commons-net$commons-net/ws/f>:\jenkins\jenkins-home\712657a4\workspace\Commons\commons-net-windows\target\rat.txt
[WARNING] Unable to create directory: <https://ci-builds.apache.org/job/Commons/job/commons-net-windows/commons-net$commons-net/ws/f>:\jenkins\jenkins-home\712657a4\workspace\Commons\commons-net-windows\target
[WARNING] Attempt to (de-)serialize anonymous class org.jfrog.hudson.maven2.MavenDependenciesRecorder$1; see: https://jenkins.io/redirect/serialization-of-anonymous-classes/
Build failed in Jenkins: Commons » commons-net-windows » Apache Commons Net #343
Posted by Apache Jenkins Server <je...@builds.apache.org>.
See <https://ci-builds.apache.org/job/Commons/job/commons-net-windows/commons-net$commons-net/343/display/redirect?page=changes>
Changes:
[garydgregory] Bump github/codeql-action/analyze from 4.37.8 to 4.37.9.
------------------------------------------
Established TCP socket on 57098
maven35-agent.jar already up to date
maven35-interceptor.jar already up to date
maven3-interceptor-commons.jar already up to date
<===[JENKINS REMOTING CAPACITY]===> channel started
Executing Maven: -B -f <https://ci-builds.apache.org/job/Commons/job/commons-net-windows/commons-net$commons-net/ws/pom.xml> -V clean install --no-transfer-progress --batch-mode -Pjava-1.8
[1mApache Maven 3.9.11 (3e54c93a704957b63ee3494413a2b544fd3d825b)[m
Maven home: F:\jenkins\tools\maven\latest
Java version: 17.0.7, vendor: Eclipse Adoptium, runtime: F:\jenkins\tools\java\latest17
Default locale: en_US, platform encoding: Cp1252
OS name: "windows server 2019", version: "10.0", arch: "amd64", family: "windows"
[INFO] Scanning for projects...
[HUDSON] Collecting dependencies info
[INFO]
[INFO] ----------------------< commons-net:commons-net >-----------------------
[INFO] Building Apache Commons Net 3.13.1-SNAPSHOT
[INFO] from pom.xml
[INFO] --------------------------------[ jar ]---------------------------------
[INFO]
[INFO] --- clean:3.5.0:clean (default-clean) @ commons-net ---
[INFO]
[INFO] --- enforcer:3.6.3:enforce (enforce-maven-version) @ commons-net ---
[INFO] Rule 0: org.apache.maven.enforcer.rules.version.RequireMavenVersion passed
[INFO]
[INFO] --- enforcer:3.6.3:enforce (enforce-java-version) @ commons-net ---
[INFO] Rule 0: org.apache.maven.enforcer.rules.version.RequireJavaVersion passed
[INFO]
[INFO] --- apache-rat:0.18:check (rat-check) @ commons-net ---
[ERROR] Could not create report parent directory <https://ci-builds.apache.org/job/Commons/job/commons-net-windows/commons-net$commons-net/ws/f>:\jenkins\jenkins-home\712657a4\workspace\Commons\commons-net-windows\target\rat.txt
[WARNING] Unable to create directory: <https://ci-builds.apache.org/job/Commons/job/commons-net-windows/commons-net$commons-net/ws/f>:\jenkins\jenkins-home\712657a4\workspace\Commons\commons-net-windows\target
[WARNING] Attempt to (de-)serialize anonymous class org.jfrog.hudson.maven2.MavenDependenciesRecorder$1; see: https://jenkins.io/redirect/serialization-of-anonymous-classes/
Build failed in Jenkins: Commons » commons-net-windows » Apache Commons Net #342
Posted by Apache Jenkins Server <je...@builds.apache.org>.
See <https://ci-builds.apache.org/job/Commons/job/commons-net-windows/commons-net$commons-net/342/display/redirect?page=changes>
Changes:
[garydgregory] Bump actions/setup-java from 5.7.0 to 6.0.0.
------------------------------------------
Established TCP socket on 54276
maven35-agent.jar already up to date
maven35-interceptor.jar already up to date
maven3-interceptor-commons.jar already up to date
<===[JENKINS REMOTING CAPACITY]===> channel started
Executing Maven: -B -f <https://ci-builds.apache.org/job/Commons/job/commons-net-windows/commons-net$commons-net/ws/pom.xml> -V clean install --no-transfer-progress --batch-mode -Pjava-1.8
[1mApache Maven 3.9.11 (3e54c93a704957b63ee3494413a2b544fd3d825b)[m
Maven home: F:\jenkins\tools\maven\latest
Java version: 17.0.7, vendor: Eclipse Adoptium, runtime: F:\jenkins\tools\java\latest17
Default locale: en_US, platform encoding: Cp1252
OS name: "windows server 2019", version: "10.0", arch: "amd64", family: "windows"
[INFO] Scanning for projects...
[HUDSON] Collecting dependencies info
[INFO]
[INFO] ----------------------< commons-net:commons-net >-----------------------
[INFO] Building Apache Commons Net 3.13.1-SNAPSHOT
[INFO] from pom.xml
[INFO] --------------------------------[ jar ]---------------------------------
[INFO] Downloading from central: https://repo.maven.apache.org/maven2/org/apache/maven/plugins/maven-jar-plugin/3.5.1/maven-jar-plugin-3.5.1.pom
[INFO] Downloaded from central: https://repo.maven.apache.org/maven2/org/apache/maven/plugins/maven-jar-plugin/3.5.1/maven-jar-plugin-3.5.1.pom (7.6 kB at 15 kB/s)
[INFO] Downloading from central: https://repo.maven.apache.org/maven2/org/apache/maven/plugins/maven-jar-plugin/3.5.1/maven-jar-plugin-3.5.1.jar
[INFO] Downloaded from central: https://repo.maven.apache.org/maven2/org/apache/maven/plugins/maven-jar-plugin/3.5.1/maven-jar-plugin-3.5.1.jar (35 kB at 83 kB/s)
[INFO] Downloading from central: https://repo.maven.apache.org/maven2/org/apache/commons/commons-collections4/4.6.0/commons-collections4-4.6.0.pom
[INFO] Downloaded from central: https://repo.maven.apache.org/maven2/org/apache/commons/commons-collections4/4.6.0/commons-collections4-4.6.0.pom (28 kB at 280 kB/s)
[INFO] Downloading from central: https://repo.maven.apache.org/maven2/org/apache/commons/commons-collections4/4.6.0/commons-collections4-4.6.0.jar
[INFO] Downloaded from central: https://repo.maven.apache.org/maven2/org/apache/commons/commons-collections4/4.6.0/commons-collections4-4.6.0.jar (934 kB at 5.9 MB/s)
[INFO]
[INFO] --- clean:3.5.0:clean (default-clean) @ commons-net ---
[INFO]
[INFO] --- enforcer:3.6.3:enforce (enforce-maven-version) @ commons-net ---
[INFO] Rule 0: org.apache.maven.enforcer.rules.version.RequireMavenVersion passed
[INFO]
[INFO] --- enforcer:3.6.3:enforce (enforce-java-version) @ commons-net ---
[INFO] Rule 0: org.apache.maven.enforcer.rules.version.RequireJavaVersion passed
[INFO]
[INFO] --- apache-rat:0.18:check (rat-check) @ commons-net ---
[ERROR] Could not create report parent directory <https://ci-builds.apache.org/job/Commons/job/commons-net-windows/commons-net$commons-net/ws/f>:\jenkins\jenkins-home\712657a4\workspace\Commons\commons-net-windows\target\rat.txt
[WARNING] Unable to create directory: <https://ci-builds.apache.org/job/Commons/job/commons-net-windows/commons-net$commons-net/ws/f>:\jenkins\jenkins-home\712657a4\workspace\Commons\commons-net-windows\target
[WARNING] Attempt to (de-)serialize anonymous class org.jfrog.hudson.maven2.MavenDependenciesRecorder$1; see: https://jenkins.io/redirect/serialization-of-anonymous-classes/
Build failed in Jenkins: Commons » commons-net-windows » Apache Commons Net #341
Posted by Apache Jenkins Server <je...@builds.apache.org>.
See <https://ci-builds.apache.org/job/Commons/job/commons-net-windows/commons-net$commons-net/341/display/redirect?page=changes>
Changes:
[garydgregory] Bump github/codeql-action/init from 4.37.7 to 4.37.8
------------------------------------------
Established TCP socket on 62545
maven35-agent.jar already up to date
maven35-interceptor.jar already up to date
maven3-interceptor-commons.jar already up to date
<===[JENKINS REMOTING CAPACITY]===> channel started
Executing Maven: -B -f <https://ci-builds.apache.org/job/Commons/job/commons-net-windows/commons-net$commons-net/ws/pom.xml> -V clean install --no-transfer-progress --batch-mode -Pjava-1.8
[1mApache Maven 3.9.11 (3e54c93a704957b63ee3494413a2b544fd3d825b)[m
Maven home: F:\jenkins\tools\maven\latest
Java version: 17.0.7, vendor: Eclipse Adoptium, runtime: F:\jenkins\tools\java\latest17
Default locale: en_US, platform encoding: Cp1252
OS name: "windows server 2019", version: "10.0", arch: "amd64", family: "windows"
[INFO] Scanning for projects...
[HUDSON] Collecting dependencies info
[INFO]
[INFO] ----------------------< commons-net:commons-net >-----------------------
[INFO] Building Apache Commons Net 3.13.1-SNAPSHOT
[INFO] from pom.xml
[INFO] --------------------------------[ jar ]---------------------------------
[INFO]
[INFO] --- clean:3.5.0:clean (default-clean) @ commons-net ---
[INFO]
[INFO] --- enforcer:3.6.3:enforce (enforce-maven-version) @ commons-net ---
[INFO] Rule 0: org.apache.maven.enforcer.rules.version.RequireMavenVersion passed
[INFO]
[INFO] --- enforcer:3.6.3:enforce (enforce-java-version) @ commons-net ---
[INFO] Rule 0: org.apache.maven.enforcer.rules.version.RequireJavaVersion passed
[INFO]
[INFO] --- apache-rat:0.18:check (rat-check) @ commons-net ---
[ERROR] Could not create report parent directory <https://ci-builds.apache.org/job/Commons/job/commons-net-windows/commons-net$commons-net/ws/f>:\jenkins\jenkins-home\712657a4\workspace\Commons\commons-net-windows\target\rat.txt
[WARNING] Unable to create directory: <https://ci-builds.apache.org/job/Commons/job/commons-net-windows/commons-net$commons-net/ws/f>:\jenkins\jenkins-home\712657a4\workspace\Commons\commons-net-windows\target
[WARNING] Attempt to (de-)serialize anonymous class org.jfrog.hudson.maven2.MavenDependenciesRecorder$1; see: https://jenkins.io/redirect/serialization-of-anonymous-classes/
Build failed in Jenkins: Commons » commons-net-windows » Apache Commons Net #340
Posted by Apache Jenkins Server <je...@builds.apache.org>.
See <https://ci-builds.apache.org/job/Commons/job/commons-net-windows/commons-net$commons-net/340/display/redirect?page=changes>
Changes:
[garydgregory] Bump org.apache.commons:commons-parent from 103 to 104.
------------------------------------------
Established TCP socket on 55047
maven35-agent.jar already up to date
maven35-interceptor.jar already up to date
maven3-interceptor-commons.jar already up to date
<===[JENKINS REMOTING CAPACITY]===> channel started
Executing Maven: -B -f <https://ci-builds.apache.org/job/Commons/job/commons-net-windows/commons-net$commons-net/ws/pom.xml> -V clean install --no-transfer-progress --batch-mode -Pjava-1.8
[1mApache Maven 3.9.11 (3e54c93a704957b63ee3494413a2b544fd3d825b)[m
Maven home: F:\jenkins\tools\maven\latest
Java version: 17.0.7, vendor: Eclipse Adoptium, runtime: F:\jenkins\tools\java\latest17
Default locale: en_US, platform encoding: Cp1252
OS name: "windows server 2019", version: "10.0", arch: "amd64", family: "windows"
[INFO] Scanning for projects...
[HUDSON] Collecting dependencies info
[INFO]
[INFO] ----------------------< commons-net:commons-net >-----------------------
[INFO] Building Apache Commons Net 3.13.1-SNAPSHOT
[INFO] from pom.xml
[INFO] --------------------------------[ jar ]---------------------------------
[INFO] Downloading from central: https://repo.maven.apache.org/maven2/org/apache/maven/plugins/maven-jar-plugin/3.5.1/maven-jar-plugin-3.5.1.pom
[INFO] Downloaded from central: https://repo.maven.apache.org/maven2/org/apache/maven/plugins/maven-jar-plugin/3.5.1/maven-jar-plugin-3.5.1.pom (7.6 kB at 16 kB/s)
[INFO] Downloading from central: https://repo.maven.apache.org/maven2/org/apache/maven/plugins/maven-jar-plugin/3.5.1/maven-jar-plugin-3.5.1.jar
[INFO] Downloaded from central: https://repo.maven.apache.org/maven2/org/apache/maven/plugins/maven-jar-plugin/3.5.1/maven-jar-plugin-3.5.1.jar (35 kB at 76 kB/s)
[INFO]
[INFO] --- clean:3.5.0:clean (default-clean) @ commons-net ---
[INFO]
[INFO] --- enforcer:3.6.3:enforce (enforce-maven-version) @ commons-net ---
[INFO] Rule 0: org.apache.maven.enforcer.rules.version.RequireMavenVersion passed
[INFO]
[INFO] --- enforcer:3.6.3:enforce (enforce-java-version) @ commons-net ---
[INFO] Rule 0: org.apache.maven.enforcer.rules.version.RequireJavaVersion passed
[INFO]
[INFO] --- apache-rat:0.18:check (rat-check) @ commons-net ---
[ERROR] Could not create report parent directory <https://ci-builds.apache.org/job/Commons/job/commons-net-windows/commons-net$commons-net/ws/f>:\jenkins\jenkins-home\712657a4\workspace\Commons\commons-net-windows\target\rat.txt
[WARNING] Unable to create directory: <https://ci-builds.apache.org/job/Commons/job/commons-net-windows/commons-net$commons-net/ws/f>:\jenkins\jenkins-home\712657a4\workspace\Commons\commons-net-windows\target
[WARNING] Attempt to (de-)serialize anonymous class org.jfrog.hudson.maven2.MavenDependenciesRecorder$1; see: https://jenkins.io/redirect/serialization-of-anonymous-classes/
Build failed in Jenkins: Commons » commons-net-windows » Apache Commons Net #339
Posted by Apache Jenkins Server <je...@builds.apache.org>.
See <https://ci-builds.apache.org/job/Commons/job/commons-net-windows/commons-net$commons-net/339/display/redirect?page=changes>
Changes:
[garydgregory] Bump codeql-action from 4.37.6 to 4.37.7
------------------------------------------
Established TCP socket on 50269
maven35-agent.jar already up to date
maven35-interceptor.jar already up to date
maven3-interceptor-commons.jar already up to date
<===[JENKINS REMOTING CAPACITY]===> channel started
Executing Maven: -B -f <https://ci-builds.apache.org/job/Commons/job/commons-net-windows/commons-net$commons-net/ws/pom.xml> -V clean install --no-transfer-progress --batch-mode -Pjava-1.8
[1mApache Maven 3.9.11 (3e54c93a704957b63ee3494413a2b544fd3d825b)[m
Maven home: F:\jenkins\tools\maven\latest
Java version: 17.0.7, vendor: Eclipse Adoptium, runtime: F:\jenkins\tools\java\latest17
Default locale: en_US, platform encoding: Cp1252
OS name: "windows server 2019", version: "10.0", arch: "amd64", family: "windows"
[INFO] Scanning for projects...
[HUDSON] Collecting dependencies info
[INFO]
[INFO] ----------------------< commons-net:commons-net >-----------------------
[INFO] Building Apache Commons Net 3.13.1-SNAPSHOT
[INFO] from pom.xml
[INFO] --------------------------------[ jar ]---------------------------------
[INFO]
[INFO] --- clean:3.5.0:clean (default-clean) @ commons-net ---
[INFO]
[INFO] --- enforcer:3.6.3:enforce (enforce-maven-version) @ commons-net ---
[INFO] Rule 0: org.apache.maven.enforcer.rules.version.RequireMavenVersion passed
[INFO]
[INFO] --- enforcer:3.6.3:enforce (enforce-java-version) @ commons-net ---
[INFO] Rule 0: org.apache.maven.enforcer.rules.version.RequireJavaVersion passed
[INFO]
[INFO] --- apache-rat:0.18:check (rat-check) @ commons-net ---
[ERROR] Could not create report parent directory <https://ci-builds.apache.org/job/Commons/job/commons-net-windows/commons-net$commons-net/ws/f>:\jenkins\jenkins-home\712657a4\workspace\Commons\commons-net-windows\target\rat.txt
[WARNING] Unable to create directory: <https://ci-builds.apache.org/job/Commons/job/commons-net-windows/commons-net$commons-net/ws/f>:\jenkins\jenkins-home\712657a4\workspace\Commons\commons-net-windows\target
[WARNING] Attempt to (de-)serialize anonymous class org.jfrog.hudson.maven2.MavenDependenciesRecorder$1; see: https://jenkins.io/redirect/serialization-of-anonymous-classes/
Build failed in Jenkins: Commons » commons-net-windows » Apache Commons Net #338
Posted by Apache Jenkins Server <je...@builds.apache.org>.
See <https://ci-builds.apache.org/job/Commons/job/commons-net-windows/commons-net$commons-net/338/display/redirect?page=changes>
Changes:
[github] TFTPRequestPacket now throws TFTPPacketException instead of ArrayIndexOutOfBoundsException (#407)
[garydgregory] TFTPRequestPacket now throws TFTPPacketException instead of
------------------------------------------
Established TCP socket on 51146
maven35-agent.jar already up to date
maven35-interceptor.jar already up to date
maven3-interceptor-commons.jar already up to date
<===[JENKINS REMOTING CAPACITY]===> channel started
Executing Maven: -B -f <https://ci-builds.apache.org/job/Commons/job/commons-net-windows/commons-net$commons-net/ws/pom.xml> -V clean install --no-transfer-progress --batch-mode -Pjava-1.8
[1mApache Maven 3.9.11 (3e54c93a704957b63ee3494413a2b544fd3d825b)[m
Maven home: F:\jenkins\tools\maven\latest
Java version: 17.0.7, vendor: Eclipse Adoptium, runtime: F:\jenkins\tools\java\latest17
Default locale: en_US, platform encoding: Cp1252
OS name: "windows server 2019", version: "10.0", arch: "amd64", family: "windows"
[INFO] Scanning for projects...
[HUDSON] Collecting dependencies info
[INFO]
[INFO] ----------------------< commons-net:commons-net >-----------------------
[INFO] Building Apache Commons Net 3.13.1-SNAPSHOT
[INFO] from pom.xml
[INFO] --------------------------------[ jar ]---------------------------------
[INFO] Downloading from central: https://repo.maven.apache.org/maven2/org/apache/commons/commons-collections4/4.6.0/commons-collections4-4.6.0.pom
[INFO] Downloaded from central: https://repo.maven.apache.org/maven2/org/apache/commons/commons-collections4/4.6.0/commons-collections4-4.6.0.pom (28 kB at 59 kB/s)
[INFO] Downloading from central: https://repo.maven.apache.org/maven2/org/apache/commons/commons-collections4/4.6.0/commons-collections4-4.6.0.jar
[INFO] Downloaded from central: https://repo.maven.apache.org/maven2/org/apache/commons/commons-collections4/4.6.0/commons-collections4-4.6.0.jar (934 kB at 4.2 MB/s)
[INFO]
[INFO] --- clean:3.5.0:clean (default-clean) @ commons-net ---
[INFO]
[INFO] --- enforcer:3.6.3:enforce (enforce-maven-version) @ commons-net ---
[INFO] Rule 0: org.apache.maven.enforcer.rules.version.RequireMavenVersion passed
[INFO]
[INFO] --- enforcer:3.6.3:enforce (enforce-java-version) @ commons-net ---
[INFO] Rule 0: org.apache.maven.enforcer.rules.version.RequireJavaVersion passed
[INFO]
[INFO] --- apache-rat:0.18:check (rat-check) @ commons-net ---
[ERROR] Could not create report parent directory <https://ci-builds.apache.org/job/Commons/job/commons-net-windows/commons-net$commons-net/ws/f>:\jenkins\jenkins-home\712657a4\workspace\Commons\commons-net-windows\target\rat.txt
[WARNING] Unable to create directory: <https://ci-builds.apache.org/job/Commons/job/commons-net-windows/commons-net$commons-net/ws/f>:\jenkins\jenkins-home\712657a4\workspace\Commons\commons-net-windows\target
[WARNING] Attempt to (de-)serialize anonymous class org.jfrog.hudson.maven2.MavenDependenciesRecorder$1; see: https://jenkins.io/redirect/serialization-of-anonymous-classes/
Build failed in Jenkins: Commons » commons-net-windows » Apache Commons Net #337
Posted by Apache Jenkins Server <je...@builds.apache.org>.
See <https://ci-builds.apache.org/job/Commons/job/commons-net-windows/commons-net$commons-net/337/display/redirect?page=changes>
Changes:
[garydgregory] Bump org.apache.commons:commons-collections4 from 4.5.0 to 4.6.0.
------------------------------------------
Established TCP socket on 56578
maven35-agent.jar already up to date
maven35-interceptor.jar already up to date
maven3-interceptor-commons.jar already up to date
<===[JENKINS REMOTING CAPACITY]===> channel started
Executing Maven: -B -f <https://ci-builds.apache.org/job/Commons/job/commons-net-windows/commons-net$commons-net/ws/pom.xml> -V clean install --no-transfer-progress --batch-mode -Pjava-1.8
[1mApache Maven 3.9.11 (3e54c93a704957b63ee3494413a2b544fd3d825b)[m
Maven home: F:\jenkins\tools\maven\latest
Java version: 17.0.7, vendor: Eclipse Adoptium, runtime: F:\jenkins\tools\java\latest17
Default locale: en_US, platform encoding: Cp1252
OS name: "windows server 2019", version: "10.0", arch: "amd64", family: "windows"
[INFO] Scanning for projects...
[HUDSON] Collecting dependencies info
[INFO]
[INFO] ----------------------< commons-net:commons-net >-----------------------
[INFO] Building Apache Commons Net 3.13.1-SNAPSHOT
[INFO] from pom.xml
[INFO] --------------------------------[ jar ]---------------------------------
[INFO] Downloading from central: https://repo.maven.apache.org/maven2/org/apache/commons/commons-collections4/4.6.0/commons-collections4-4.6.0.pom
[INFO] Downloaded from central: https://repo.maven.apache.org/maven2/org/apache/commons/commons-collections4/4.6.0/commons-collections4-4.6.0.pom (28 kB at 52 kB/s)
[INFO] Downloading from central: https://repo.maven.apache.org/maven2/org/apache/commons/commons-collections4/4.6.0/commons-collections4-4.6.0.jar
[INFO] Downloaded from central: https://repo.maven.apache.org/maven2/org/apache/commons/commons-collections4/4.6.0/commons-collections4-4.6.0.jar (934 kB at 4.2 MB/s)
[INFO]
[INFO] --- clean:3.5.0:clean (default-clean) @ commons-net ---
[INFO]
[INFO] --- enforcer:3.6.3:enforce (enforce-maven-version) @ commons-net ---
[INFO] Rule 0: org.apache.maven.enforcer.rules.version.RequireMavenVersion passed
[INFO]
[INFO] --- enforcer:3.6.3:enforce (enforce-java-version) @ commons-net ---
[INFO] Rule 0: org.apache.maven.enforcer.rules.version.RequireJavaVersion passed
[INFO]
[INFO] --- apache-rat:0.18:check (rat-check) @ commons-net ---
[ERROR] Could not create report parent directory <https://ci-builds.apache.org/job/Commons/job/commons-net-windows/commons-net$commons-net/ws/f>:\jenkins\jenkins-home\712657a4\workspace\Commons\commons-net-windows\target\rat.txt
[WARNING] Unable to create directory: <https://ci-builds.apache.org/job/Commons/job/commons-net-windows/commons-net$commons-net/ws/f>:\jenkins\jenkins-home\712657a4\workspace\Commons\commons-net-windows\target
[WARNING] Attempt to (de-)serialize anonymous class org.jfrog.hudson.maven2.MavenDependenciesRecorder$1; see: https://jenkins.io/redirect/serialization-of-anonymous-classes/
Build failed in Jenkins: Commons » commons-net-windows » Apache Commons Net #336
Posted by Apache Jenkins Server <je...@builds.apache.org>.
See <https://ci-builds.apache.org/job/Commons/job/commons-net-windows/commons-net$commons-net/336/display/redirect?page=changes>
Changes:
[garydgregory] Bump actions/setup-java from 5.6.0 to 5.7.0
------------------------------------------
Established TCP socket on 54136
maven35-agent.jar already up to date
maven35-interceptor.jar already up to date
maven3-interceptor-commons.jar already up to date
<===[JENKINS REMOTING CAPACITY]===> channel started
Executing Maven: -B -f <https://ci-builds.apache.org/job/Commons/job/commons-net-windows/commons-net$commons-net/ws/pom.xml> -V clean install --no-transfer-progress --batch-mode -Pjava-1.8
[1mApache Maven 3.9.11 (3e54c93a704957b63ee3494413a2b544fd3d825b)[m
Maven home: F:\jenkins\tools\maven\latest
Java version: 17.0.7, vendor: Eclipse Adoptium, runtime: F:\jenkins\tools\java\latest17
Default locale: en_US, platform encoding: Cp1252
OS name: "windows server 2019", version: "10.0", arch: "amd64", family: "windows"
[INFO] Scanning for projects...
[HUDSON] Collecting dependencies info
[INFO]
[INFO] ----------------------< commons-net:commons-net >-----------------------
[INFO] Building Apache Commons Net 3.13.1-SNAPSHOT
[INFO] from pom.xml
[INFO] --------------------------------[ jar ]---------------------------------
[INFO] Downloading from central: https://repo.maven.apache.org/maven2/org/cyclonedx/cyclonedx-maven-plugin/2.9.2/cyclonedx-maven-plugin-2.9.2.pom
[INFO] Downloaded from central: https://repo.maven.apache.org/maven2/org/cyclonedx/cyclonedx-maven-plugin/2.9.2/cyclonedx-maven-plugin-2.9.2.pom (19 kB at 42 kB/s)
[INFO] Downloading from central: https://repo.maven.apache.org/maven2/org/cyclonedx/cyclonedx-maven-plugin/2.9.2/cyclonedx-maven-plugin-2.9.2.jar
[INFO] Downloaded from central: https://repo.maven.apache.org/maven2/org/cyclonedx/cyclonedx-maven-plugin/2.9.2/cyclonedx-maven-plugin-2.9.2.jar (52 kB at 482 kB/s)
[INFO] Downloading from central: https://repo.maven.apache.org/maven2/org/spdx/spdx-maven-plugin/1.0.4/spdx-maven-plugin-1.0.4.pom
[INFO] Downloaded from central: https://repo.maven.apache.org/maven2/org/spdx/spdx-maven-plugin/1.0.4/spdx-maven-plugin-1.0.4.pom (14 kB at 163 kB/s)
[INFO] Downloading from central: https://repo.maven.apache.org/maven2/org/spdx/spdx-maven-plugin/1.0.4/spdx-maven-plugin-1.0.4.jar
[INFO] Downloaded from central: https://repo.maven.apache.org/maven2/org/spdx/spdx-maven-plugin/1.0.4/spdx-maven-plugin-1.0.4.jar (181 kB at 1.9 MB/s)
[INFO]
[INFO] --- clean:3.5.0:clean (default-clean) @ commons-net ---
[INFO]
[INFO] --- enforcer:3.6.3:enforce (enforce-maven-version) @ commons-net ---
[INFO] Rule 0: org.apache.maven.enforcer.rules.version.RequireMavenVersion passed
[INFO]
[INFO] --- enforcer:3.6.3:enforce (enforce-java-version) @ commons-net ---
[INFO] Rule 0: org.apache.maven.enforcer.rules.version.RequireJavaVersion passed
[INFO]
[INFO] --- apache-rat:0.18:check (rat-check) @ commons-net ---
[ERROR] Could not create report parent directory <https://ci-builds.apache.org/job/Commons/job/commons-net-windows/commons-net$commons-net/ws/f>:\jenkins\jenkins-home\712657a4\workspace\Commons\commons-net-windows\target\rat.txt
[WARNING] Unable to create directory: <https://ci-builds.apache.org/job/Commons/job/commons-net-windows/commons-net$commons-net/ws/f>:\jenkins\jenkins-home\712657a4\workspace\Commons\commons-net-windows\target
[WARNING] Attempt to (de-)serialize anonymous class org.jfrog.hudson.maven2.MavenDependenciesRecorder$1; see: https://jenkins.io/redirect/serialization-of-anonymous-classes/
Build failed in Jenkins: Commons » commons-net-windows » Apache Commons Net #335
Posted by Apache Jenkins Server <je...@builds.apache.org>.
See <https://ci-builds.apache.org/job/Commons/job/commons-net-windows/commons-net$commons-net/335/display/redirect?page=changes>
Changes:
[garydgregory] Bump github/codeql-action from 4.37.3 to 4.37.6.
------------------------------------------
Established TCP socket on 62035
maven35-agent.jar already up to date
maven35-interceptor.jar already up to date
maven3-interceptor-commons.jar already up to date
<===[JENKINS REMOTING CAPACITY]===> channel started
Executing Maven: -B -f <https://ci-builds.apache.org/job/Commons/job/commons-net-windows/commons-net$commons-net/ws/pom.xml> -V clean install --no-transfer-progress --batch-mode -Pjava-1.8
[1mApache Maven 3.9.11 (3e54c93a704957b63ee3494413a2b544fd3d825b)[m
Maven home: F:\jenkins\tools\maven\latest
Java version: 17.0.7, vendor: Eclipse Adoptium, runtime: F:\jenkins\tools\java\latest17
Default locale: en_US, platform encoding: Cp1252
OS name: "windows server 2019", version: "10.0", arch: "amd64", family: "windows"
[INFO] Scanning for projects...
[HUDSON] Collecting dependencies info
[INFO]
[INFO] ----------------------< commons-net:commons-net >-----------------------
[INFO] Building Apache Commons Net 3.13.1-SNAPSHOT
[INFO] from pom.xml
[INFO] --------------------------------[ jar ]---------------------------------
[INFO]
[INFO] --- clean:3.5.0:clean (default-clean) @ commons-net ---
[INFO]
[INFO] --- enforcer:3.6.3:enforce (enforce-maven-version) @ commons-net ---
[INFO] Rule 0: org.apache.maven.enforcer.rules.version.RequireMavenVersion passed
[INFO]
[INFO] --- enforcer:3.6.3:enforce (enforce-java-version) @ commons-net ---
[INFO] Rule 0: org.apache.maven.enforcer.rules.version.RequireJavaVersion passed
[INFO]
[INFO] --- apache-rat:0.18:check (rat-check) @ commons-net ---
[ERROR] Could not create report parent directory <https://ci-builds.apache.org/job/Commons/job/commons-net-windows/commons-net$commons-net/ws/f>:\jenkins\jenkins-home\712657a4\workspace\Commons\commons-net-windows\target\rat.txt
[WARNING] Unable to create directory: <https://ci-builds.apache.org/job/Commons/job/commons-net-windows/commons-net$commons-net/ws/f>:\jenkins\jenkins-home\712657a4\workspace\Commons\commons-net-windows\target
[WARNING] Attempt to (de-)serialize anonymous class org.jfrog.hudson.maven2.MavenDependenciesRecorder$1; see: https://jenkins.io/redirect/serialization-of-anonymous-classes/
Build failed in Jenkins: Commons » commons-net-windows » Apache Commons Net #334
Posted by Apache Jenkins Server <je...@builds.apache.org>.
See <https://ci-builds.apache.org/job/Commons/job/commons-net-windows/commons-net$commons-net/334/display/redirect?page=changes>
Changes:
[garydgregory] Javadoc
------------------------------------------
Established TCP socket on 61499
maven35-agent.jar already up to date
maven35-interceptor.jar already up to date
maven3-interceptor-commons.jar already up to date
<===[JENKINS REMOTING CAPACITY]===> channel started
Executing Maven: -B -f <https://ci-builds.apache.org/job/Commons/job/commons-net-windows/commons-net$commons-net/ws/pom.xml> -V clean install --no-transfer-progress --batch-mode -Pjava-1.8
[1mApache Maven 3.9.11 (3e54c93a704957b63ee3494413a2b544fd3d825b)[m
Maven home: F:\jenkins\tools\maven\latest
Java version: 17.0.7, vendor: Eclipse Adoptium, runtime: F:\jenkins\tools\java\latest17
Default locale: en_US, platform encoding: Cp1252
OS name: "windows server 2019", version: "10.0", arch: "amd64", family: "windows"
[INFO] Scanning for projects...
[HUDSON] Collecting dependencies info
[INFO]
[INFO] ----------------------< commons-net:commons-net >-----------------------
[INFO] Building Apache Commons Net 3.13.1-SNAPSHOT
[INFO] from pom.xml
[INFO] --------------------------------[ jar ]---------------------------------
[INFO] Downloading from central: https://repo.maven.apache.org/maven2/org/cyclonedx/cyclonedx-maven-plugin/2.9.2/cyclonedx-maven-plugin-2.9.2.pom
[INFO] Downloaded from central: https://repo.maven.apache.org/maven2/org/cyclonedx/cyclonedx-maven-plugin/2.9.2/cyclonedx-maven-plugin-2.9.2.pom (19 kB at 25 kB/s)
[INFO] Downloading from central: https://repo.maven.apache.org/maven2/org/cyclonedx/cyclonedx-maven-plugin/2.9.2/cyclonedx-maven-plugin-2.9.2.jar
[INFO] Downloaded from central: https://repo.maven.apache.org/maven2/org/cyclonedx/cyclonedx-maven-plugin/2.9.2/cyclonedx-maven-plugin-2.9.2.jar (52 kB at 482 kB/s)
[INFO] Downloading from central: https://repo.maven.apache.org/maven2/org/spdx/spdx-maven-plugin/1.0.4/spdx-maven-plugin-1.0.4.pom
[INFO] Downloaded from central: https://repo.maven.apache.org/maven2/org/spdx/spdx-maven-plugin/1.0.4/spdx-maven-plugin-1.0.4.pom (14 kB at 175 kB/s)
[INFO] Downloading from central: https://repo.maven.apache.org/maven2/org/spdx/spdx-maven-plugin/1.0.4/spdx-maven-plugin-1.0.4.jar
[INFO] Downloaded from central: https://repo.maven.apache.org/maven2/org/spdx/spdx-maven-plugin/1.0.4/spdx-maven-plugin-1.0.4.jar (181 kB at 2.0 MB/s)
[INFO]
[INFO] --- clean:3.5.0:clean (default-clean) @ commons-net ---
[INFO]
[INFO] --- enforcer:3.6.3:enforce (enforce-maven-version) @ commons-net ---
[INFO] Rule 0: org.apache.maven.enforcer.rules.version.RequireMavenVersion passed
[INFO]
[INFO] --- enforcer:3.6.3:enforce (enforce-java-version) @ commons-net ---
[INFO] Rule 0: org.apache.maven.enforcer.rules.version.RequireJavaVersion passed
[INFO]
[INFO] --- apache-rat:0.18:check (rat-check) @ commons-net ---
[ERROR] Could not create report parent directory <https://ci-builds.apache.org/job/Commons/job/commons-net-windows/commons-net$commons-net/ws/f>:\jenkins\jenkins-home\712657a4\workspace\Commons\commons-net-windows\target\rat.txt
[WARNING] Unable to create directory: <https://ci-builds.apache.org/job/Commons/job/commons-net-windows/commons-net$commons-net/ws/f>:\jenkins\jenkins-home\712657a4\workspace\Commons\commons-net-windows\target
[WARNING] Attempt to (de-)serialize anonymous class org.jfrog.hudson.maven2.MavenDependenciesRecorder$1; see: https://jenkins.io/redirect/serialization-of-anonymous-classes/
Build failed in Jenkins: Commons » commons-net-windows » Apache Commons Net #333
Posted by Apache Jenkins Server <je...@builds.apache.org>.
See <https://ci-builds.apache.org/job/Commons/job/commons-net-windows/commons-net$commons-net/333/display/redirect?page=changes>
Changes:
[garydgregory] Update GH CI Java versions
[github] Force Gregorian calendar in FTP listing timestamp parsers (#406)
[garydgregory] Force Gregorian calendar in FTP listing timestamp parsers (##406).
[garydgregory] Extract constants from magic strings
[garydgregory] Javadoc
[garydgregory] Refactor copy-pasta
[garydgregory] Add and use FTPFile.setUserPermission(int, boolean).
------------------------------------------
Established TCP socket on 50446
maven35-agent.jar already up to date
maven35-interceptor.jar already up to date
maven3-interceptor-commons.jar already up to date
<===[JENKINS REMOTING CAPACITY]===> channel started
Executing Maven: -B -f <https://ci-builds.apache.org/job/Commons/job/commons-net-windows/commons-net$commons-net/ws/pom.xml> -V clean install --no-transfer-progress --batch-mode -Pjava-1.8
[1mApache Maven 3.9.11 (3e54c93a704957b63ee3494413a2b544fd3d825b)[m
Maven home: F:\jenkins\tools\maven\latest
Java version: 17.0.7, vendor: Eclipse Adoptium, runtime: F:\jenkins\tools\java\latest17
Default locale: en_US, platform encoding: Cp1252
OS name: "windows server 2022", version: "10.0", arch: "amd64", family: "windows"
[INFO] Scanning for projects...
[HUDSON] Collecting dependencies info
[INFO]
[INFO] ----------------------< commons-net:commons-net >-----------------------
[INFO] Building Apache Commons Net 3.13.1-SNAPSHOT
[INFO] from pom.xml
[INFO] --------------------------------[ jar ]---------------------------------
[INFO]
[INFO] --- clean:3.5.0:clean (default-clean) @ commons-net ---
[INFO]
[INFO] --- enforcer:3.6.3:enforce (enforce-maven-version) @ commons-net ---
[INFO] Rule 0: org.apache.maven.enforcer.rules.version.RequireMavenVersion passed
[INFO]
[INFO] --- enforcer:3.6.3:enforce (enforce-java-version) @ commons-net ---
[INFO] Rule 0: org.apache.maven.enforcer.rules.version.RequireJavaVersion passed
[INFO]
[INFO] --- apache-rat:0.18:check (rat-check) @ commons-net ---
[ERROR] Could not create report parent directory <https://ci-builds.apache.org/job/Commons/job/commons-net-windows/commons-net$commons-net/ws/f>:\jenkins\jenkins-home\712657a4\workspace\Commons\commons-net-windows\target\rat.txt
[WARNING] Unable to create directory: <https://ci-builds.apache.org/job/Commons/job/commons-net-windows/commons-net$commons-net/ws/f>:\jenkins\jenkins-home\712657a4\workspace\Commons\commons-net-windows\target
[WARNING] Attempt to (de-)serialize anonymous class org.jfrog.hudson.maven2.MavenDependenciesRecorder$1; see: https://jenkins.io/redirect/serialization-of-anonymous-classes/
Build failed in Jenkins: Commons » commons-net-windows » Apache Commons Net #332
Posted by Apache Jenkins Server <je...@builds.apache.org>.
See <https://ci-builds.apache.org/job/Commons/job/commons-net-windows/commons-net$commons-net/332/display/redirect?page=changes>
Changes:
[garydgregory] Bump ossf/scorecard-action from 2.4.3 to 2.4.4.
------------------------------------------
Established TCP socket on 59260
maven35-agent.jar already up to date
maven35-interceptor.jar already up to date
maven3-interceptor-commons.jar already up to date
<===[JENKINS REMOTING CAPACITY]===> channel started
Executing Maven: -B -f <https://ci-builds.apache.org/job/Commons/job/commons-net-windows/commons-net$commons-net/ws/pom.xml> -V clean install --no-transfer-progress --batch-mode -Pjava-1.8
[1mApache Maven 3.9.11 (3e54c93a704957b63ee3494413a2b544fd3d825b)[m
Maven home: F:\jenkins\tools\maven\latest
Java version: 17.0.7, vendor: Eclipse Adoptium, runtime: F:\jenkins\tools\java\latest17
Default locale: en_US, platform encoding: Cp1252
OS name: "windows server 2019", version: "10.0", arch: "amd64", family: "windows"
[INFO] Scanning for projects...
[HUDSON] Collecting dependencies info
[INFO]
[INFO] ----------------------< commons-net:commons-net >-----------------------
[INFO] Building Apache Commons Net 3.13.1-SNAPSHOT
[INFO] from pom.xml
[INFO] --------------------------------[ jar ]---------------------------------
[INFO]
[INFO] --- clean:3.5.0:clean (default-clean) @ commons-net ---
[INFO]
[INFO] --- enforcer:3.6.3:enforce (enforce-maven-version) @ commons-net ---
[INFO] Rule 0: org.apache.maven.enforcer.rules.version.RequireMavenVersion passed
[INFO]
[INFO] --- enforcer:3.6.3:enforce (enforce-java-version) @ commons-net ---
[INFO] Rule 0: org.apache.maven.enforcer.rules.version.RequireJavaVersion passed
[INFO]
[INFO] --- apache-rat:0.18:check (rat-check) @ commons-net ---
[ERROR] Could not create report parent directory <https://ci-builds.apache.org/job/Commons/job/commons-net-windows/commons-net$commons-net/ws/f>:\jenkins\jenkins-home\712657a4\workspace\Commons\commons-net-windows\target\rat.txt
[WARNING] Unable to create directory: <https://ci-builds.apache.org/job/Commons/job/commons-net-windows/commons-net$commons-net/ws/f>:\jenkins\jenkins-home\712657a4\workspace\Commons\commons-net-windows\target
[WARNING] Attempt to (de-)serialize anonymous class org.jfrog.hudson.maven2.MavenDependenciesRecorder$1; see: https://jenkins.io/redirect/serialization-of-anonymous-classes/
Build failed in Jenkins: Commons » commons-net-windows » Apache Commons Net #331
Posted by Apache Jenkins Server <je...@builds.apache.org>.
See <https://ci-builds.apache.org/job/Commons/job/commons-net-windows/commons-net$commons-net/331/display/redirect?page=changes>
Changes:
[garydgregory] Bump github/codeql-action from 4.37.1 to 4.37.3
------------------------------------------
Established TCP socket on 65128
maven35-agent.jar already up to date
maven35-interceptor.jar already up to date
maven3-interceptor-commons.jar already up to date
<===[JENKINS REMOTING CAPACITY]===> channel started
Executing Maven: -B -f <https://ci-builds.apache.org/job/Commons/job/commons-net-windows/commons-net$commons-net/ws/pom.xml> -V clean install --no-transfer-progress --batch-mode -Pjava-1.8
[1mApache Maven 3.9.11 (3e54c93a704957b63ee3494413a2b544fd3d825b)[m
Maven home: F:\jenkins\tools\maven\latest
Java version: 17.0.7, vendor: Eclipse Adoptium, runtime: F:\jenkins\tools\java\latest17
Default locale: en_US, platform encoding: Cp1252
OS name: "windows server 2019", version: "10.0", arch: "amd64", family: "windows"
[INFO] Scanning for projects...
[HUDSON] Collecting dependencies info
[INFO]
[INFO] ----------------------< commons-net:commons-net >-----------------------
[INFO] Building Apache Commons Net 3.13.1-SNAPSHOT
[INFO] from pom.xml
[INFO] --------------------------------[ jar ]---------------------------------
[INFO]
[INFO] --- clean:3.5.0:clean (default-clean) @ commons-net ---
[INFO]
[INFO] --- enforcer:3.6.3:enforce (enforce-maven-version) @ commons-net ---
[INFO] Rule 0: org.apache.maven.enforcer.rules.version.RequireMavenVersion passed
[INFO]
[INFO] --- enforcer:3.6.3:enforce (enforce-java-version) @ commons-net ---
[INFO] Rule 0: org.apache.maven.enforcer.rules.version.RequireJavaVersion passed
[INFO]
[INFO] --- apache-rat:0.18:check (rat-check) @ commons-net ---
[ERROR] Could not create report parent directory <https://ci-builds.apache.org/job/Commons/job/commons-net-windows/commons-net$commons-net/ws/f>:\jenkins\jenkins-home\712657a4\workspace\Commons\commons-net-windows\target\rat.txt
[WARNING] Unable to create directory: <https://ci-builds.apache.org/job/Commons/job/commons-net-windows/commons-net$commons-net/ws/f>:\jenkins\jenkins-home\712657a4\workspace\Commons\commons-net-windows\target
[WARNING] Attempt to (de-)serialize anonymous class org.jfrog.hudson.maven2.MavenDependenciesRecorder$1; see: https://jenkins.io/redirect/serialization-of-anonymous-classes/
Build failed in Jenkins: Commons » commons-net-windows » Apache Commons Net #330
Posted by Apache Jenkins Server <je...@builds.apache.org>.
See <https://ci-builds.apache.org/job/Commons/job/commons-net-windows/commons-net$commons-net/330/display/redirect?page=changes>
Changes:
[garydgregory] Better use of JUnit API (comment).
------------------------------------------
Established TCP socket on 64520
maven35-agent.jar already up to date
maven35-interceptor.jar already up to date
maven3-interceptor-commons.jar already up to date
<===[JENKINS REMOTING CAPACITY]===> channel started
Executing Maven: -B -f <https://ci-builds.apache.org/job/Commons/job/commons-net-windows/commons-net$commons-net/ws/pom.xml> -V clean install --no-transfer-progress --batch-mode -Pjava-1.8
[1mApache Maven 3.9.11 (3e54c93a704957b63ee3494413a2b544fd3d825b)[m
Maven home: F:\jenkins\tools\maven\latest
Java version: 17.0.7, vendor: Eclipse Adoptium, runtime: F:\jenkins\tools\java\latest17
Default locale: en_US, platform encoding: Cp1252
OS name: "windows server 2019", version: "10.0", arch: "amd64", family: "windows"
[INFO] Scanning for projects...
[HUDSON] Collecting dependencies info
[INFO]
[INFO] ----------------------< commons-net:commons-net >-----------------------
[INFO] Building Apache Commons Net 3.13.1-SNAPSHOT
[INFO] from pom.xml
[INFO] --------------------------------[ jar ]---------------------------------
[INFO] Downloading from central: https://repo.maven.apache.org/maven2/org/cyclonedx/cyclonedx-maven-plugin/2.9.2/cyclonedx-maven-plugin-2.9.2.pom
[INFO] Downloaded from central: https://repo.maven.apache.org/maven2/org/cyclonedx/cyclonedx-maven-plugin/2.9.2/cyclonedx-maven-plugin-2.9.2.pom (19 kB at 32 kB/s)
[INFO] Downloading from central: https://repo.maven.apache.org/maven2/org/cyclonedx/cyclonedx-maven-plugin/2.9.2/cyclonedx-maven-plugin-2.9.2.jar
[INFO] Downloaded from central: https://repo.maven.apache.org/maven2/org/cyclonedx/cyclonedx-maven-plugin/2.9.2/cyclonedx-maven-plugin-2.9.2.jar (52 kB at 391 kB/s)
[INFO] Downloading from central: https://repo.maven.apache.org/maven2/org/spdx/spdx-maven-plugin/1.0.4/spdx-maven-plugin-1.0.4.pom
[INFO] Downloaded from central: https://repo.maven.apache.org/maven2/org/spdx/spdx-maven-plugin/1.0.4/spdx-maven-plugin-1.0.4.pom (14 kB at 148 kB/s)
[INFO] Downloading from central: https://repo.maven.apache.org/maven2/org/spdx/spdx-maven-plugin/1.0.4/spdx-maven-plugin-1.0.4.jar
[INFO] Downloaded from central: https://repo.maven.apache.org/maven2/org/spdx/spdx-maven-plugin/1.0.4/spdx-maven-plugin-1.0.4.jar (181 kB at 1.5 MB/s)
[INFO]
[INFO] --- clean:3.5.0:clean (default-clean) @ commons-net ---
[INFO]
[INFO] --- enforcer:3.6.3:enforce (enforce-maven-version) @ commons-net ---
[INFO] Rule 0: org.apache.maven.enforcer.rules.version.RequireMavenVersion passed
[INFO]
[INFO] --- enforcer:3.6.3:enforce (enforce-java-version) @ commons-net ---
[INFO] Rule 0: org.apache.maven.enforcer.rules.version.RequireJavaVersion passed
[INFO]
[INFO] --- apache-rat:0.18:check (rat-check) @ commons-net ---
[ERROR] Could not create report parent directory <https://ci-builds.apache.org/job/Commons/job/commons-net-windows/commons-net$commons-net/ws/f>:\jenkins\jenkins-home\712657a4\workspace\Commons\commons-net-windows\target\rat.txt
[WARNING] Unable to create directory: <https://ci-builds.apache.org/job/Commons/job/commons-net-windows/commons-net$commons-net/ws/f>:\jenkins\jenkins-home\712657a4\workspace\Commons\commons-net-windows\target
[WARNING] Attempt to (de-)serialize anonymous class org.jfrog.hudson.maven2.MavenDependenciesRecorder$1; see: https://jenkins.io/redirect/serialization-of-anonymous-classes/
Build failed in Jenkins: Commons » commons-net-windows » Apache Commons Net #329
Posted by Apache Jenkins Server <je...@builds.apache.org>.
See <https://ci-builds.apache.org/job/Commons/job/commons-net-windows/commons-net$commons-net/329/display/redirect?page=changes>
Changes:
[garydgregory] Bump actions/checkout from 7.0.0 to 7.0.1
------------------------------------------
Established TCP socket on 54477
maven35-agent.jar already up to date
maven35-interceptor.jar already up to date
maven3-interceptor-commons.jar already up to date
<===[JENKINS REMOTING CAPACITY]===> channel started
Executing Maven: -B -f <https://ci-builds.apache.org/job/Commons/job/commons-net-windows/commons-net$commons-net/ws/pom.xml> -V clean install --no-transfer-progress --batch-mode -Pjava-1.8
[1mApache Maven 3.9.11 (3e54c93a704957b63ee3494413a2b544fd3d825b)[m
Maven home: F:\jenkins\tools\maven\latest
Java version: 17.0.7, vendor: Eclipse Adoptium, runtime: F:\jenkins\tools\java\latest17
Default locale: en_US, platform encoding: Cp1252
OS name: "windows server 2022", version: "10.0", arch: "amd64", family: "windows"
[INFO] Scanning for projects...
[HUDSON] Collecting dependencies info
[INFO]
[INFO] ----------------------< commons-net:commons-net >-----------------------
[INFO] Building Apache Commons Net 3.13.1-SNAPSHOT
[INFO] from pom.xml
[INFO] --------------------------------[ jar ]---------------------------------
[INFO] Downloading from central: https://repo.maven.apache.org/maven2/org/apache/maven/plugins/maven-enforcer-plugin/3.6.3/maven-enforcer-plugin-3.6.3.pom
[INFO] Downloaded from central: https://repo.maven.apache.org/maven2/org/apache/maven/plugins/maven-enforcer-plugin/3.6.3/maven-enforcer-plugin-3.6.3.pom (8.2 kB at 16 kB/s)
[INFO] Downloading from central: https://repo.maven.apache.org/maven2/org/apache/maven/enforcer/enforcer/3.6.3/enforcer-3.6.3.pom
[INFO] Downloaded from central: https://repo.maven.apache.org/maven2/org/apache/maven/enforcer/enforcer/3.6.3/enforcer-3.6.3.pom (10 kB at 78 kB/s)
[INFO] Downloading from central: https://repo.maven.apache.org/maven2/org/apache/maven/plugins/maven-enforcer-plugin/3.6.3/maven-enforcer-plugin-3.6.3.jar
[INFO] Downloaded from central: https://repo.maven.apache.org/maven2/org/apache/maven/plugins/maven-enforcer-plugin/3.6.3/maven-enforcer-plugin-3.6.3.jar (40 kB at 60 kB/s)
[INFO] Downloading from central: https://repo.maven.apache.org/maven2/org/cyclonedx/cyclonedx-maven-plugin/2.9.2/cyclonedx-maven-plugin-2.9.2.pom
[INFO] Downloaded from central: https://repo.maven.apache.org/maven2/org/cyclonedx/cyclonedx-maven-plugin/2.9.2/cyclonedx-maven-plugin-2.9.2.pom (19 kB at 189 kB/s)
[INFO] Downloading from central: https://repo.maven.apache.org/maven2/org/cyclonedx/cyclonedx-maven-plugin/2.9.2/cyclonedx-maven-plugin-2.9.2.jar
[INFO] Downloaded from central: https://repo.maven.apache.org/maven2/org/cyclonedx/cyclonedx-maven-plugin/2.9.2/cyclonedx-maven-plugin-2.9.2.jar (52 kB at 536 kB/s)
[INFO] Downloading from central: https://repo.maven.apache.org/maven2/org/spdx/spdx-maven-plugin/1.0.4/spdx-maven-plugin-1.0.4.pom
[INFO] Downloaded from central: https://repo.maven.apache.org/maven2/org/spdx/spdx-maven-plugin/1.0.4/spdx-maven-plugin-1.0.4.pom (14 kB at 154 kB/s)
[INFO] Downloading from central: https://repo.maven.apache.org/maven2/org/spdx/spdx-maven-plugin/1.0.4/spdx-maven-plugin-1.0.4.jar
[INFO] Downloaded from central: https://repo.maven.apache.org/maven2/org/spdx/spdx-maven-plugin/1.0.4/spdx-maven-plugin-1.0.4.jar (181 kB at 1.7 MB/s)
[INFO]
[INFO] --- clean:3.5.0:clean (default-clean) @ commons-net ---
[INFO]
[INFO] --- enforcer:3.6.3:enforce (enforce-maven-version) @ commons-net ---
[INFO] Downloading from central: https://repo.maven.apache.org/maven2/org/codehaus/plexus/plexus-utils/4.0.3/plexus-utils-4.0.3.pom
[INFO] Downloaded from central: https://repo.maven.apache.org/maven2/org/codehaus/plexus/plexus-utils/4.0.3/plexus-utils-4.0.3.pom (6.8 kB at 100 kB/s)
[INFO] Downloading from central: https://repo.maven.apache.org/maven2/org/apache/maven/enforcer/enforcer-api/3.6.3/enforcer-api-3.6.3.pom
[INFO] Downloaded from central: https://repo.maven.apache.org/maven2/org/apache/maven/enforcer/enforcer-api/3.6.3/enforcer-api-3.6.3.pom (3.8 kB at 54 kB/s)
[INFO] Downloading from central: https://repo.maven.apache.org/maven2/org/apache/maven/enforcer/enforcer-rules/3.6.3/enforcer-rules-3.6.3.pom
[INFO] Downloaded from central: https://repo.maven.apache.org/maven2/org/apache/maven/enforcer/enforcer-rules/3.6.3/enforcer-rules-3.6.3.pom (5.5 kB at 77 kB/s)
[INFO] Downloading from central: https://repo.maven.apache.org/maven2/org/apache/maven/resolver/maven-resolver-util/1.9.27/maven-resolver-util-1.9.27.pom
[INFO] Downloaded from central: https://repo.maven.apache.org/maven2/org/apache/maven/resolver/maven-resolver-util/1.9.27/maven-resolver-util-1.9.27.pom (2.2 kB at 32 kB/s)
[INFO] Downloading from central: https://repo.maven.apache.org/maven2/org/apache/maven/resolver/maven-resolver/1.9.27/maven-resolver-1.9.27.pom
[INFO] Downloaded from central: https://repo.maven.apache.org/maven2/org/apache/maven/resolver/maven-resolver/1.9.27/maven-resolver-1.9.27.pom (25 kB at 250 kB/s)
[INFO] Downloading from central: https://repo.maven.apache.org/maven2/org/apache/maven/resolver/maven-resolver-api/1.9.27/maven-resolver-api-1.9.27.pom
[INFO] Downloaded from central: https://repo.maven.apache.org/maven2/org/apache/maven/resolver/maven-resolver-api/1.9.27/maven-resolver-api-1.9.27.pom (2.2 kB at 31 kB/s)
[INFO] Downloading from central: https://repo.maven.apache.org/maven2/org/codehaus/plexus/plexus-utils/4.0.3/plexus-utils-4.0.3.jar
[INFO] Downloaded from central: https://repo.maven.apache.org/maven2/org/codehaus/plexus/plexus-utils/4.0.3/plexus-utils-4.0.3.jar (193 kB at 2.0 MB/s)
[INFO] Downloading from central: https://repo.maven.apache.org/maven2/org/apache/maven/enforcer/enforcer-api/3.6.3/enforcer-api-3.6.3.jar
[INFO] Downloading from central: https://repo.maven.apache.org/maven2/org/apache/maven/enforcer/enforcer-rules/3.6.3/enforcer-rules-3.6.3.jar
[INFO] Downloading from central: https://repo.maven.apache.org/maven2/org/apache/maven/resolver/maven-resolver-util/1.9.27/maven-resolver-util-1.9.27.jar
[INFO] Downloaded from central: https://repo.maven.apache.org/maven2/org/apache/maven/resolver/maven-resolver-util/1.9.27/maven-resolver-util-1.9.27.jar (197 kB at 977 kB/s)
[INFO] Downloaded from central: https://repo.maven.apache.org/maven2/org/apache/maven/enforcer/enforcer-rules/3.6.3/enforcer-rules-3.6.3.jar (163 kB at 759 kB/s)
[INFO] Downloaded from central: https://repo.maven.apache.org/maven2/org/apache/maven/enforcer/enforcer-api/3.6.3/enforcer-api-3.6.3.jar (15 kB at 29 kB/s)
[INFO] Rule 0: org.apache.maven.enforcer.rules.version.RequireMavenVersion passed
[INFO]
[INFO] --- enforcer:3.6.3:enforce (enforce-java-version) @ commons-net ---
[INFO] Rule 0: org.apache.maven.enforcer.rules.version.RequireJavaVersion passed
[INFO]
[INFO] --- apache-rat:0.18:check (rat-check) @ commons-net ---
[ERROR] Could not create report parent directory <https://ci-builds.apache.org/job/Commons/job/commons-net-windows/commons-net$commons-net/ws/f>:\jenkins\jenkins-home\712657a4\workspace\Commons\commons-net-windows\target\rat.txt
[WARNING] Unable to create directory: <https://ci-builds.apache.org/job/Commons/job/commons-net-windows/commons-net$commons-net/ws/f>:\jenkins\jenkins-home\712657a4\workspace\Commons\commons-net-windows\target
[WARNING] Attempt to (de-)serialize anonymous class org.jfrog.hudson.maven2.MavenDependenciesRecorder$1; see: https://jenkins.io/redirect/serialization-of-anonymous-classes/
Build failed in Jenkins: Commons » commons-net-windows » Apache Commons Net #328
Posted by Apache Jenkins Server <je...@builds.apache.org>.
See <https://ci-builds.apache.org/job/Commons/job/commons-net-windows/commons-net$commons-net/328/display/redirect?page=changes>
Changes:
[garydgregory] [NET-745][Javadoc] Improve UnixFTPEntryParser when filename with leading
------------------------------------------
Established TCP socket on 52430
maven35-agent.jar already up to date
maven35-interceptor.jar already up to date
maven3-interceptor-commons.jar already up to date
<===[JENKINS REMOTING CAPACITY]===> channel started
Executing Maven: -B -f <https://ci-builds.apache.org/job/Commons/job/commons-net-windows/commons-net$commons-net/ws/pom.xml> -V clean install --no-transfer-progress --batch-mode -Pjava-1.8
[1mApache Maven 3.9.11 (3e54c93a704957b63ee3494413a2b544fd3d825b)[m
Maven home: F:\jenkins\tools\maven\latest
Java version: 17.0.7, vendor: Eclipse Adoptium, runtime: F:\jenkins\tools\java\latest17
Default locale: en_US, platform encoding: Cp1252
OS name: "windows server 2019", version: "10.0", arch: "amd64", family: "windows"
[INFO] Scanning for projects...
[HUDSON] Collecting dependencies info
[INFO]
[INFO] ----------------------< commons-net:commons-net >-----------------------
[INFO] Building Apache Commons Net 3.13.1-SNAPSHOT
[INFO] from pom.xml
[INFO] --------------------------------[ jar ]---------------------------------
[INFO] Downloading from central: https://repo.maven.apache.org/maven2/org/cyclonedx/cyclonedx-maven-plugin/2.9.2/cyclonedx-maven-plugin-2.9.2.pom
[INFO] Downloaded from central: https://repo.maven.apache.org/maven2/org/cyclonedx/cyclonedx-maven-plugin/2.9.2/cyclonedx-maven-plugin-2.9.2.pom (19 kB at 37 kB/s)
[INFO] Downloading from central: https://repo.maven.apache.org/maven2/org/cyclonedx/cyclonedx-maven-plugin/2.9.2/cyclonedx-maven-plugin-2.9.2.jar
[INFO] Downloaded from central: https://repo.maven.apache.org/maven2/org/cyclonedx/cyclonedx-maven-plugin/2.9.2/cyclonedx-maven-plugin-2.9.2.jar (52 kB at 423 kB/s)
[INFO] Downloading from central: https://repo.maven.apache.org/maven2/org/spdx/spdx-maven-plugin/1.0.4/spdx-maven-plugin-1.0.4.pom
[INFO] Downloaded from central: https://repo.maven.apache.org/maven2/org/spdx/spdx-maven-plugin/1.0.4/spdx-maven-plugin-1.0.4.pom (14 kB at 151 kB/s)
[INFO] Downloading from central: https://repo.maven.apache.org/maven2/org/spdx/spdx-maven-plugin/1.0.4/spdx-maven-plugin-1.0.4.jar
[INFO] Downloaded from central: https://repo.maven.apache.org/maven2/org/spdx/spdx-maven-plugin/1.0.4/spdx-maven-plugin-1.0.4.jar (181 kB at 1.8 MB/s)
[INFO]
[INFO] --- clean:3.5.0:clean (default-clean) @ commons-net ---
[INFO]
[INFO] --- enforcer:3.6.3:enforce (enforce-maven-version) @ commons-net ---
[INFO] Rule 0: org.apache.maven.enforcer.rules.version.RequireMavenVersion passed
[INFO]
[INFO] --- enforcer:3.6.3:enforce (enforce-java-version) @ commons-net ---
[INFO] Rule 0: org.apache.maven.enforcer.rules.version.RequireJavaVersion passed
[INFO]
[INFO] --- apache-rat:0.18:check (rat-check) @ commons-net ---
[ERROR] Could not create report parent directory <https://ci-builds.apache.org/job/Commons/job/commons-net-windows/commons-net$commons-net/ws/f>:\jenkins\jenkins-home\712657a4\workspace\Commons\commons-net-windows\target\rat.txt
[WARNING] Unable to create directory: <https://ci-builds.apache.org/job/Commons/job/commons-net-windows/commons-net$commons-net/ws/f>:\jenkins\jenkins-home\712657a4\workspace\Commons\commons-net-windows\target
[WARNING] Attempt to (de-)serialize anonymous class org.jfrog.hudson.maven2.MavenDependenciesRecorder$1; see: https://jenkins.io/redirect/serialization-of-anonymous-classes/
Build failed in Jenkins: Commons » commons-net-windows » Apache Commons Net #327
Posted by Apache Jenkins Server <je...@builds.apache.org>.
See <https://ci-builds.apache.org/job/Commons/job/commons-net-windows/commons-net$commons-net/327/display/redirect?page=changes>
Changes:
[github] [NET-745] Clarify UnixFTPEntryParser trimLeadingSpaces in Javadoc (#405)
------------------------------------------
Established TCP socket on 51670
maven35-agent.jar already up to date
maven35-interceptor.jar already up to date
maven3-interceptor-commons.jar already up to date
<===[JENKINS REMOTING CAPACITY]===> channel started
Executing Maven: -B -f <https://ci-builds.apache.org/job/Commons/job/commons-net-windows/commons-net$commons-net/ws/pom.xml> -V clean install --no-transfer-progress --batch-mode -Pjava-1.8
[1mApache Maven 3.9.11 (3e54c93a704957b63ee3494413a2b544fd3d825b)[m
Maven home: F:\jenkins\tools\maven\latest
Java version: 17.0.7, vendor: Eclipse Adoptium, runtime: F:\jenkins\tools\java\latest17
Default locale: en_US, platform encoding: Cp1252
OS name: "windows server 2019", version: "10.0", arch: "amd64", family: "windows"
[INFO] Scanning for projects...
[HUDSON] Collecting dependencies info
[INFO]
[INFO] ----------------------< commons-net:commons-net >-----------------------
[INFO] Building Apache Commons Net 3.13.1-SNAPSHOT
[INFO] from pom.xml
[INFO] --------------------------------[ jar ]---------------------------------
[INFO] Downloading from central: https://repo.maven.apache.org/maven2/org/apache/maven/plugins/maven-enforcer-plugin/3.6.3/maven-enforcer-plugin-3.6.3.pom
[INFO] Downloaded from central: https://repo.maven.apache.org/maven2/org/apache/maven/plugins/maven-enforcer-plugin/3.6.3/maven-enforcer-plugin-3.6.3.pom (8.2 kB at 18 kB/s)
[INFO] Downloading from central: https://repo.maven.apache.org/maven2/org/apache/maven/enforcer/enforcer/3.6.3/enforcer-3.6.3.pom
[INFO] Downloaded from central: https://repo.maven.apache.org/maven2/org/apache/maven/enforcer/enforcer/3.6.3/enforcer-3.6.3.pom (10 kB at 98 kB/s)
[INFO] Downloading from central: https://repo.maven.apache.org/maven2/org/apache/maven/plugins/maven-enforcer-plugin/3.6.3/maven-enforcer-plugin-3.6.3.jar
[INFO] Downloaded from central: https://repo.maven.apache.org/maven2/org/apache/maven/plugins/maven-enforcer-plugin/3.6.3/maven-enforcer-plugin-3.6.3.jar (40 kB at 71 kB/s)
[INFO] Downloading from central: https://repo.maven.apache.org/maven2/org/cyclonedx/cyclonedx-maven-plugin/2.9.2/cyclonedx-maven-plugin-2.9.2.pom
[INFO] Downloaded from central: https://repo.maven.apache.org/maven2/org/cyclonedx/cyclonedx-maven-plugin/2.9.2/cyclonedx-maven-plugin-2.9.2.pom (19 kB at 214 kB/s)
[INFO] Downloading from central: https://repo.maven.apache.org/maven2/org/cyclonedx/cyclonedx-maven-plugin/2.9.2/cyclonedx-maven-plugin-2.9.2.jar
[INFO] Downloaded from central: https://repo.maven.apache.org/maven2/org/cyclonedx/cyclonedx-maven-plugin/2.9.2/cyclonedx-maven-plugin-2.9.2.jar (52 kB at 619 kB/s)
[INFO] Downloading from central: https://repo.maven.apache.org/maven2/org/spdx/spdx-maven-plugin/1.0.4/spdx-maven-plugin-1.0.4.pom
[INFO] Downloaded from central: https://repo.maven.apache.org/maven2/org/spdx/spdx-maven-plugin/1.0.4/spdx-maven-plugin-1.0.4.pom (14 kB at 173 kB/s)
[INFO] Downloading from central: https://repo.maven.apache.org/maven2/org/spdx/spdx-maven-plugin/1.0.4/spdx-maven-plugin-1.0.4.jar
[INFO] Downloaded from central: https://repo.maven.apache.org/maven2/org/spdx/spdx-maven-plugin/1.0.4/spdx-maven-plugin-1.0.4.jar (181 kB at 2.0 MB/s)
[INFO]
[INFO] --- clean:3.5.0:clean (default-clean) @ commons-net ---
[INFO]
[INFO] --- enforcer:3.6.3:enforce (enforce-maven-version) @ commons-net ---
[INFO] Downloading from central: https://repo.maven.apache.org/maven2/org/codehaus/plexus/plexus-utils/4.0.3/plexus-utils-4.0.3.pom
[INFO] Downloaded from central: https://repo.maven.apache.org/maven2/org/codehaus/plexus/plexus-utils/4.0.3/plexus-utils-4.0.3.pom (6.8 kB at 89 kB/s)
[INFO] Downloading from central: https://repo.maven.apache.org/maven2/org/apache/maven/enforcer/enforcer-api/3.6.3/enforcer-api-3.6.3.pom
[INFO] Downloaded from central: https://repo.maven.apache.org/maven2/org/apache/maven/enforcer/enforcer-api/3.6.3/enforcer-api-3.6.3.pom (3.8 kB at 60 kB/s)
[INFO] Downloading from central: https://repo.maven.apache.org/maven2/org/apache/maven/enforcer/enforcer-rules/3.6.3/enforcer-rules-3.6.3.pom
[INFO] Downloaded from central: https://repo.maven.apache.org/maven2/org/apache/maven/enforcer/enforcer-rules/3.6.3/enforcer-rules-3.6.3.pom (5.5 kB at 85 kB/s)
[INFO] Downloading from central: https://repo.maven.apache.org/maven2/org/apache/maven/resolver/maven-resolver-util/1.9.27/maven-resolver-util-1.9.27.pom
[INFO] Downloaded from central: https://repo.maven.apache.org/maven2/org/apache/maven/resolver/maven-resolver-util/1.9.27/maven-resolver-util-1.9.27.pom (2.2 kB at 33 kB/s)
[INFO] Downloading from central: https://repo.maven.apache.org/maven2/org/apache/maven/resolver/maven-resolver/1.9.27/maven-resolver-1.9.27.pom
[INFO] Downloaded from central: https://repo.maven.apache.org/maven2/org/apache/maven/resolver/maven-resolver/1.9.27/maven-resolver-1.9.27.pom (25 kB at 285 kB/s)
[INFO] Downloading from central: https://repo.maven.apache.org/maven2/org/apache/maven/resolver/maven-resolver-api/1.9.27/maven-resolver-api-1.9.27.pom
[INFO] Downloaded from central: https://repo.maven.apache.org/maven2/org/apache/maven/resolver/maven-resolver-api/1.9.27/maven-resolver-api-1.9.27.pom (2.2 kB at 29 kB/s)
[INFO] Downloading from central: https://repo.maven.apache.org/maven2/org/codehaus/plexus/plexus-utils/4.0.3/plexus-utils-4.0.3.jar
[INFO] Downloaded from central: https://repo.maven.apache.org/maven2/org/codehaus/plexus/plexus-utils/4.0.3/plexus-utils-4.0.3.jar (193 kB at 2.1 MB/s)
[INFO] Downloading from central: https://repo.maven.apache.org/maven2/org/apache/maven/enforcer/enforcer-api/3.6.3/enforcer-api-3.6.3.jar
[INFO] Downloading from central: https://repo.maven.apache.org/maven2/org/apache/maven/enforcer/enforcer-rules/3.6.3/enforcer-rules-3.6.3.jar
[INFO] Downloading from central: https://repo.maven.apache.org/maven2/org/apache/maven/resolver/maven-resolver-util/1.9.27/maven-resolver-util-1.9.27.jar
[INFO] Downloaded from central: https://repo.maven.apache.org/maven2/org/apache/maven/enforcer/enforcer-rules/3.6.3/enforcer-rules-3.6.3.jar (163 kB at 1.3 MB/s)
[INFO] Downloaded from central: https://repo.maven.apache.org/maven2/org/apache/maven/resolver/maven-resolver-util/1.9.27/maven-resolver-util-1.9.27.jar (197 kB at 1.0 MB/s)
[INFO] Downloaded from central: https://repo.maven.apache.org/maven2/org/apache/maven/enforcer/enforcer-api/3.6.3/enforcer-api-3.6.3.jar (15 kB at 33 kB/s)
[INFO] Rule 0: org.apache.maven.enforcer.rules.version.RequireMavenVersion passed
[INFO]
[INFO] --- enforcer:3.6.3:enforce (enforce-java-version) @ commons-net ---
[INFO] Rule 0: org.apache.maven.enforcer.rules.version.RequireJavaVersion passed
[INFO]
[INFO] --- apache-rat:0.18:check (rat-check) @ commons-net ---
[ERROR] Could not create report parent directory <https://ci-builds.apache.org/job/Commons/job/commons-net-windows/commons-net$commons-net/ws/f>:\jenkins\jenkins-home\712657a4\workspace\Commons\commons-net-windows\target\rat.txt
[WARNING] Unable to create directory: <https://ci-builds.apache.org/job/Commons/job/commons-net-windows/commons-net$commons-net/ws/f>:\jenkins\jenkins-home\712657a4\workspace\Commons\commons-net-windows\target
[WARNING] Attempt to (de-)serialize anonymous class org.jfrog.hudson.maven2.MavenDependenciesRecorder$1; see: https://jenkins.io/redirect/serialization-of-anonymous-classes/
Build failed in Jenkins: Commons » commons-net-windows » Apache Commons Net #326
Posted by Apache Jenkins Server <je...@builds.apache.org>.
See <https://ci-builds.apache.org/job/Commons/job/commons-net-windows/commons-net$commons-net/326/display/redirect?page=changes>
Changes:
[garydgregory] Bump org.apache.commons:commons-parent from 102 to 103.
------------------------------------------
Established TCP socket on 53105
maven35-agent.jar already up to date
maven35-interceptor.jar already up to date
maven3-interceptor-commons.jar already up to date
<===[JENKINS REMOTING CAPACITY]===> channel started
Executing Maven: -B -f <https://ci-builds.apache.org/job/Commons/job/commons-net-windows/commons-net$commons-net/ws/pom.xml> -V clean install --no-transfer-progress --batch-mode -Pjava-1.8
[1mApache Maven 3.9.11 (3e54c93a704957b63ee3494413a2b544fd3d825b)[m
Maven home: F:\jenkins\tools\maven\latest
Java version: 17.0.7, vendor: Eclipse Adoptium, runtime: F:\jenkins\tools\java\latest17
Default locale: en_US, platform encoding: Cp1252
OS name: "windows server 2019", version: "10.0", arch: "amd64", family: "windows"
[INFO] Scanning for projects...
[HUDSON] Collecting dependencies info
[INFO]
[INFO] ----------------------< commons-net:commons-net >-----------------------
[INFO] Building Apache Commons Net 3.13.1-SNAPSHOT
[INFO] from pom.xml
[INFO] --------------------------------[ jar ]---------------------------------
[INFO] Downloading from central: https://repo.maven.apache.org/maven2/org/apache/maven/plugins/maven-enforcer-plugin/3.6.3/maven-enforcer-plugin-3.6.3.pom
[INFO] Downloaded from central: https://repo.maven.apache.org/maven2/org/apache/maven/plugins/maven-enforcer-plugin/3.6.3/maven-enforcer-plugin-3.6.3.pom (8.2 kB at 19 kB/s)
[INFO] Downloading from central: https://repo.maven.apache.org/maven2/org/apache/maven/enforcer/enforcer/3.6.3/enforcer-3.6.3.pom
[INFO] Downloaded from central: https://repo.maven.apache.org/maven2/org/apache/maven/enforcer/enforcer/3.6.3/enforcer-3.6.3.pom (10 kB at 113 kB/s)
[INFO] Downloading from central: https://repo.maven.apache.org/maven2/org/apache/maven/plugins/maven-enforcer-plugin/3.6.3/maven-enforcer-plugin-3.6.3.jar
[INFO] Downloaded from central: https://repo.maven.apache.org/maven2/org/apache/maven/plugins/maven-enforcer-plugin/3.6.3/maven-enforcer-plugin-3.6.3.jar (40 kB at 84 kB/s)
[INFO] Downloading from central: https://repo.maven.apache.org/maven2/org/cyclonedx/cyclonedx-maven-plugin/2.9.2/cyclonedx-maven-plugin-2.9.2.pom
[INFO] Downloaded from central: https://repo.maven.apache.org/maven2/org/cyclonedx/cyclonedx-maven-plugin/2.9.2/cyclonedx-maven-plugin-2.9.2.pom (19 kB at 261 kB/s)
[INFO] Downloading from central: https://repo.maven.apache.org/maven2/org/cyclonedx/cyclonedx-maven-plugin/2.9.2/cyclonedx-maven-plugin-2.9.2.jar
[INFO] Downloaded from central: https://repo.maven.apache.org/maven2/org/cyclonedx/cyclonedx-maven-plugin/2.9.2/cyclonedx-maven-plugin-2.9.2.jar (52 kB at 732 kB/s)
[INFO] Downloading from central: https://repo.maven.apache.org/maven2/org/spdx/spdx-maven-plugin/1.0.4/spdx-maven-plugin-1.0.4.pom
[INFO] Downloaded from central: https://repo.maven.apache.org/maven2/org/spdx/spdx-maven-plugin/1.0.4/spdx-maven-plugin-1.0.4.pom (14 kB at 180 kB/s)
[INFO] Downloading from central: https://repo.maven.apache.org/maven2/org/spdx/spdx-maven-plugin/1.0.4/spdx-maven-plugin-1.0.4.jar
[INFO] Downloaded from central: https://repo.maven.apache.org/maven2/org/spdx/spdx-maven-plugin/1.0.4/spdx-maven-plugin-1.0.4.jar (181 kB at 2.2 MB/s)
[INFO]
[INFO] --- clean:3.5.0:clean (default-clean) @ commons-net ---
[INFO]
[INFO] --- enforcer:3.6.3:enforce (enforce-maven-version) @ commons-net ---
[INFO] Downloading from central: https://repo.maven.apache.org/maven2/org/codehaus/plexus/plexus-utils/4.0.3/plexus-utils-4.0.3.pom
[INFO] Downloaded from central: https://repo.maven.apache.org/maven2/org/codehaus/plexus/plexus-utils/4.0.3/plexus-utils-4.0.3.pom (6.8 kB at 113 kB/s)
[INFO] Downloading from central: https://repo.maven.apache.org/maven2/org/apache/maven/enforcer/enforcer-api/3.6.3/enforcer-api-3.6.3.pom
[INFO] Downloaded from central: https://repo.maven.apache.org/maven2/org/apache/maven/enforcer/enforcer-api/3.6.3/enforcer-api-3.6.3.pom (3.8 kB at 69 kB/s)
[INFO] Downloading from central: https://repo.maven.apache.org/maven2/org/apache/maven/enforcer/enforcer-rules/3.6.3/enforcer-rules-3.6.3.pom
[INFO] Downloaded from central: https://repo.maven.apache.org/maven2/org/apache/maven/enforcer/enforcer-rules/3.6.3/enforcer-rules-3.6.3.pom (5.5 kB at 103 kB/s)
[INFO] Downloading from central: https://repo.maven.apache.org/maven2/org/apache/maven/resolver/maven-resolver-util/1.9.27/maven-resolver-util-1.9.27.pom
[INFO] Downloaded from central: https://repo.maven.apache.org/maven2/org/apache/maven/resolver/maven-resolver-util/1.9.27/maven-resolver-util-1.9.27.pom (2.2 kB at 34 kB/s)
[INFO] Downloading from central: https://repo.maven.apache.org/maven2/org/apache/maven/resolver/maven-resolver/1.9.27/maven-resolver-1.9.27.pom
[INFO] Downloaded from central: https://repo.maven.apache.org/maven2/org/apache/maven/resolver/maven-resolver/1.9.27/maven-resolver-1.9.27.pom (25 kB at 292 kB/s)
[INFO] Downloading from central: https://repo.maven.apache.org/maven2/org/apache/maven/resolver/maven-resolver-api/1.9.27/maven-resolver-api-1.9.27.pom
[INFO] Downloaded from central: https://repo.maven.apache.org/maven2/org/apache/maven/resolver/maven-resolver-api/1.9.27/maven-resolver-api-1.9.27.pom (2.2 kB at 39 kB/s)
[INFO] Downloading from central: https://repo.maven.apache.org/maven2/org/codehaus/plexus/plexus-utils/4.0.3/plexus-utils-4.0.3.jar
[INFO] Downloaded from central: https://repo.maven.apache.org/maven2/org/codehaus/plexus/plexus-utils/4.0.3/plexus-utils-4.0.3.jar (193 kB at 2.3 MB/s)
[INFO] Downloading from central: https://repo.maven.apache.org/maven2/org/apache/maven/enforcer/enforcer-api/3.6.3/enforcer-api-3.6.3.jar
[INFO] Downloading from central: https://repo.maven.apache.org/maven2/org/apache/maven/enforcer/enforcer-rules/3.6.3/enforcer-rules-3.6.3.jar
[INFO] Downloading from central: https://repo.maven.apache.org/maven2/org/apache/maven/resolver/maven-resolver-util/1.9.27/maven-resolver-util-1.9.27.jar
[INFO] Downloaded from central: https://repo.maven.apache.org/maven2/org/apache/maven/resolver/maven-resolver-util/1.9.27/maven-resolver-util-1.9.27.jar (197 kB at 1.3 MB/s)
[INFO] Downloaded from central: https://repo.maven.apache.org/maven2/org/apache/maven/enforcer/enforcer-rules/3.6.3/enforcer-rules-3.6.3.jar (163 kB at 1.0 MB/s)
[INFO] Downloaded from central: https://repo.maven.apache.org/maven2/org/apache/maven/enforcer/enforcer-api/3.6.3/enforcer-api-3.6.3.jar (15 kB at 41 kB/s)
[INFO] Rule 0: org.apache.maven.enforcer.rules.version.RequireMavenVersion passed
[INFO]
[INFO] --- enforcer:3.6.3:enforce (enforce-java-version) @ commons-net ---
[INFO] Rule 0: org.apache.maven.enforcer.rules.version.RequireJavaVersion passed
[INFO]
[INFO] --- apache-rat:0.18:check (rat-check) @ commons-net ---
[ERROR] Could not create report parent directory <https://ci-builds.apache.org/job/Commons/job/commons-net-windows/commons-net$commons-net/ws/f>:\jenkins\jenkins-home\712657a4\workspace\Commons\commons-net-windows\target\rat.txt
[WARNING] Unable to create directory: <https://ci-builds.apache.org/job/Commons/job/commons-net-windows/commons-net$commons-net/ws/f>:\jenkins\jenkins-home\712657a4\workspace\Commons\commons-net-windows\target
[WARNING] Attempt to (de-)serialize anonymous class org.jfrog.hudson.maven2.MavenDependenciesRecorder$1; see: https://jenkins.io/redirect/serialization-of-anonymous-classes/
Build failed in Jenkins: Commons » commons-net-windows » Apache Commons Net #325
Posted by Apache Jenkins Server <je...@builds.apache.org>.
See <https://ci-builds.apache.org/job/Commons/job/commons-net-windows/commons-net$commons-net/325/display/redirect?page=changes>
Changes:
[garydgregory] Bump github/codeql-action from 4.37.0 to 4.37.1
------------------------------------------
Established TCP socket on 65407
maven35-agent.jar already up to date
maven35-interceptor.jar already up to date
maven3-interceptor-commons.jar already up to date
<===[JENKINS REMOTING CAPACITY]===> channel started
Executing Maven: -B -f <https://ci-builds.apache.org/job/Commons/job/commons-net-windows/commons-net$commons-net/ws/pom.xml> -V clean install --no-transfer-progress --batch-mode -Pjava-1.8
[1mApache Maven 3.9.11 (3e54c93a704957b63ee3494413a2b544fd3d825b)[m
Maven home: F:\jenkins\tools\maven\latest
Java version: 17.0.7, vendor: Eclipse Adoptium, runtime: F:\jenkins\tools\java\latest17
Default locale: en_US, platform encoding: Cp1252
OS name: "windows server 2019", version: "10.0", arch: "amd64", family: "windows"
[INFO] Scanning for projects...
[HUDSON] Collecting dependencies info
[INFO]
[INFO] ----------------------< commons-net:commons-net >-----------------------
[INFO] Building Apache Commons Net 3.13.1-SNAPSHOT
[INFO] from pom.xml
[INFO] --------------------------------[ jar ]---------------------------------
[INFO]
[INFO] --- clean:3.5.0:clean (default-clean) @ commons-net ---
[INFO]
[INFO] --- enforcer:3.6.2:enforce (enforce-maven-version) @ commons-net ---
[INFO] Rule 0: org.apache.maven.enforcer.rules.version.RequireMavenVersion passed
[INFO]
[INFO] --- enforcer:3.6.2:enforce (enforce-java-version) @ commons-net ---
[INFO] Rule 0: org.apache.maven.enforcer.rules.version.RequireJavaVersion passed
[INFO]
[INFO] --- apache-rat:0.18:check (rat-check) @ commons-net ---
[ERROR] Could not create report parent directory <https://ci-builds.apache.org/job/Commons/job/commons-net-windows/commons-net$commons-net/ws/f>:\jenkins\jenkins-home\712657a4\workspace\Commons\commons-net-windows\target\rat.txt
[WARNING] Unable to create directory: <https://ci-builds.apache.org/job/Commons/job/commons-net-windows/commons-net$commons-net/ws/f>:\jenkins\jenkins-home\712657a4\workspace\Commons\commons-net-windows\target
[WARNING] Attempt to (de-)serialize anonymous class org.jfrog.hudson.maven2.MavenDependenciesRecorder$1; see: https://jenkins.io/redirect/serialization-of-anonymous-classes/
Build failed in Jenkins: Commons » commons-net-windows » Apache Commons Net #324
Posted by Apache Jenkins Server <je...@builds.apache.org>.
See <https://ci-builds.apache.org/job/Commons/job/commons-net-windows/commons-net$commons-net/324/display/redirect?page=changes>
Changes:
[garydgregory] Bump actions/setup-java from 5.5.0 to 5.6.0
------------------------------------------
Established TCP socket on 61004
maven35-agent.jar already up to date
maven35-interceptor.jar already up to date
maven3-interceptor-commons.jar already up to date
<===[JENKINS REMOTING CAPACITY]===> channel started
Executing Maven: -B -f <https://ci-builds.apache.org/job/Commons/job/commons-net-windows/commons-net$commons-net/ws/pom.xml> -V clean install --no-transfer-progress --batch-mode -Pjava-1.8
[1mApache Maven 3.9.11 (3e54c93a704957b63ee3494413a2b544fd3d825b)[m
Maven home: F:\jenkins\tools\maven\latest
Java version: 17.0.7, vendor: Eclipse Adoptium, runtime: F:\jenkins\tools\java\latest17
Default locale: en_US, platform encoding: Cp1252
OS name: "windows server 2019", version: "10.0", arch: "amd64", family: "windows"
[INFO] Scanning for projects...
[HUDSON] Collecting dependencies info
[INFO]
[INFO] ----------------------< commons-net:commons-net >-----------------------
[INFO] Building Apache Commons Net 3.13.1-SNAPSHOT
[INFO] from pom.xml
[INFO] --------------------------------[ jar ]---------------------------------
[INFO]
[INFO] --- clean:3.5.0:clean (default-clean) @ commons-net ---
[INFO]
[INFO] --- enforcer:3.6.2:enforce (enforce-maven-version) @ commons-net ---
[INFO] Rule 0: org.apache.maven.enforcer.rules.version.RequireMavenVersion passed
[INFO]
[INFO] --- enforcer:3.6.2:enforce (enforce-java-version) @ commons-net ---
[INFO] Rule 0: org.apache.maven.enforcer.rules.version.RequireJavaVersion passed
[INFO]
[INFO] --- apache-rat:0.18:check (rat-check) @ commons-net ---
[ERROR] Could not create report parent directory <https://ci-builds.apache.org/job/Commons/job/commons-net-windows/commons-net$commons-net/ws/f>:\jenkins\jenkins-home\712657a4\workspace\Commons\commons-net-windows\target\rat.txt
[WARNING] Unable to create directory: <https://ci-builds.apache.org/job/Commons/job/commons-net-windows/commons-net$commons-net/ws/f>:\jenkins\jenkins-home\712657a4\workspace\Commons\commons-net-windows\target
[WARNING] Attempt to (de-)serialize anonymous class org.jfrog.hudson.maven2.MavenDependenciesRecorder$1; see: https://jenkins.io/redirect/serialization-of-anonymous-classes/
Build failed in Jenkins: Commons » commons-net-windows » Apache Commons Net #323
Posted by Apache Jenkins Server <je...@builds.apache.org>.
See <https://ci-builds.apache.org/job/Commons/job/commons-net-windows/commons-net$commons-net/323/display/redirect?page=changes>
Changes:
[github] Run hostname verifier on FTPS data connection (#404)
[garydgregory] Run hostname verifier on FTPS data connection (#404).
[garydgregory] Refactor duplication.
------------------------------------------
Established TCP socket on 58902
maven35-agent.jar already up to date
maven35-interceptor.jar already up to date
maven3-interceptor-commons.jar already up to date
<===[JENKINS REMOTING CAPACITY]===> channel started
Executing Maven: -B -f <https://ci-builds.apache.org/job/Commons/job/commons-net-windows/commons-net$commons-net/ws/pom.xml> -V clean install --no-transfer-progress --batch-mode -Pjava-1.8
[1mApache Maven 3.9.11 (3e54c93a704957b63ee3494413a2b544fd3d825b)[m
Maven home: F:\jenkins\tools\maven\latest
Java version: 17.0.7, vendor: Eclipse Adoptium, runtime: F:\jenkins\tools\java\latest17
Default locale: en_US, platform encoding: Cp1252
OS name: "windows server 2019", version: "10.0", arch: "amd64", family: "windows"
[INFO] Scanning for projects...
[HUDSON] Collecting dependencies info
[INFO]
[INFO] ----------------------< commons-net:commons-net >-----------------------
[INFO] Building Apache Commons Net 3.13.1-SNAPSHOT
[INFO] from pom.xml
[INFO] --------------------------------[ jar ]---------------------------------
[INFO]
[INFO] --- clean:3.5.0:clean (default-clean) @ commons-net ---
[INFO]
[INFO] --- enforcer:3.6.2:enforce (enforce-maven-version) @ commons-net ---
[INFO] Rule 0: org.apache.maven.enforcer.rules.version.RequireMavenVersion passed
[INFO]
[INFO] --- enforcer:3.6.2:enforce (enforce-java-version) @ commons-net ---
[INFO] Rule 0: org.apache.maven.enforcer.rules.version.RequireJavaVersion passed
[INFO]
[INFO] --- apache-rat:0.18:check (rat-check) @ commons-net ---
[ERROR] Could not create report parent directory <https://ci-builds.apache.org/job/Commons/job/commons-net-windows/commons-net$commons-net/ws/f>:\jenkins\jenkins-home\712657a4\workspace\Commons\commons-net-windows\target\rat.txt
[WARNING] Unable to create directory: <https://ci-builds.apache.org/job/Commons/job/commons-net-windows/commons-net$commons-net/ws/f>:\jenkins\jenkins-home\712657a4\workspace\Commons\commons-net-windows\target
[WARNING] Attempt to (de-)serialize anonymous class org.jfrog.hudson.maven2.MavenDependenciesRecorder$1; see: https://jenkins.io/redirect/serialization-of-anonymous-classes/
Build failed in Jenkins: Commons » commons-net-windows » Apache Commons Net #322
Posted by Apache Jenkins Server <je...@builds.apache.org>.
See <https://ci-builds.apache.org/job/Commons/job/commons-net-windows/commons-net$commons-net/322/display/redirect?page=changes>
Changes:
[garydgregory] Bump actions/setup-java from 5.4.0 to 5.5.0
------------------------------------------
Established TCP socket on 58975
maven35-agent.jar already up to date
maven35-interceptor.jar already up to date
maven3-interceptor-commons.jar already up to date
<===[JENKINS REMOTING CAPACITY]===> channel started
Executing Maven: -B -f <https://ci-builds.apache.org/job/Commons/job/commons-net-windows/commons-net$commons-net/ws/pom.xml> -V clean install --no-transfer-progress --batch-mode -Pjava-1.8
[1mApache Maven 3.9.11 (3e54c93a704957b63ee3494413a2b544fd3d825b)[m
Maven home: F:\jenkins\tools\maven\latest
Java version: 17.0.7, vendor: Eclipse Adoptium, runtime: F:\jenkins\tools\java\latest17
Default locale: en_US, platform encoding: Cp1252
OS name: "windows server 2019", version: "10.0", arch: "amd64", family: "windows"
[INFO] Scanning for projects...
[HUDSON] Collecting dependencies info
[INFO]
[INFO] ----------------------< commons-net:commons-net >-----------------------
[INFO] Building Apache Commons Net 3.13.1-SNAPSHOT
[INFO] from pom.xml
[INFO] --------------------------------[ jar ]---------------------------------
[INFO]
[INFO] --- clean:3.5.0:clean (default-clean) @ commons-net ---
[INFO]
[INFO] --- enforcer:3.6.2:enforce (enforce-maven-version) @ commons-net ---
[INFO] Rule 0: org.apache.maven.enforcer.rules.version.RequireMavenVersion passed
[INFO]
[INFO] --- enforcer:3.6.2:enforce (enforce-java-version) @ commons-net ---
[INFO] Rule 0: org.apache.maven.enforcer.rules.version.RequireJavaVersion passed
[INFO]
[INFO] --- apache-rat:0.18:check (rat-check) @ commons-net ---
[ERROR] Could not create report parent directory <https://ci-builds.apache.org/job/Commons/job/commons-net-windows/commons-net$commons-net/ws/f>:\jenkins\jenkins-home\712657a4\workspace\Commons\commons-net-windows\target\rat.txt
[WARNING] Unable to create directory: <https://ci-builds.apache.org/job/Commons/job/commons-net-windows/commons-net$commons-net/ws/f>:\jenkins\jenkins-home\712657a4\workspace\Commons\commons-net-windows\target
[WARNING] Attempt to (de-)serialize anonymous class org.jfrog.hudson.maven2.MavenDependenciesRecorder$1; see: https://jenkins.io/redirect/serialization-of-anonymous-classes/
Build failed in Jenkins: Commons » commons-net-windows » Apache Commons Net #321
Posted by Apache Jenkins Server <je...@builds.apache.org>.
See <https://ci-builds.apache.org/job/Commons/job/commons-net-windows/commons-net$commons-net/321/display/redirect?page=changes>
Changes:
[garydgregory] Javadoc
------------------------------------------
Established TCP socket on 50396
maven35-agent.jar already up to date
maven35-interceptor.jar already up to date
maven3-interceptor-commons.jar already up to date
<===[JENKINS REMOTING CAPACITY]===> channel started
Executing Maven: -B -f <https://ci-builds.apache.org/job/Commons/job/commons-net-windows/commons-net$commons-net/ws/pom.xml> -V clean install --no-transfer-progress --batch-mode -Pjava-1.8
[1mApache Maven 3.9.11 (3e54c93a704957b63ee3494413a2b544fd3d825b)[m
Maven home: F:\jenkins\tools\maven\latest
Java version: 17.0.7, vendor: Eclipse Adoptium, runtime: F:\jenkins\tools\java\latest17
Default locale: en_US, platform encoding: Cp1252
OS name: "windows server 2019", version: "10.0", arch: "amd64", family: "windows"
[INFO] Scanning for projects...
[HUDSON] Collecting dependencies info
[INFO]
[INFO] ----------------------< commons-net:commons-net >-----------------------
[INFO] Building Apache Commons Net 3.13.1-SNAPSHOT
[INFO] from pom.xml
[INFO] --------------------------------[ jar ]---------------------------------
[INFO]
[INFO] --- clean:3.5.0:clean (default-clean) @ commons-net ---
[INFO]
[INFO] --- enforcer:3.6.2:enforce (enforce-maven-version) @ commons-net ---
[INFO] Rule 0: org.apache.maven.enforcer.rules.version.RequireMavenVersion passed
[INFO]
[INFO] --- enforcer:3.6.2:enforce (enforce-java-version) @ commons-net ---
[INFO] Rule 0: org.apache.maven.enforcer.rules.version.RequireJavaVersion passed
[INFO]
[INFO] --- apache-rat:0.18:check (rat-check) @ commons-net ---
[ERROR] Could not create report parent directory <https://ci-builds.apache.org/job/Commons/job/commons-net-windows/commons-net$commons-net/ws/f>:\jenkins\jenkins-home\712657a4\workspace\Commons\commons-net-windows\target\rat.txt
[WARNING] Unable to create directory: <https://ci-builds.apache.org/job/Commons/job/commons-net-windows/commons-net$commons-net/ws/f>:\jenkins\jenkins-home\712657a4\workspace\Commons\commons-net-windows\target
[WARNING] Attempt to (de-)serialize anonymous class org.jfrog.hudson.maven2.MavenDependenciesRecorder$1; see: https://jenkins.io/redirect/serialization-of-anonymous-classes/
Build failed in Jenkins: Commons » commons-net-windows » Apache Commons Net #320
Posted by Apache Jenkins Server <je...@builds.apache.org>.
See <https://ci-builds.apache.org/job/Commons/job/commons-net-windows/commons-net$commons-net/320/display/redirect?page=changes>
Changes:
[garydgregory] Javadoc
[garydgregory] Javadoc
------------------------------------------
Established TCP socket on 50616
maven35-agent.jar already up to date
maven35-interceptor.jar already up to date
maven3-interceptor-commons.jar already up to date
<===[JENKINS REMOTING CAPACITY]===> channel started
Executing Maven: -B -f <https://ci-builds.apache.org/job/Commons/job/commons-net-windows/commons-net$commons-net/ws/pom.xml> -V clean install --no-transfer-progress --batch-mode -Pjava-1.8
[1mApache Maven 3.9.11 (3e54c93a704957b63ee3494413a2b544fd3d825b)[m
Maven home: F:\jenkins\tools\maven\latest
Java version: 17.0.7, vendor: Eclipse Adoptium, runtime: F:\jenkins\tools\java\latest17
Default locale: en_US, platform encoding: Cp1252
OS name: "windows server 2019", version: "10.0", arch: "amd64", family: "windows"
[INFO] Scanning for projects...
[HUDSON] Collecting dependencies info
[INFO]
[INFO] ----------------------< commons-net:commons-net >-----------------------
[INFO] Building Apache Commons Net 3.13.1-SNAPSHOT
[INFO] from pom.xml
[INFO] --------------------------------[ jar ]---------------------------------
[INFO]
[INFO] --- clean:3.5.0:clean (default-clean) @ commons-net ---
[INFO]
[INFO] --- enforcer:3.6.2:enforce (enforce-maven-version) @ commons-net ---
[INFO] Rule 0: org.apache.maven.enforcer.rules.version.RequireMavenVersion passed
[INFO]
[INFO] --- enforcer:3.6.2:enforce (enforce-java-version) @ commons-net ---
[INFO] Rule 0: org.apache.maven.enforcer.rules.version.RequireJavaVersion passed
[INFO]
[INFO] --- apache-rat:0.18:check (rat-check) @ commons-net ---
[ERROR] Could not create report parent directory <https://ci-builds.apache.org/job/Commons/job/commons-net-windows/commons-net$commons-net/ws/f>:\jenkins\jenkins-home\712657a4\workspace\Commons\commons-net-windows\target\rat.txt
[WARNING] Unable to create directory: <https://ci-builds.apache.org/job/Commons/job/commons-net-windows/commons-net$commons-net/ws/f>:\jenkins\jenkins-home\712657a4\workspace\Commons\commons-net-windows\target
[WARNING] Attempt to (de-)serialize anonymous class org.jfrog.hudson.maven2.MavenDependenciesRecorder$1; see: https://jenkins.io/redirect/serialization-of-anonymous-classes/
Build failed in Jenkins: Commons » commons-net-windows » Apache Commons Net #319
Posted by Apache Jenkins Server <je...@builds.apache.org>.
See <https://ci-builds.apache.org/job/Commons/job/commons-net-windows/commons-net$commons-net/319/display/redirect?page=changes>
Changes:
[garydgregory] Bump github/codeql-action from 4.36.3 to 4.37.0
------------------------------------------
Established TCP socket on 52501
maven35-agent.jar already up to date
maven35-interceptor.jar already up to date
maven3-interceptor-commons.jar already up to date
<===[JENKINS REMOTING CAPACITY]===> channel started
Executing Maven: -B -f <https://ci-builds.apache.org/job/Commons/job/commons-net-windows/commons-net$commons-net/ws/pom.xml> -V clean install --no-transfer-progress --batch-mode -Pjava-1.8
[1mApache Maven 3.9.11 (3e54c93a704957b63ee3494413a2b544fd3d825b)[m
Maven home: F:\jenkins\tools\maven\latest
Java version: 17.0.7, vendor: Eclipse Adoptium, runtime: F:\jenkins\tools\java\latest17
Default locale: en_US, platform encoding: Cp1252
OS name: "windows server 2019", version: "10.0", arch: "amd64", family: "windows"
[INFO] Scanning for projects...
[HUDSON] Collecting dependencies info
[INFO]
[INFO] ----------------------< commons-net:commons-net >-----------------------
[INFO] Building Apache Commons Net 3.13.1-SNAPSHOT
[INFO] from pom.xml
[INFO] --------------------------------[ jar ]---------------------------------
[INFO]
[INFO] --- clean:3.5.0:clean (default-clean) @ commons-net ---
[INFO]
[INFO] --- enforcer:3.6.2:enforce (enforce-maven-version) @ commons-net ---
[INFO] Rule 0: org.apache.maven.enforcer.rules.version.RequireMavenVersion passed
[INFO]
[INFO] --- enforcer:3.6.2:enforce (enforce-java-version) @ commons-net ---
[INFO] Rule 0: org.apache.maven.enforcer.rules.version.RequireJavaVersion passed
[INFO]
[INFO] --- apache-rat:0.18:check (rat-check) @ commons-net ---
[ERROR] Could not create report parent directory <https://ci-builds.apache.org/job/Commons/job/commons-net-windows/commons-net$commons-net/ws/f>:\jenkins\jenkins-home\712657a4\workspace\Commons\commons-net-windows\target\rat.txt
[WARNING] Unable to create directory: <https://ci-builds.apache.org/job/Commons/job/commons-net-windows/commons-net$commons-net/ws/f>:\jenkins\jenkins-home\712657a4\workspace\Commons\commons-net-windows\target
[WARNING] Attempt to (de-)serialize anonymous class org.jfrog.hudson.maven2.MavenDependenciesRecorder$1; see: https://jenkins.io/redirect/serialization-of-anonymous-classes/
Build failed in Jenkins: Commons » commons-net-windows » Apache Commons Net #318
Posted by Apache Jenkins Server <je...@builds.apache.org>.
See <https://ci-builds.apache.org/job/Commons/job/commons-net-windows/commons-net$commons-net/318/display/redirect?page=changes>
Changes:
[garydgregory] Bump github/codeql-action from 4.36.2 to 4.36.3
------------------------------------------
Established TCP socket on 63197
maven35-agent.jar already up to date
maven35-interceptor.jar already up to date
maven3-interceptor-commons.jar already up to date
<===[JENKINS REMOTING CAPACITY]===> channel started
Executing Maven: -B -f <https://ci-builds.apache.org/job/Commons/job/commons-net-windows/commons-net$commons-net/ws/pom.xml> -V clean install --no-transfer-progress --batch-mode -Pjava-1.8
[1mApache Maven 3.9.11 (3e54c93a704957b63ee3494413a2b544fd3d825b)[m
Maven home: F:\jenkins\tools\maven\latest
Java version: 17.0.7, vendor: Eclipse Adoptium, runtime: F:\jenkins\tools\java\latest17
Default locale: en_US, platform encoding: Cp1252
OS name: "windows server 2022", version: "10.0", arch: "amd64", family: "windows"
[INFO] Scanning for projects...
[HUDSON] Collecting dependencies info
[INFO]
[INFO] ----------------------< commons-net:commons-net >-----------------------
[INFO] Building Apache Commons Net 3.13.1-SNAPSHOT
[INFO] from pom.xml
[INFO] --------------------------------[ jar ]---------------------------------
[INFO]
[INFO] --- clean:3.5.0:clean (default-clean) @ commons-net ---
[INFO]
[INFO] --- enforcer:3.6.2:enforce (enforce-maven-version) @ commons-net ---
[INFO] Rule 0: org.apache.maven.enforcer.rules.version.RequireMavenVersion passed
[INFO]
[INFO] --- enforcer:3.6.2:enforce (enforce-java-version) @ commons-net ---
[INFO] Rule 0: org.apache.maven.enforcer.rules.version.RequireJavaVersion passed
[INFO]
[INFO] --- apache-rat:0.18:check (rat-check) @ commons-net ---
[ERROR] Could not create report parent directory <https://ci-builds.apache.org/job/Commons/job/commons-net-windows/commons-net$commons-net/ws/f>:\jenkins\jenkins-home\712657a4\workspace\Commons\commons-net-windows\target\rat.txt
[WARNING] Unable to create directory: <https://ci-builds.apache.org/job/Commons/job/commons-net-windows/commons-net$commons-net/ws/f>:\jenkins\jenkins-home\712657a4\workspace\Commons\commons-net-windows\target
[WARNING] Attempt to (de-)serialize anonymous class org.jfrog.hudson.maven2.MavenDependenciesRecorder$1; see: https://jenkins.io/redirect/serialization-of-anonymous-classes/
Build failed in Jenkins: Commons » commons-net-windows » Apache Commons Net #317
Posted by Apache Jenkins Server <je...@builds.apache.org>.
See <https://ci-builds.apache.org/job/Commons/job/commons-net-windows/commons-net$commons-net/317/display/redirect?page=changes>
Changes:
[garydgregory] Normalize spelling.
------------------------------------------
Established TCP socket on 52850
maven35-agent.jar already up to date
maven35-interceptor.jar already up to date
maven3-interceptor-commons.jar already up to date
<===[JENKINS REMOTING CAPACITY]===> channel started
Executing Maven: -B -f <https://ci-builds.apache.org/job/Commons/job/commons-net-windows/commons-net$commons-net/ws/pom.xml> -V clean install --no-transfer-progress --batch-mode -Pjava-1.8
[1mApache Maven 3.9.11 (3e54c93a704957b63ee3494413a2b544fd3d825b)[m
Maven home: F:\jenkins\tools\maven\latest
Java version: 17.0.7, vendor: Eclipse Adoptium, runtime: F:\jenkins\tools\java\latest17
Default locale: en_US, platform encoding: Cp1252
OS name: "windows server 2019", version: "10.0", arch: "amd64", family: "windows"
[INFO] Scanning for projects...
[HUDSON] Collecting dependencies info
[INFO]
[INFO] ----------------------< commons-net:commons-net >-----------------------
[INFO] Building Apache Commons Net 3.13.1-SNAPSHOT
[INFO] from pom.xml
[INFO] --------------------------------[ jar ]---------------------------------
[INFO]
[INFO] --- clean:3.5.0:clean (default-clean) @ commons-net ---
[INFO]
[INFO] --- enforcer:3.6.2:enforce (enforce-maven-version) @ commons-net ---
[INFO] Rule 0: org.apache.maven.enforcer.rules.version.RequireMavenVersion passed
[INFO]
[INFO] --- enforcer:3.6.2:enforce (enforce-java-version) @ commons-net ---
[INFO] Rule 0: org.apache.maven.enforcer.rules.version.RequireJavaVersion passed
[INFO]
[INFO] --- apache-rat:0.18:check (rat-check) @ commons-net ---
[ERROR] Could not create report parent directory <https://ci-builds.apache.org/job/Commons/job/commons-net-windows/commons-net$commons-net/ws/f>:\jenkins\jenkins-home\712657a4\workspace\Commons\commons-net-windows\target\rat.txt
[WARNING] Unable to create directory: <https://ci-builds.apache.org/job/Commons/job/commons-net-windows/commons-net$commons-net/ws/f>:\jenkins\jenkins-home\712657a4\workspace\Commons\commons-net-windows\target
[WARNING] Attempt to (de-)serialize anonymous class org.jfrog.hudson.maven2.MavenDependenciesRecorder$1; see: https://jenkins.io/redirect/serialization-of-anonymous-classes/
Build failed in Jenkins: Commons » commons-net-windows » Apache Commons Net #316
Posted by Apache Jenkins Server <je...@builds.apache.org>.
See <https://ci-builds.apache.org/job/Commons/job/commons-net-windows/commons-net$commons-net/316/display/redirect?page=changes>
Changes:
[github] Check parser type before instantiating class in DefaultFTPFileEntryParserFactory.createFileEntryParser() (#403)
[garydgregory] Check parser type before instantiating class in
------------------------------------------
Established TCP socket on 56554
maven35-agent.jar already up to date
maven35-interceptor.jar already up to date
maven3-interceptor-commons.jar already up to date
<===[JENKINS REMOTING CAPACITY]===> channel started
Executing Maven: -B -f <https://ci-builds.apache.org/job/Commons/job/commons-net-windows/commons-net$commons-net/ws/pom.xml> -V clean install --no-transfer-progress --batch-mode -Pjava-1.8
[1mApache Maven 3.9.11 (3e54c93a704957b63ee3494413a2b544fd3d825b)[m
Maven home: F:\jenkins\tools\maven\latest
Java version: 17.0.7, vendor: Eclipse Adoptium, runtime: F:\jenkins\tools\java\latest17
Default locale: en_US, platform encoding: Cp1252
OS name: "windows server 2019", version: "10.0", arch: "amd64", family: "windows"
[INFO] Scanning for projects...
[HUDSON] Collecting dependencies info
[INFO]
[INFO] ----------------------< commons-net:commons-net >-----------------------
[INFO] Building Apache Commons Net 3.13.1-SNAPSHOT
[INFO] from pom.xml
[INFO] --------------------------------[ jar ]---------------------------------
[INFO]
[INFO] --- clean:3.5.0:clean (default-clean) @ commons-net ---
[INFO]
[INFO] --- enforcer:3.6.2:enforce (enforce-maven-version) @ commons-net ---
[INFO] Rule 0: org.apache.maven.enforcer.rules.version.RequireMavenVersion passed
[INFO]
[INFO] --- enforcer:3.6.2:enforce (enforce-java-version) @ commons-net ---
[INFO] Rule 0: org.apache.maven.enforcer.rules.version.RequireJavaVersion passed
[INFO]
[INFO] --- apache-rat:0.18:check (rat-check) @ commons-net ---
[ERROR] Could not create report parent directory <https://ci-builds.apache.org/job/Commons/job/commons-net-windows/commons-net$commons-net/ws/f>:\jenkins\jenkins-home\712657a4\workspace\Commons\commons-net-windows\target\rat.txt
[WARNING] Unable to create directory: <https://ci-builds.apache.org/job/Commons/job/commons-net-windows/commons-net$commons-net/ws/f>:\jenkins\jenkins-home\712657a4\workspace\Commons\commons-net-windows\target
[WARNING] Attempt to (de-)serialize anonymous class org.jfrog.hudson.maven2.MavenDependenciesRecorder$1; see: https://jenkins.io/redirect/serialization-of-anonymous-classes/
Build failed in Jenkins: Commons » commons-net-windows » Apache Commons Net #315
Posted by Apache Jenkins Server <je...@builds.apache.org>.
See <https://ci-builds.apache.org/job/Commons/job/commons-net-windows/commons-net$commons-net/315/display/redirect?page=changes>
Changes:
[garydgregory] Flip null test
[garydgregory] Flip null test
------------------------------------------
Established TCP socket on 53406
maven35-agent.jar already up to date
maven35-interceptor.jar already up to date
maven3-interceptor-commons.jar already up to date
<===[JENKINS REMOTING CAPACITY]===> channel started
Executing Maven: -B -f <https://ci-builds.apache.org/job/Commons/job/commons-net-windows/commons-net$commons-net/ws/pom.xml> -V clean install --no-transfer-progress --batch-mode -Pjava-1.8
[1mApache Maven 3.9.11 (3e54c93a704957b63ee3494413a2b544fd3d825b)[m
Maven home: F:\jenkins\tools\maven\latest
Java version: 17.0.7, vendor: Eclipse Adoptium, runtime: F:\jenkins\tools\java\latest17
Default locale: en_US, platform encoding: Cp1252
OS name: "windows server 2019", version: "10.0", arch: "amd64", family: "windows"
[INFO] Scanning for projects...
[HUDSON] Collecting dependencies info
[INFO]
[INFO] ----------------------< commons-net:commons-net >-----------------------
[INFO] Building Apache Commons Net 3.13.1-SNAPSHOT
[INFO] from pom.xml
[INFO] --------------------------------[ jar ]---------------------------------
[INFO]
[INFO] --- clean:3.5.0:clean (default-clean) @ commons-net ---
[INFO]
[INFO] --- enforcer:3.6.2:enforce (enforce-maven-version) @ commons-net ---
[INFO] Rule 0: org.apache.maven.enforcer.rules.version.RequireMavenVersion passed
[INFO]
[INFO] --- enforcer:3.6.2:enforce (enforce-java-version) @ commons-net ---
[INFO] Rule 0: org.apache.maven.enforcer.rules.version.RequireJavaVersion passed
[INFO]
[INFO] --- apache-rat:0.18:check (rat-check) @ commons-net ---
[ERROR] Could not create report parent directory <https://ci-builds.apache.org/job/Commons/job/commons-net-windows/commons-net$commons-net/ws/f>:\jenkins\jenkins-home\712657a4\workspace\Commons\commons-net-windows\target\rat.txt
[WARNING] Unable to create directory: <https://ci-builds.apache.org/job/Commons/job/commons-net-windows/commons-net$commons-net/ws/f>:\jenkins\jenkins-home\712657a4\workspace\Commons\commons-net-windows\target
[WARNING] Attempt to (de-)serialize anonymous class org.jfrog.hudson.maven2.MavenDependenciesRecorder$1; see: https://jenkins.io/redirect/serialization-of-anonymous-classes/
Build failed in Jenkins: Commons » commons-net-windows » Apache Commons Net #314
Posted by Apache Jenkins Server <je...@builds.apache.org>.
See <https://ci-builds.apache.org/job/Commons/job/commons-net-windows/commons-net$commons-net/314/display/redirect?page=changes>
Changes:
[garydgregory] Flip test
------------------------------------------
Established TCP socket on 51837
maven35-agent.jar already up to date
maven35-interceptor.jar already up to date
maven3-interceptor-commons.jar already up to date
<===[JENKINS REMOTING CAPACITY]===> channel started
Executing Maven: -B -f <https://ci-builds.apache.org/job/Commons/job/commons-net-windows/commons-net$commons-net/ws/pom.xml> -V clean install --no-transfer-progress --batch-mode -Pjava-1.8
[1mApache Maven 3.9.11 (3e54c93a704957b63ee3494413a2b544fd3d825b)[m
Maven home: F:\jenkins\tools\maven\latest
Java version: 17.0.7, vendor: Eclipse Adoptium, runtime: F:\jenkins\tools\java\latest17
Default locale: en_US, platform encoding: Cp1252
OS name: "windows server 2019", version: "10.0", arch: "amd64", family: "windows"
[INFO] Scanning for projects...
[HUDSON] Collecting dependencies info
[INFO]
[INFO] ----------------------< commons-net:commons-net >-----------------------
[INFO] Building Apache Commons Net 3.13.1-SNAPSHOT
[INFO] from pom.xml
[INFO] --------------------------------[ jar ]---------------------------------
[INFO] Downloading from central: https://repo.maven.apache.org/maven2/org/apache/rat/apache-rat-plugin/0.18/apache-rat-plugin-0.18.pom
[INFO] Downloaded from central: https://repo.maven.apache.org/maven2/org/apache/rat/apache-rat-plugin/0.18/apache-rat-plugin-0.18.pom (17 kB at 35 kB/s)
[INFO] Downloading from central: https://repo.maven.apache.org/maven2/org/apache/rat/apache-rat-project/0.18/apache-rat-project-0.18.pom
[INFO] Downloaded from central: https://repo.maven.apache.org/maven2/org/apache/rat/apache-rat-project/0.18/apache-rat-project-0.18.pom (41 kB at 431 kB/s)
[INFO] Downloading from central: https://repo.maven.apache.org/maven2/org/assertj/assertj-bom/4.0.0-M1/assertj-bom-4.0.0-M1.pom
[INFO] Downloaded from central: https://repo.maven.apache.org/maven2/org/assertj/assertj-bom/4.0.0-M1/assertj-bom-4.0.0-M1.pom (3.7 kB at 61 kB/s)
[INFO] Downloading from central: https://repo.maven.apache.org/maven2/org/junit/junit-bom/6.1.0-M1/junit-bom-6.1.0-M1.pom
[INFO] Downloaded from central: https://repo.maven.apache.org/maven2/org/junit/junit-bom/6.1.0-M1/junit-bom-6.1.0-M1.pom (5.3 kB at 101 kB/s)
[INFO] Downloading from central: https://repo.maven.apache.org/maven2/org/mockito/mockito-bom/5.22.0/mockito-bom-5.22.0.pom
[INFO] Downloaded from central: https://repo.maven.apache.org/maven2/org/mockito/mockito-bom/5.22.0/mockito-bom-5.22.0.pom (3.0 kB at 49 kB/s)
[INFO] Downloading from central: https://repo.maven.apache.org/maven2/org/apache/rat/apache-rat-plugin/0.18/apache-rat-plugin-0.18.jar
[INFO] Downloaded from central: https://repo.maven.apache.org/maven2/org/apache/rat/apache-rat-plugin/0.18/apache-rat-plugin-0.18.jar (97 kB at 1.2 MB/s)
[INFO]
[INFO] --- clean:3.5.0:clean (default-clean) @ commons-net ---
[INFO]
[INFO] --- enforcer:3.6.2:enforce (enforce-maven-version) @ commons-net ---
[INFO] Rule 0: org.apache.maven.enforcer.rules.version.RequireMavenVersion passed
[INFO]
[INFO] --- enforcer:3.6.2:enforce (enforce-java-version) @ commons-net ---
[INFO] Rule 0: org.apache.maven.enforcer.rules.version.RequireJavaVersion passed
[INFO]
[INFO] --- apache-rat:0.18:check (rat-check) @ commons-net ---
[INFO] Downloading from central: https://repo.maven.apache.org/maven2/org/apache/rat/apache-rat-core/0.18/apache-rat-core-0.18.pom
[INFO] Downloaded from central: https://repo.maven.apache.org/maven2/org/apache/rat/apache-rat-core/0.18/apache-rat-core-0.18.pom (9.2 kB at 122 kB/s)
[INFO] Downloading from central: https://repo.maven.apache.org/maven2/org/apache/commons/commons-text/1.15.0/commons-text-1.15.0.pom
[INFO] Downloaded from central: https://repo.maven.apache.org/maven2/org/apache/commons/commons-text/1.15.0/commons-text-1.15.0.pom (24 kB at 324 kB/s)
[INFO] Downloading from central: https://repo.maven.apache.org/maven2/org/apache/tika/tika-core/3.2.3/tika-core-3.2.3.pom
[INFO] Downloaded from central: https://repo.maven.apache.org/maven2/org/apache/tika/tika-core/3.2.3/tika-core-3.2.3.pom (9.9 kB at 123 kB/s)
[INFO] Downloading from central: https://repo.maven.apache.org/maven2/org/apache/tika/tika-parent/3.2.3/tika-parent-3.2.3.pom
[INFO] Downloaded from central: https://repo.maven.apache.org/maven2/org/apache/tika/tika-parent/3.2.3/tika-parent-3.2.3.pom (57 kB at 578 kB/s)
[INFO] Downloading from central: https://repo.maven.apache.org/maven2/io/netty/netty-bom/4.2.6.Final/netty-bom-4.2.6.Final.pom
[INFO] Downloaded from central: https://repo.maven.apache.org/maven2/io/netty/netty-bom/4.2.6.Final/netty-bom-4.2.6.Final.pom (18 kB at 213 kB/s)
[INFO] Downloading from central: https://repo.maven.apache.org/maven2/org/apache/cxf/cxf-bom/4.0.9/cxf-bom-4.0.9.pom
[INFO] Downloaded from central: https://repo.maven.apache.org/maven2/org/apache/cxf/cxf-bom/4.0.9/cxf-bom-4.0.9.pom (24 kB at 349 kB/s)
[INFO] Downloading from central: https://repo.maven.apache.org/maven2/org/apache/cxf/cxf/4.0.9/cxf-4.0.9.pom
[INFO] Downloaded from central: https://repo.maven.apache.org/maven2/org/apache/cxf/cxf/4.0.9/cxf-4.0.9.pom (40 kB at 509 kB/s)
[INFO] Downloading from central: https://repo.maven.apache.org/maven2/org/apache/logging/log4j/log4j-bom/2.25.1/log4j-bom-2.25.1.pom
[INFO] Downloaded from central: https://repo.maven.apache.org/maven2/org/apache/logging/log4j/log4j-bom/2.25.1/log4j-bom-2.25.1.pom (12 kB at 166 kB/s)
[INFO] Downloading from central: https://repo.maven.apache.org/maven2/org/eclipse/jetty/jetty-bom/11.0.26/jetty-bom-11.0.26.pom
[INFO] Downloaded from central: https://repo.maven.apache.org/maven2/org/eclipse/jetty/jetty-bom/11.0.26/jetty-bom-11.0.26.pom (19 kB at 239 kB/s)
[INFO] Downloading from central: https://repo.maven.apache.org/maven2/org/testcontainers/testcontainers-bom/1.21.3/testcontainers-bom-1.21.3.pom
[INFO] Downloaded from central: https://repo.maven.apache.org/maven2/org/testcontainers/testcontainers-bom/1.21.3/testcontainers-bom-1.21.3.pom (12 kB at 172 kB/s)
[INFO] Downloading from central: https://repo.maven.apache.org/maven2/com/amazonaws/aws-java-sdk-bom/1.12.791/aws-java-sdk-bom-1.12.791.pom
[INFO] Downloaded from central: https://repo.maven.apache.org/maven2/com/amazonaws/aws-java-sdk-bom/1.12.791/aws-java-sdk-bom-1.12.791.pom (83 kB at 1.1 MB/s)
[INFO] Downloading from central: https://repo.maven.apache.org/maven2/com/amazonaws/aws-java-sdk-pom/1.12.791/aws-java-sdk-pom-1.12.791.pom
[INFO] Downloaded from central: https://repo.maven.apache.org/maven2/com/amazonaws/aws-java-sdk-pom/1.12.791/aws-java-sdk-pom-1.12.791.pom (27 kB at 397 kB/s)
[INFO] Downloading from central: https://repo.maven.apache.org/maven2/software/amazon/awssdk/bom/2.33.4/bom-2.33.4.pom
[INFO] Downloaded from central: https://repo.maven.apache.org/maven2/software/amazon/awssdk/bom/2.33.4/bom-2.33.4.pom (102 kB at 1.4 MB/s)
[INFO] Downloading from central: https://repo.maven.apache.org/maven2/software/amazon/awssdk/aws-sdk-java-pom/2.33.4/aws-sdk-java-pom-2.33.4.pom
[INFO] Downloaded from central: https://repo.maven.apache.org/maven2/software/amazon/awssdk/aws-sdk-java-pom/2.33.4/aws-sdk-java-pom-2.33.4.pom (83 kB at 769 kB/s)
[INFO] Downloading from central: https://repo.maven.apache.org/maven2/org/apache/tika/tika-parser-text-module/3.2.3/tika-parser-text-module-3.2.3.pom
[INFO] Downloaded from central: https://repo.maven.apache.org/maven2/org/apache/tika/tika-parser-text-module/3.2.3/tika-parser-text-module-3.2.3.pom (3.0 kB at 52 kB/s)
[INFO] Downloading from central: https://repo.maven.apache.org/maven2/org/apache/tika/tika-parsers-standard-modules/3.2.3/tika-parsers-standard-modules-3.2.3.pom
[INFO] Downloaded from central: https://repo.maven.apache.org/maven2/org/apache/tika/tika-parsers-standard-modules/3.2.3/tika-parsers-standard-modules-3.2.3.pom (4.0 kB at 64 kB/s)
[INFO] Downloading from central: https://repo.maven.apache.org/maven2/org/apache/tika/tika-parsers-standard/3.2.3/tika-parsers-standard-3.2.3.pom
[INFO] Downloaded from central: https://repo.maven.apache.org/maven2/org/apache/tika/tika-parsers-standard/3.2.3/tika-parsers-standard-3.2.3.pom (3.1 kB at 54 kB/s)
[INFO] Downloading from central: https://repo.maven.apache.org/maven2/org/apache/tika/tika-parsers/3.2.3/tika-parsers-3.2.3.pom
[INFO] Downloaded from central: https://repo.maven.apache.org/maven2/org/apache/tika/tika-parsers/3.2.3/tika-parsers-3.2.3.pom (3.6 kB at 66 kB/s)
[INFO] Downloading from central: https://repo.maven.apache.org/maven2/org/codehaus/plexus/plexus-testing/2.1.0/plexus-testing-2.1.0.pom
[INFO] Downloaded from central: https://repo.maven.apache.org/maven2/org/codehaus/plexus/plexus-testing/2.1.0/plexus-testing-2.1.0.pom (3.4 kB at 58 kB/s)
[INFO] Downloading from central: https://repo.maven.apache.org/maven2/org/codehaus/plexus/plexus/25/plexus-25.pom
[INFO] Downloaded from central: https://repo.maven.apache.org/maven2/org/codehaus/plexus/plexus/25/plexus-25.pom (31 kB at 408 kB/s)
[INFO] Downloading from central: https://repo.maven.apache.org/maven2/org/apache/rat/apache-rat-core/0.18/apache-rat-core-0.18.jar
[INFO] Downloaded from central: https://repo.maven.apache.org/maven2/org/apache/rat/apache-rat-core/0.18/apache-rat-core-0.18.jar (386 kB at 4.4 MB/s)
[INFO] Downloading from central: https://repo.maven.apache.org/maven2/org/apache/commons/commons-text/1.15.0/commons-text-1.15.0.jar
[INFO] Downloading from central: https://repo.maven.apache.org/maven2/org/apache/tika/tika-core/3.2.3/tika-core-3.2.3.jar
[INFO] Downloading from central: https://repo.maven.apache.org/maven2/org/apache/tika/tika-parser-text-module/3.2.3/tika-parser-text-module-3.2.3.jar
[INFO] Downloading from central: https://repo.maven.apache.org/maven2/org/codehaus/plexus/plexus-testing/2.1.0/plexus-testing-2.1.0.jar
[INFO] Downloading from central: https://repo.maven.apache.org/maven2/com/google/inject/guice/5.1.0/guice-5.1.0-classes.jar
[INFO] Downloaded from central: https://repo.maven.apache.org/maven2/org/apache/commons/commons-text/1.15.0/commons-text-1.15.0.jar (265 kB at 1.6 MB/s)
[INFO] Downloaded from central: https://repo.maven.apache.org/maven2/org/apache/tika/tika-parser-text-module/3.2.3/tika-parser-text-module-3.2.3.jar (128 kB at 599 kB/s)
[INFO] Downloaded from central: https://repo.maven.apache.org/maven2/org/apache/tika/tika-core/3.2.3/tika-core-3.2.3.jar (779 kB at 3.3 MB/s)
[INFO] Downloaded from central: https://repo.maven.apache.org/maven2/com/google/inject/guice/5.1.0/guice-5.1.0-classes.jar (657 kB at 2.6 MB/s)
[INFO] Downloaded from central: https://repo.maven.apache.org/maven2/org/codehaus/plexus/plexus-testing/2.1.0/plexus-testing-2.1.0.jar (9.1 kB at 29 kB/s)
[ERROR] Could not create report parent directory <https://ci-builds.apache.org/job/Commons/job/commons-net-windows/commons-net$commons-net/ws/f>:\jenkins\jenkins-home\712657a4\workspace\Commons\commons-net-windows\target\rat.txt
[WARNING] Unable to create directory: <https://ci-builds.apache.org/job/Commons/job/commons-net-windows/commons-net$commons-net/ws/f>:\jenkins\jenkins-home\712657a4\workspace\Commons\commons-net-windows\target
[WARNING] Attempt to (de-)serialize anonymous class org.jfrog.hudson.maven2.MavenDependenciesRecorder$1; see: https://jenkins.io/redirect/serialization-of-anonymous-classes/