You are viewing a plain text version of this content. The canonical link for it is here.
Posted to dev@kafka.apache.org by Apache Jenkins Server <je...@builds.apache.org> on 2017/03/30 18:22:53 UTC
Build failed in Jenkins: kafka-trunk-jdk8 #1388
See <https://builds.apache.org/job/kafka-trunk-jdk8/1388/display/redirect?page=changes>
Changes:
[ismael] MINOR: FetchRequest.Builder maxBytes for version <3
------------------------------------------
[...truncated 1.54 MB...]
org.apache.kafka.streams.state.internals.ChangeLoggingSegmentedBytesStoreTest > shouldLogPuts STARTED
org.apache.kafka.streams.state.internals.ChangeLoggingSegmentedBytesStoreTest > shouldLogPuts PASSED
org.apache.kafka.streams.state.internals.ChangeLoggingSegmentedBytesStoreTest > shouldInitUnderlyingStore STARTED
org.apache.kafka.streams.state.internals.ChangeLoggingSegmentedBytesStoreTest > shouldInitUnderlyingStore PASSED
org.apache.kafka.streams.state.internals.ChangeLoggingSegmentedBytesStoreTest > shouldLogRemoves STARTED
org.apache.kafka.streams.state.internals.ChangeLoggingSegmentedBytesStoreTest > shouldLogRemoves PASSED
org.apache.kafka.streams.state.internals.ChangeLoggingSegmentedBytesStoreTest > shouldDelegateToUnderlyingStoreWhenFetching STARTED
org.apache.kafka.streams.state.internals.ChangeLoggingSegmentedBytesStoreTest > shouldDelegateToUnderlyingStoreWhenFetching PASSED
org.apache.kafka.streams.state.internals.InMemoryLRUCacheStoreTest > shouldPutAllKeyValuePairs STARTED
org.apache.kafka.streams.state.internals.InMemoryLRUCacheStoreTest > shouldPutAllKeyValuePairs PASSED
org.apache.kafka.streams.state.internals.InMemoryLRUCacheStoreTest > testEvict STARTED
org.apache.kafka.streams.state.internals.InMemoryLRUCacheStoreTest > testEvict PASSED
org.apache.kafka.streams.state.internals.InMemoryLRUCacheStoreTest > shouldUpdateValuesForExistingKeysOnPutAll STARTED
org.apache.kafka.streams.state.internals.InMemoryLRUCacheStoreTest > shouldUpdateValuesForExistingKeysOnPutAll PASSED
org.apache.kafka.streams.state.internals.InMemoryLRUCacheStoreTest > testSize STARTED
org.apache.kafka.streams.state.internals.InMemoryLRUCacheStoreTest > testSize PASSED
org.apache.kafka.streams.state.internals.InMemoryLRUCacheStoreTest > testPutIfAbsent STARTED
org.apache.kafka.streams.state.internals.InMemoryLRUCacheStoreTest > testPutIfAbsent PASSED
org.apache.kafka.streams.state.internals.InMemoryLRUCacheStoreTest > testRestoreWithDefaultSerdes STARTED
org.apache.kafka.streams.state.internals.InMemoryLRUCacheStoreTest > testRestoreWithDefaultSerdes PASSED
org.apache.kafka.streams.state.internals.InMemoryLRUCacheStoreTest > testRestore STARTED
org.apache.kafka.streams.state.internals.InMemoryLRUCacheStoreTest > testRestore PASSED
org.apache.kafka.streams.state.internals.InMemoryLRUCacheStoreTest > testPutGetRange STARTED
org.apache.kafka.streams.state.internals.InMemoryLRUCacheStoreTest > testPutGetRange PASSED
org.apache.kafka.streams.state.internals.InMemoryLRUCacheStoreTest > testPutGetRangeWithDefaultSerdes STARTED
org.apache.kafka.streams.state.internals.InMemoryLRUCacheStoreTest > testPutGetRangeWithDefaultSerdes PASSED
org.apache.kafka.streams.state.internals.RocksDBKeyValueStoreTest > shouldUseCustomRocksDbConfigSetter STARTED
org.apache.kafka.streams.state.internals.RocksDBKeyValueStoreTest > shouldUseCustomRocksDbConfigSetter PASSED
org.apache.kafka.streams.state.internals.RocksDBKeyValueStoreTest > shouldPerformAllQueriesWithCachingDisabled STARTED
org.apache.kafka.streams.state.internals.RocksDBKeyValueStoreTest > shouldPerformAllQueriesWithCachingDisabled PASSED
org.apache.kafka.streams.state.internals.RocksDBKeyValueStoreTest > shouldPerformRangeQueriesWithCachingDisabled STARTED
org.apache.kafka.streams.state.internals.RocksDBKeyValueStoreTest > shouldPerformRangeQueriesWithCachingDisabled PASSED
org.apache.kafka.streams.state.internals.RocksDBKeyValueStoreTest > shouldCloseOpenIteratorsWhenStoreClosedAndThrowInvalidStateStoreOnHasNextAndNext STARTED
org.apache.kafka.streams.state.internals.RocksDBKeyValueStoreTest > shouldCloseOpenIteratorsWhenStoreClosedAndThrowInvalidStateStoreOnHasNextAndNext PASSED
org.apache.kafka.streams.state.internals.RocksDBKeyValueStoreTest > testSize STARTED
org.apache.kafka.streams.state.internals.RocksDBKeyValueStoreTest > testSize PASSED
org.apache.kafka.streams.state.internals.RocksDBKeyValueStoreTest > testPutIfAbsent STARTED
org.apache.kafka.streams.state.internals.RocksDBKeyValueStoreTest > testPutIfAbsent PASSED
org.apache.kafka.streams.state.internals.RocksDBKeyValueStoreTest > testRestoreWithDefaultSerdes STARTED
org.apache.kafka.streams.state.internals.RocksDBKeyValueStoreTest > testRestoreWithDefaultSerdes PASSED
org.apache.kafka.streams.state.internals.RocksDBKeyValueStoreTest > testRestore STARTED
org.apache.kafka.streams.state.internals.RocksDBKeyValueStoreTest > testRestore PASSED
org.apache.kafka.streams.state.internals.RocksDBKeyValueStoreTest > testPutGetRange STARTED
org.apache.kafka.streams.state.internals.RocksDBKeyValueStoreTest > testPutGetRange PASSED
org.apache.kafka.streams.state.internals.RocksDBKeyValueStoreTest > testPutGetRangeWithDefaultSerdes STARTED
org.apache.kafka.streams.state.internals.RocksDBKeyValueStoreTest > testPutGetRangeWithDefaultSerdes PASSED
org.apache.kafka.streams.KeyValueTest > shouldHaveSaneEqualsAndHashCode STARTED
org.apache.kafka.streams.KeyValueTest > shouldHaveSaneEqualsAndHashCode PASSED
org.apache.kafka.streams.KafkaStreamsTest > testIllegalMetricsConfig STARTED
org.apache.kafka.streams.KafkaStreamsTest > testIllegalMetricsConfig PASSED
org.apache.kafka.streams.KafkaStreamsTest > shouldNotGetAllTasksWhenNotRunning STARTED
org.apache.kafka.streams.KafkaStreamsTest > shouldNotGetAllTasksWhenNotRunning PASSED
org.apache.kafka.streams.KafkaStreamsTest > testInitializesAndDestroysMetricsReporters STARTED
org.apache.kafka.streams.KafkaStreamsTest > testInitializesAndDestroysMetricsReporters PASSED
org.apache.kafka.streams.KafkaStreamsTest > shouldNotGetTaskWithKeyAndPartitionerWhenNotRunning STARTED
org.apache.kafka.streams.KafkaStreamsTest > shouldNotGetTaskWithKeyAndPartitionerWhenNotRunning PASSED
org.apache.kafka.streams.KafkaStreamsTest > testLegalMetricsConfig STARTED
org.apache.kafka.streams.KafkaStreamsTest > testLegalMetricsConfig PASSED
org.apache.kafka.streams.KafkaStreamsTest > shouldNotGetTaskWithKeyAndSerializerWhenNotRunning STARTED
org.apache.kafka.streams.KafkaStreamsTest > shouldNotGetTaskWithKeyAndSerializerWhenNotRunning PASSED
org.apache.kafka.streams.KafkaStreamsTest > shouldReturnFalseOnCloseWhenThreadsHaventTerminated STARTED
org.apache.kafka.streams.KafkaStreamsTest > shouldReturnFalseOnCloseWhenThreadsHaventTerminated PASSED
org.apache.kafka.streams.KafkaStreamsTest > shouldNotGetAllTasksWithStoreWhenNotRunning STARTED
org.apache.kafka.streams.KafkaStreamsTest > shouldNotGetAllTasksWithStoreWhenNotRunning PASSED
org.apache.kafka.streams.KafkaStreamsTest > testCannotStartOnceClosed STARTED
org.apache.kafka.streams.KafkaStreamsTest > testCannotStartOnceClosed PASSED
org.apache.kafka.streams.KafkaStreamsTest > testCleanup STARTED
org.apache.kafka.streams.KafkaStreamsTest > testCleanup PASSED
org.apache.kafka.streams.KafkaStreamsTest > testNumberDefaultMetrics STARTED
org.apache.kafka.streams.KafkaStreamsTest > testNumberDefaultMetrics PASSED
org.apache.kafka.streams.KafkaStreamsTest > testCloseIsIdempotent STARTED
org.apache.kafka.streams.KafkaStreamsTest > testCloseIsIdempotent PASSED
org.apache.kafka.streams.KafkaStreamsTest > testCannotCleanupWhileRunning STARTED
org.apache.kafka.streams.KafkaStreamsTest > testCannotCleanupWhileRunning PASSED
org.apache.kafka.streams.KafkaStreamsTest > testCannotStartTwice STARTED
org.apache.kafka.streams.KafkaStreamsTest > testCannotStartTwice PASSED
org.apache.kafka.streams.integration.GlobalKTableIntegrationTest > shouldKStreamGlobalKTableLeftJoin STARTED
org.apache.kafka.streams.integration.GlobalKTableIntegrationTest > shouldKStreamGlobalKTableLeftJoin PASSED
org.apache.kafka.streams.integration.GlobalKTableIntegrationTest > shouldKStreamGlobalKTableJoin STARTED
org.apache.kafka.streams.integration.GlobalKTableIntegrationTest > shouldKStreamGlobalKTableJoin PASSED
org.apache.kafka.streams.integration.KStreamsFineGrainedAutoResetIntegrationTest > shouldThrowExceptionOverlappingPattern STARTED
org.apache.kafka.streams.integration.KStreamsFineGrainedAutoResetIntegrationTest > shouldThrowExceptionOverlappingPattern PASSED
org.apache.kafka.streams.integration.KStreamsFineGrainedAutoResetIntegrationTest > shouldThrowExceptionOverlappingTopic STARTED
org.apache.kafka.streams.integration.KStreamsFineGrainedAutoResetIntegrationTest > shouldThrowExceptionOverlappingTopic PASSED
org.apache.kafka.streams.integration.KStreamsFineGrainedAutoResetIntegrationTest > shouldThrowStreamsExceptionNoResetSpecified STARTED
org.apache.kafka.streams.integration.KStreamsFineGrainedAutoResetIntegrationTest > shouldThrowStreamsExceptionNoResetSpecified PASSED
org.apache.kafka.streams.integration.KStreamsFineGrainedAutoResetIntegrationTest > shouldOnlyReadRecordsWhereEarliestSpecified STARTED
org.apache.kafka.streams.integration.KStreamsFineGrainedAutoResetIntegrationTest > shouldOnlyReadRecordsWhereEarliestSpecified PASSED
org.apache.kafka.streams.integration.QueryableStateIntegrationTest > shouldNotMakeStoreAvailableUntilAllStoresAvailable STARTED
org.apache.kafka.streams.integration.QueryableStateIntegrationTest > shouldNotMakeStoreAvailableUntilAllStoresAvailable PASSED
org.apache.kafka.streams.integration.QueryableStateIntegrationTest > queryOnRebalance STARTED
org.apache.kafka.streams.integration.QueryableStateIntegrationTest > queryOnRebalance PASSED
org.apache.kafka.streams.integration.QueryableStateIntegrationTest > concurrentAccesses STARTED
org.apache.kafka.streams.integration.QueryableStateIntegrationTest > concurrentAccesses PASSED
org.apache.kafka.streams.integration.QueryableStateIntegrationTest > shouldBeAbleToQueryStateWithZeroSizedCache STARTED
org.apache.kafka.streams.integration.QueryableStateIntegrationTest > shouldBeAbleToQueryStateWithZeroSizedCache PASSED
org.apache.kafka.streams.integration.QueryableStateIntegrationTest > shouldBeAbleToQueryStateWithNonZeroSizedCache STARTED
org.apache.kafka.streams.integration.QueryableStateIntegrationTest > shouldBeAbleToQueryStateWithNonZeroSizedCache PASSED
org.apache.kafka.streams.integration.JoinIntegrationTest > testInnerKTableKTable STARTED
org.apache.kafka.streams.integration.JoinIntegrationTest > testInnerKTableKTable PASSED
org.apache.kafka.streams.integration.JoinIntegrationTest > testLeftKTableKTable STARTED
org.apache.kafka.streams.integration.JoinIntegrationTest > testLeftKTableKTable PASSED
org.apache.kafka.streams.integration.JoinIntegrationTest > testLeftKStreamKStream STARTED
org.apache.kafka.streams.integration.JoinIntegrationTest > testLeftKStreamKStream PASSED
org.apache.kafka.streams.integration.JoinIntegrationTest > testLeftKStreamKTable STARTED
org.apache.kafka.streams.integration.JoinIntegrationTest > testLeftKStreamKTable PASSED
org.apache.kafka.streams.integration.JoinIntegrationTest > testOuterKTableKTable STARTED
org.apache.kafka.streams.integration.JoinIntegrationTest > testOuterKTableKTable PASSED
org.apache.kafka.streams.integration.JoinIntegrationTest > testInnerKStreamKStream STARTED
org.apache.kafka.streams.integration.JoinIntegrationTest > testInnerKStreamKStream PASSED
org.apache.kafka.streams.integration.JoinIntegrationTest > testOuterKStreamKStream STARTED
org.apache.kafka.streams.integration.JoinIntegrationTest > testOuterKStreamKStream PASSED
org.apache.kafka.streams.integration.JoinIntegrationTest > testInnerKStreamKTable STARTED
org.apache.kafka.streams.integration.JoinIntegrationTest > testInnerKStreamKTable PASSED
org.apache.kafka.streams.integration.ResetIntegrationTest > testReprocessingFromScratchAfterResetWithIntermediateUserTopic STARTED
org.apache.kafka.streams.integration.ResetIntegrationTest > testReprocessingFromScratchAfterResetWithIntermediateUserTopic PASSED
org.apache.kafka.streams.integration.ResetIntegrationTest > testReprocessingFromScratchAfterResetWithoutIntermediateUserTopic STARTED
ERROR: Could not install GRADLE_2_4_RC_2_HOME
java.lang.NullPointerException
ERROR: Could not install GRADLE_2_4_RC_2_HOME
java.lang.NullPointerException
ERROR: Could not install GRADLE_2_4_RC_2_HOME
java.lang.NullPointerException
ERROR: Could not install GRADLE_2_4_RC_2_HOME
java.lang.NullPointerException
ERROR: Could not install GRADLE_2_4_RC_2_HOME
java.lang.NullPointerException
Build timed out (after 360 minutes). Marking the build as failed.
Build was aborted
Recording test results
Setting GRADLE_2_4_RC_2_HOME=/home/jenkins/jenkins-slave/tools/hudson.plugins.gradle.GradleInstallation/Gradle_2.4-rc-2
Setting GRADLE_2_4_RC_2_HOME=/home/jenkins/jenkins-slave/tools/hudson.plugins.gradle.GradleInstallation/Gradle_2.4-rc-2
Jenkins build is back to normal : kafka-trunk-jdk8 #1391
Posted by Apache Jenkins Server <je...@builds.apache.org>.
See <https://builds.apache.org/job/kafka-trunk-jdk8/1391/display/redirect?page=changes>
Build failed in Jenkins: kafka-trunk-jdk8 #1390
Posted by Apache Jenkins Server <je...@builds.apache.org>.
See <https://builds.apache.org/job/kafka-trunk-jdk8/1390/display/redirect?page=changes>
Changes:
[jason] MINOR: Update possible errors in OffsetFetchResponse
[wangguoz] KAFKA-4980: testReprocessingFromScratch unit test failure
[wangguoz] MINOR: reduce amount of verbose printing
[ismael] MINOR: Ensure streaming iterator is closed by Fetcher
[jason] MINOR: Vagrant provisioning fixes
[wangguoz] KAFKA-4791: unable to add state store with regex matched topics
[ismael] KAFKA-4689; Disable system tests for consumer hard failures
[wangguoz] MINOR: Increase max.poll time for streams consumers
------------------------------------------
[...truncated 754.08 KB...]
org.apache.kafka.streams.state.internals.InMemoryLRUCacheStoreTest > testPutGetRangeWithDefaultSerdes STARTED
org.apache.kafka.streams.state.internals.InMemoryLRUCacheStoreTest > testPutGetRangeWithDefaultSerdes PASSED
org.apache.kafka.streams.state.internals.RocksDBKeyValueStoreTest > shouldUseCustomRocksDbConfigSetter STARTED
org.apache.kafka.streams.state.internals.RocksDBKeyValueStoreTest > shouldUseCustomRocksDbConfigSetter PASSED
org.apache.kafka.streams.state.internals.RocksDBKeyValueStoreTest > shouldPerformAllQueriesWithCachingDisabled STARTED
org.apache.kafka.streams.state.internals.RocksDBKeyValueStoreTest > shouldPerformAllQueriesWithCachingDisabled PASSED
org.apache.kafka.streams.state.internals.RocksDBKeyValueStoreTest > shouldPerformRangeQueriesWithCachingDisabled STARTED
org.apache.kafka.streams.state.internals.RocksDBKeyValueStoreTest > shouldPerformRangeQueriesWithCachingDisabled PASSED
org.apache.kafka.streams.state.internals.RocksDBKeyValueStoreTest > shouldCloseOpenIteratorsWhenStoreClosedAndThrowInvalidStateStoreOnHasNextAndNext STARTED
org.apache.kafka.streams.state.internals.RocksDBKeyValueStoreTest > shouldCloseOpenIteratorsWhenStoreClosedAndThrowInvalidStateStoreOnHasNextAndNext PASSED
org.apache.kafka.streams.state.internals.RocksDBKeyValueStoreTest > testSize STARTED
org.apache.kafka.streams.state.internals.RocksDBKeyValueStoreTest > testSize PASSED
org.apache.kafka.streams.state.internals.RocksDBKeyValueStoreTest > testPutIfAbsent STARTED
org.apache.kafka.streams.state.internals.RocksDBKeyValueStoreTest > testPutIfAbsent PASSED
org.apache.kafka.streams.state.internals.RocksDBKeyValueStoreTest > testRestoreWithDefaultSerdes STARTED
org.apache.kafka.streams.state.internals.RocksDBKeyValueStoreTest > testRestoreWithDefaultSerdes PASSED
org.apache.kafka.streams.state.internals.RocksDBKeyValueStoreTest > testRestore STARTED
org.apache.kafka.streams.state.internals.RocksDBKeyValueStoreTest > testRestore PASSED
org.apache.kafka.streams.state.internals.RocksDBKeyValueStoreTest > testPutGetRange STARTED
org.apache.kafka.streams.state.internals.RocksDBKeyValueStoreTest > testPutGetRange PASSED
org.apache.kafka.streams.state.internals.RocksDBKeyValueStoreTest > testPutGetRangeWithDefaultSerdes STARTED
org.apache.kafka.streams.state.internals.RocksDBKeyValueStoreTest > testPutGetRangeWithDefaultSerdes PASSED
org.apache.kafka.streams.KeyValueTest > shouldHaveSaneEqualsAndHashCode STARTED
org.apache.kafka.streams.KeyValueTest > shouldHaveSaneEqualsAndHashCode PASSED
org.apache.kafka.streams.KafkaStreamsTest > testIllegalMetricsConfig STARTED
org.apache.kafka.streams.KafkaStreamsTest > testIllegalMetricsConfig PASSED
org.apache.kafka.streams.KafkaStreamsTest > shouldNotGetAllTasksWhenNotRunning STARTED
org.apache.kafka.streams.KafkaStreamsTest > shouldNotGetAllTasksWhenNotRunning PASSED
org.apache.kafka.streams.KafkaStreamsTest > testInitializesAndDestroysMetricsReporters STARTED
org.apache.kafka.streams.KafkaStreamsTest > testInitializesAndDestroysMetricsReporters PASSED
org.apache.kafka.streams.KafkaStreamsTest > shouldNotGetTaskWithKeyAndPartitionerWhenNotRunning STARTED
org.apache.kafka.streams.KafkaStreamsTest > shouldNotGetTaskWithKeyAndPartitionerWhenNotRunning PASSED
org.apache.kafka.streams.KafkaStreamsTest > testLegalMetricsConfig STARTED
org.apache.kafka.streams.KafkaStreamsTest > testLegalMetricsConfig PASSED
org.apache.kafka.streams.KafkaStreamsTest > shouldNotGetTaskWithKeyAndSerializerWhenNotRunning STARTED
org.apache.kafka.streams.KafkaStreamsTest > shouldNotGetTaskWithKeyAndSerializerWhenNotRunning PASSED
org.apache.kafka.streams.KafkaStreamsTest > shouldReturnFalseOnCloseWhenThreadsHaventTerminated STARTED
org.apache.kafka.streams.KafkaStreamsTest > shouldReturnFalseOnCloseWhenThreadsHaventTerminated PASSED
org.apache.kafka.streams.KafkaStreamsTest > shouldNotGetAllTasksWithStoreWhenNotRunning STARTED
org.apache.kafka.streams.KafkaStreamsTest > shouldNotGetAllTasksWithStoreWhenNotRunning PASSED
org.apache.kafka.streams.KafkaStreamsTest > testCannotStartOnceClosed STARTED
org.apache.kafka.streams.KafkaStreamsTest > testCannotStartOnceClosed PASSED
org.apache.kafka.streams.KafkaStreamsTest > testCleanup STARTED
org.apache.kafka.streams.KafkaStreamsTest > testCleanup PASSED
org.apache.kafka.streams.KafkaStreamsTest > testNumberDefaultMetrics STARTED
org.apache.kafka.streams.KafkaStreamsTest > testNumberDefaultMetrics PASSED
org.apache.kafka.streams.KafkaStreamsTest > testCloseIsIdempotent STARTED
org.apache.kafka.streams.KafkaStreamsTest > testCloseIsIdempotent PASSED
org.apache.kafka.streams.KafkaStreamsTest > testCannotCleanupWhileRunning STARTED
org.apache.kafka.streams.KafkaStreamsTest > testCannotCleanupWhileRunning PASSED
org.apache.kafka.streams.KafkaStreamsTest > testCannotStartTwice STARTED
org.apache.kafka.streams.KafkaStreamsTest > testCannotStartTwice PASSED
org.apache.kafka.streams.integration.GlobalKTableIntegrationTest > shouldKStreamGlobalKTableLeftJoin STARTED
org.apache.kafka.streams.integration.GlobalKTableIntegrationTest > shouldKStreamGlobalKTableLeftJoin PASSED
org.apache.kafka.streams.integration.GlobalKTableIntegrationTest > shouldKStreamGlobalKTableJoin STARTED
org.apache.kafka.streams.integration.GlobalKTableIntegrationTest > shouldKStreamGlobalKTableJoin PASSED
org.apache.kafka.streams.integration.KStreamsFineGrainedAutoResetIntegrationTest > shouldThrowExceptionOverlappingPattern STARTED
org.apache.kafka.streams.integration.KStreamsFineGrainedAutoResetIntegrationTest > shouldThrowExceptionOverlappingPattern PASSED
org.apache.kafka.streams.integration.KStreamsFineGrainedAutoResetIntegrationTest > shouldThrowExceptionOverlappingTopic STARTED
org.apache.kafka.streams.integration.KStreamsFineGrainedAutoResetIntegrationTest > shouldThrowExceptionOverlappingTopic PASSED
org.apache.kafka.streams.integration.KStreamsFineGrainedAutoResetIntegrationTest > shouldThrowStreamsExceptionNoResetSpecified STARTED
org.apache.kafka.streams.integration.KStreamsFineGrainedAutoResetIntegrationTest > shouldThrowStreamsExceptionNoResetSpecified PASSED
org.apache.kafka.streams.integration.KStreamsFineGrainedAutoResetIntegrationTest > shouldOnlyReadRecordsWhereEarliestSpecified STARTED
org.apache.kafka.streams.integration.KStreamsFineGrainedAutoResetIntegrationTest > shouldOnlyReadRecordsWhereEarliestSpecified PASSED
org.apache.kafka.streams.integration.QueryableStateIntegrationTest > shouldNotMakeStoreAvailableUntilAllStoresAvailable STARTED
org.apache.kafka.streams.integration.QueryableStateIntegrationTest > shouldNotMakeStoreAvailableUntilAllStoresAvailable PASSED
org.apache.kafka.streams.integration.QueryableStateIntegrationTest > queryOnRebalance STARTED
org.apache.kafka.streams.integration.QueryableStateIntegrationTest > queryOnRebalance PASSED
org.apache.kafka.streams.integration.QueryableStateIntegrationTest > concurrentAccesses STARTED
org.apache.kafka.streams.integration.QueryableStateIntegrationTest > concurrentAccesses PASSED
org.apache.kafka.streams.integration.QueryableStateIntegrationTest > shouldBeAbleToQueryStateWithZeroSizedCache STARTED
org.apache.kafka.streams.integration.QueryableStateIntegrationTest > shouldBeAbleToQueryStateWithZeroSizedCache PASSED
org.apache.kafka.streams.integration.QueryableStateIntegrationTest > shouldBeAbleToQueryStateWithNonZeroSizedCache STARTED
org.apache.kafka.streams.integration.QueryableStateIntegrationTest > shouldBeAbleToQueryStateWithNonZeroSizedCache PASSED
org.apache.kafka.streams.integration.JoinIntegrationTest > testInnerKTableKTable STARTED
org.apache.kafka.streams.integration.JoinIntegrationTest > testInnerKTableKTable PASSED
org.apache.kafka.streams.integration.JoinIntegrationTest > testLeftKTableKTable STARTED
org.apache.kafka.streams.integration.JoinIntegrationTest > testLeftKTableKTable PASSED
org.apache.kafka.streams.integration.JoinIntegrationTest > testLeftKStreamKStream STARTED
org.apache.kafka.streams.integration.JoinIntegrationTest > testLeftKStreamKStream PASSED
org.apache.kafka.streams.integration.JoinIntegrationTest > testLeftKStreamKTable STARTED
org.apache.kafka.streams.integration.JoinIntegrationTest > testLeftKStreamKTable PASSED
org.apache.kafka.streams.integration.JoinIntegrationTest > testOuterKTableKTable STARTED
org.apache.kafka.streams.integration.JoinIntegrationTest > testOuterKTableKTable PASSED
org.apache.kafka.streams.integration.JoinIntegrationTest > testInnerKStreamKStream STARTED
org.apache.kafka.streams.integration.JoinIntegrationTest > testInnerKStreamKStream PASSED
org.apache.kafka.streams.integration.JoinIntegrationTest > testOuterKStreamKStream STARTED
org.apache.kafka.streams.integration.JoinIntegrationTest > testOuterKStreamKStream PASSED
org.apache.kafka.streams.integration.JoinIntegrationTest > testInnerKStreamKTable STARTED
org.apache.kafka.streams.integration.JoinIntegrationTest > testInnerKStreamKTable PASSED
org.apache.kafka.streams.integration.ResetIntegrationTest > testReprocessingFromScratchAfterResetWithIntermediateUserTopic STARTED
org.apache.kafka.streams.integration.ResetIntegrationTest > testReprocessingFromScratchAfterResetWithIntermediateUserTopic PASSED
org.apache.kafka.streams.integration.ResetIntegrationTest > testReprocessingFromScratchAfterResetWithoutIntermediateUserTopic STARTED
org.apache.kafka.streams.integration.ResetIntegrationTest > testReprocessingFromScratchAfterResetWithoutIntermediateUserTopic PASSED
org.apache.kafka.streams.integration.KStreamAggregationDedupIntegrationTest > shouldReduce STARTED
org.apache.kafka.streams.integration.KStreamAggregationDedupIntegrationTest > shouldReduce PASSED
org.apache.kafka.streams.integration.KStreamAggregationDedupIntegrationTest > shouldGroupByKey STARTED
org.apache.kafka.streams.integration.KStreamAggregationDedupIntegrationTest > shouldGroupByKey PASSED
org.apache.kafka.streams.integration.KStreamAggregationDedupIntegrationTest > shouldReduceWindowed STARTED
org.apache.kafka.streams.integration.KStreamAggregationDedupIntegrationTest > shouldReduceWindowed PASSED
org.apache.kafka.streams.integration.FanoutIntegrationTest > shouldFanoutTheInput STARTED
org.apache.kafka.streams.integration.FanoutIntegrationTest > shouldFanoutTheInput PASSED
org.apache.kafka.streams.integration.KStreamRepartitionJoinTest > shouldCorrectlyRepartitionOnJoinOperationsWithZeroSizedCache STARTED
org.apache.kafka.streams.integration.KStreamRepartitionJoinTest > shouldCorrectlyRepartitionOnJoinOperationsWithZeroSizedCache PASSED
org.apache.kafka.streams.integration.KStreamRepartitionJoinTest > shouldCorrectlyRepartitionOnJoinOperationsWithNonZeroSizedCache STARTED
org.apache.kafka.streams.integration.KStreamRepartitionJoinTest > shouldCorrectlyRepartitionOnJoinOperationsWithNonZeroSizedCache PASSED
org.apache.kafka.streams.integration.RegexSourceIntegrationTest > testShouldReadFromRegexAndNamedTopics STARTED
org.apache.kafka.streams.integration.RegexSourceIntegrationTest > testShouldReadFromRegexAndNamedTopics PASSED
org.apache.kafka.streams.integration.RegexSourceIntegrationTest > testRegexMatchesTopicsAWhenCreated STARTED
org.apache.kafka.streams.integration.RegexSourceIntegrationTest > testRegexMatchesTopicsAWhenCreated PASSED
org.apache.kafka.streams.integration.RegexSourceIntegrationTest > testMultipleConsumersCanReadFromPartitionedTopic STARTED
org.apache.kafka.streams.integration.RegexSourceIntegrationTest > testMultipleConsumersCanReadFromPartitionedTopic PASSED
org.apache.kafka.streams.integration.RegexSourceIntegrationTest > testRegexMatchesTopicsAWhenDeleted STARTED
org.apache.kafka.streams.integration.RegexSourceIntegrationTest > testRegexMatchesTopicsAWhenDeleted PASSED
org.apache.kafka.streams.integration.RegexSourceIntegrationTest > testNoMessagesSentExceptionFromOverlappingPatterns STARTED
org.apache.kafka.streams.integration.RegexSourceIntegrationTest > testNoMessagesSentExceptionFromOverlappingPatterns PASSED
org.apache.kafka.streams.integration.RegexSourceIntegrationTest > shouldAddStateStoreToRegexDefinedSource STARTED
ERROR: Could not install GRADLE_2_4_RC_2_HOME
java.lang.NullPointerException
ERROR: Could not install GRADLE_2_4_RC_2_HOME
java.lang.NullPointerException
ERROR: Could not install GRADLE_2_4_RC_2_HOME
java.lang.NullPointerException
ERROR: Could not install GRADLE_2_4_RC_2_HOME
java.lang.NullPointerException
ERROR: Could not install GRADLE_2_4_RC_2_HOME
java.lang.NullPointerException
Build timed out (after 360 minutes). Marking the build as failed.
Build was aborted
Recording test results
Setting GRADLE_2_4_RC_2_HOME=/home/jenkins/jenkins-slave/tools/hudson.plugins.gradle.GradleInstallation/Gradle_2.4-rc-2
Setting GRADLE_2_4_RC_2_HOME=/home/jenkins/jenkins-slave/tools/hudson.plugins.gradle.GradleInstallation/Gradle_2.4-rc-2
Build failed in Jenkins: kafka-trunk-jdk8 #1389
Posted by Apache Jenkins Server <je...@builds.apache.org>.
See <https://builds.apache.org/job/kafka-trunk-jdk8/1389/display/redirect?page=changes>
Changes:
[ismael] MINOR: Map `mkString` format updated to default java format
[ismael] KAFKA-4902; Utils#delete should correctly handle I/O errors and symlinks
[ismael] MINOR: Doc change related to ZK sasl configs
[ismael] MINOR: Fix typos in javadoc and code comments
[becket.qin] KAFKA-4973; Fix transient failure of
------------------------------------------
[...truncated 752.42 KB...]
org.apache.kafka.streams.state.internals.InMemoryLRUCacheStoreTest > testPutIfAbsent STARTED
org.apache.kafka.streams.state.internals.InMemoryLRUCacheStoreTest > testPutIfAbsent PASSED
org.apache.kafka.streams.state.internals.InMemoryLRUCacheStoreTest > testRestoreWithDefaultSerdes STARTED
org.apache.kafka.streams.state.internals.InMemoryLRUCacheStoreTest > testRestoreWithDefaultSerdes PASSED
org.apache.kafka.streams.state.internals.InMemoryLRUCacheStoreTest > testRestore STARTED
org.apache.kafka.streams.state.internals.InMemoryLRUCacheStoreTest > testRestore PASSED
org.apache.kafka.streams.state.internals.InMemoryLRUCacheStoreTest > testPutGetRange STARTED
org.apache.kafka.streams.state.internals.InMemoryLRUCacheStoreTest > testPutGetRange PASSED
org.apache.kafka.streams.state.internals.InMemoryLRUCacheStoreTest > testPutGetRangeWithDefaultSerdes STARTED
org.apache.kafka.streams.state.internals.InMemoryLRUCacheStoreTest > testPutGetRangeWithDefaultSerdes PASSED
org.apache.kafka.streams.state.internals.RocksDBKeyValueStoreTest > shouldUseCustomRocksDbConfigSetter STARTED
org.apache.kafka.streams.state.internals.RocksDBKeyValueStoreTest > shouldUseCustomRocksDbConfigSetter PASSED
org.apache.kafka.streams.state.internals.RocksDBKeyValueStoreTest > shouldPerformAllQueriesWithCachingDisabled STARTED
org.apache.kafka.streams.state.internals.RocksDBKeyValueStoreTest > shouldPerformAllQueriesWithCachingDisabled PASSED
org.apache.kafka.streams.state.internals.RocksDBKeyValueStoreTest > shouldPerformRangeQueriesWithCachingDisabled STARTED
org.apache.kafka.streams.state.internals.RocksDBKeyValueStoreTest > shouldPerformRangeQueriesWithCachingDisabled PASSED
org.apache.kafka.streams.state.internals.RocksDBKeyValueStoreTest > shouldCloseOpenIteratorsWhenStoreClosedAndThrowInvalidStateStoreOnHasNextAndNext STARTED
org.apache.kafka.streams.state.internals.RocksDBKeyValueStoreTest > shouldCloseOpenIteratorsWhenStoreClosedAndThrowInvalidStateStoreOnHasNextAndNext PASSED
org.apache.kafka.streams.state.internals.RocksDBKeyValueStoreTest > testSize STARTED
org.apache.kafka.streams.state.internals.RocksDBKeyValueStoreTest > testSize PASSED
org.apache.kafka.streams.state.internals.RocksDBKeyValueStoreTest > testPutIfAbsent STARTED
org.apache.kafka.streams.state.internals.RocksDBKeyValueStoreTest > testPutIfAbsent PASSED
org.apache.kafka.streams.state.internals.RocksDBKeyValueStoreTest > testRestoreWithDefaultSerdes STARTED
org.apache.kafka.streams.state.internals.RocksDBKeyValueStoreTest > testRestoreWithDefaultSerdes PASSED
org.apache.kafka.streams.state.internals.RocksDBKeyValueStoreTest > testRestore STARTED
org.apache.kafka.streams.state.internals.RocksDBKeyValueStoreTest > testRestore PASSED
org.apache.kafka.streams.state.internals.RocksDBKeyValueStoreTest > testPutGetRange STARTED
org.apache.kafka.streams.state.internals.RocksDBKeyValueStoreTest > testPutGetRange PASSED
org.apache.kafka.streams.state.internals.RocksDBKeyValueStoreTest > testPutGetRangeWithDefaultSerdes STARTED
org.apache.kafka.streams.state.internals.RocksDBKeyValueStoreTest > testPutGetRangeWithDefaultSerdes PASSED
org.apache.kafka.streams.KeyValueTest > shouldHaveSaneEqualsAndHashCode STARTED
org.apache.kafka.streams.KeyValueTest > shouldHaveSaneEqualsAndHashCode PASSED
org.apache.kafka.streams.KafkaStreamsTest > testIllegalMetricsConfig STARTED
org.apache.kafka.streams.KafkaStreamsTest > testIllegalMetricsConfig PASSED
org.apache.kafka.streams.KafkaStreamsTest > shouldNotGetAllTasksWhenNotRunning STARTED
org.apache.kafka.streams.KafkaStreamsTest > shouldNotGetAllTasksWhenNotRunning PASSED
org.apache.kafka.streams.KafkaStreamsTest > testInitializesAndDestroysMetricsReporters STARTED
org.apache.kafka.streams.KafkaStreamsTest > testInitializesAndDestroysMetricsReporters PASSED
org.apache.kafka.streams.KafkaStreamsTest > shouldNotGetTaskWithKeyAndPartitionerWhenNotRunning STARTED
org.apache.kafka.streams.KafkaStreamsTest > shouldNotGetTaskWithKeyAndPartitionerWhenNotRunning PASSED
org.apache.kafka.streams.KafkaStreamsTest > testLegalMetricsConfig STARTED
org.apache.kafka.streams.KafkaStreamsTest > testLegalMetricsConfig PASSED
org.apache.kafka.streams.KafkaStreamsTest > shouldNotGetTaskWithKeyAndSerializerWhenNotRunning STARTED
org.apache.kafka.streams.KafkaStreamsTest > shouldNotGetTaskWithKeyAndSerializerWhenNotRunning PASSED
org.apache.kafka.streams.KafkaStreamsTest > shouldReturnFalseOnCloseWhenThreadsHaventTerminated STARTED
org.apache.kafka.streams.KafkaStreamsTest > shouldReturnFalseOnCloseWhenThreadsHaventTerminated PASSED
org.apache.kafka.streams.KafkaStreamsTest > shouldNotGetAllTasksWithStoreWhenNotRunning STARTED
org.apache.kafka.streams.KafkaStreamsTest > shouldNotGetAllTasksWithStoreWhenNotRunning PASSED
org.apache.kafka.streams.KafkaStreamsTest > testCannotStartOnceClosed STARTED
org.apache.kafka.streams.KafkaStreamsTest > testCannotStartOnceClosed PASSED
org.apache.kafka.streams.KafkaStreamsTest > testCleanup STARTED
org.apache.kafka.streams.KafkaStreamsTest > testCleanup PASSED
org.apache.kafka.streams.KafkaStreamsTest > testNumberDefaultMetrics STARTED
org.apache.kafka.streams.KafkaStreamsTest > testNumberDefaultMetrics PASSED
org.apache.kafka.streams.KafkaStreamsTest > testCloseIsIdempotent STARTED
org.apache.kafka.streams.KafkaStreamsTest > testCloseIsIdempotent PASSED
org.apache.kafka.streams.KafkaStreamsTest > testCannotCleanupWhileRunning STARTED
org.apache.kafka.streams.KafkaStreamsTest > testCannotCleanupWhileRunning PASSED
org.apache.kafka.streams.KafkaStreamsTest > testCannotStartTwice STARTED
org.apache.kafka.streams.KafkaStreamsTest > testCannotStartTwice PASSED
org.apache.kafka.streams.integration.GlobalKTableIntegrationTest > shouldKStreamGlobalKTableLeftJoin STARTED
org.apache.kafka.streams.integration.GlobalKTableIntegrationTest > shouldKStreamGlobalKTableLeftJoin PASSED
org.apache.kafka.streams.integration.GlobalKTableIntegrationTest > shouldKStreamGlobalKTableJoin STARTED
org.apache.kafka.streams.integration.GlobalKTableIntegrationTest > shouldKStreamGlobalKTableJoin PASSED
org.apache.kafka.streams.integration.KStreamsFineGrainedAutoResetIntegrationTest > shouldThrowExceptionOverlappingPattern STARTED
org.apache.kafka.streams.integration.KStreamsFineGrainedAutoResetIntegrationTest > shouldThrowExceptionOverlappingPattern PASSED
org.apache.kafka.streams.integration.KStreamsFineGrainedAutoResetIntegrationTest > shouldThrowExceptionOverlappingTopic STARTED
org.apache.kafka.streams.integration.KStreamsFineGrainedAutoResetIntegrationTest > shouldThrowExceptionOverlappingTopic PASSED
org.apache.kafka.streams.integration.KStreamsFineGrainedAutoResetIntegrationTest > shouldThrowStreamsExceptionNoResetSpecified STARTED
org.apache.kafka.streams.integration.KStreamsFineGrainedAutoResetIntegrationTest > shouldThrowStreamsExceptionNoResetSpecified PASSED
org.apache.kafka.streams.integration.KStreamsFineGrainedAutoResetIntegrationTest > shouldOnlyReadRecordsWhereEarliestSpecified STARTED
org.apache.kafka.streams.integration.KStreamsFineGrainedAutoResetIntegrationTest > shouldOnlyReadRecordsWhereEarliestSpecified PASSED
org.apache.kafka.streams.integration.QueryableStateIntegrationTest > shouldNotMakeStoreAvailableUntilAllStoresAvailable STARTED
org.apache.kafka.streams.integration.QueryableStateIntegrationTest > shouldNotMakeStoreAvailableUntilAllStoresAvailable PASSED
org.apache.kafka.streams.integration.QueryableStateIntegrationTest > queryOnRebalance STARTED
org.apache.kafka.streams.integration.QueryableStateIntegrationTest > queryOnRebalance PASSED
org.apache.kafka.streams.integration.QueryableStateIntegrationTest > concurrentAccesses STARTED
org.apache.kafka.streams.integration.QueryableStateIntegrationTest > concurrentAccesses PASSED
org.apache.kafka.streams.integration.QueryableStateIntegrationTest > shouldBeAbleToQueryStateWithZeroSizedCache STARTED
org.apache.kafka.streams.integration.QueryableStateIntegrationTest > shouldBeAbleToQueryStateWithZeroSizedCache PASSED
org.apache.kafka.streams.integration.QueryableStateIntegrationTest > shouldBeAbleToQueryStateWithNonZeroSizedCache STARTED
org.apache.kafka.streams.integration.QueryableStateIntegrationTest > shouldBeAbleToQueryStateWithNonZeroSizedCache PASSED
org.apache.kafka.streams.integration.JoinIntegrationTest > testInnerKTableKTable STARTED
org.apache.kafka.streams.integration.JoinIntegrationTest > testInnerKTableKTable PASSED
org.apache.kafka.streams.integration.JoinIntegrationTest > testLeftKTableKTable STARTED
org.apache.kafka.streams.integration.JoinIntegrationTest > testLeftKTableKTable PASSED
org.apache.kafka.streams.integration.JoinIntegrationTest > testLeftKStreamKStream STARTED
org.apache.kafka.streams.integration.JoinIntegrationTest > testLeftKStreamKStream PASSED
org.apache.kafka.streams.integration.JoinIntegrationTest > testLeftKStreamKTable STARTED
org.apache.kafka.streams.integration.JoinIntegrationTest > testLeftKStreamKTable PASSED
org.apache.kafka.streams.integration.JoinIntegrationTest > testOuterKTableKTable STARTED
org.apache.kafka.streams.integration.JoinIntegrationTest > testOuterKTableKTable PASSED
org.apache.kafka.streams.integration.JoinIntegrationTest > testInnerKStreamKStream STARTED
org.apache.kafka.streams.integration.JoinIntegrationTest > testInnerKStreamKStream PASSED
org.apache.kafka.streams.integration.JoinIntegrationTest > testOuterKStreamKStream STARTED
org.apache.kafka.streams.integration.JoinIntegrationTest > testOuterKStreamKStream PASSED
org.apache.kafka.streams.integration.JoinIntegrationTest > testInnerKStreamKTable STARTED
org.apache.kafka.streams.integration.JoinIntegrationTest > testInnerKStreamKTable PASSED
org.apache.kafka.streams.integration.ResetIntegrationTest > testReprocessingFromScratchAfterResetWithIntermediateUserTopic STARTED
org.apache.kafka.streams.integration.ResetIntegrationTest > testReprocessingFromScratchAfterResetWithIntermediateUserTopic PASSED
org.apache.kafka.streams.integration.ResetIntegrationTest > testReprocessingFromScratchAfterResetWithoutIntermediateUserTopic STARTED
ERROR: Could not install GRADLE_2_4_RC_2_HOME
java.lang.NullPointerException
ERROR: Could not install GRADLE_2_4_RC_2_HOME
java.lang.NullPointerException
ERROR: Could not install GRADLE_2_4_RC_2_HOME
java.lang.NullPointerException
ERROR: Could not install GRADLE_2_4_RC_2_HOME
java.lang.NullPointerException
ERROR: Could not install GRADLE_2_4_RC_2_HOME
java.lang.NullPointerException
ERROR: Could not install GRADLE_2_4_RC_2_HOME
java.lang.NullPointerException
ERROR: Could not install GRADLE_2_4_RC_2_HOME
java.lang.NullPointerException
ERROR: Could not install GRADLE_2_4_RC_2_HOME
java.lang.NullPointerException
ERROR: Could not install GRADLE_2_4_RC_2_HOME
java.lang.NullPointerException
ERROR: Could not install GRADLE_2_4_RC_2_HOME
java.lang.NullPointerException
ERROR: Could not install GRADLE_2_4_RC_2_HOME
java.lang.NullPointerException
ERROR: Could not install GRADLE_2_4_RC_2_HOME
java.lang.NullPointerException
ERROR: Could not install GRADLE_2_4_RC_2_HOME
java.lang.NullPointerException
ERROR: Could not install GRADLE_2_4_RC_2_HOME
java.lang.NullPointerException
Build timed out (after 360 minutes). Marking the build as failed.
Build was aborted
:streams:test FAILED
FAILURE: Build failed with an exception.
* What went wrong:
Execution failed for task ':streams:test'.
> Process 'Gradle Test Executor 4' finished with non-zero exit value 143
* Try:
Run with --stacktrace option to get the stack trace. Run with --info or --debug option to get more log output.
BUILD FAILED
Total time: 5 hrs 59 mins 47.775 secs
Recording test results
Setting GRADLE_2_4_RC_2_HOME=/home/jenkins/jenkins-slave/tools/hudson.plugins.gradle.GradleInstallation/Gradle_2.4-rc-2
Setting GRADLE_2_4_RC_2_HOME=/home/jenkins/jenkins-slave/tools/hudson.plugins.gradle.GradleInstallation/Gradle_2.4-rc-2