You are viewing a plain text version of this content. The canonical link for it is here.
Posted to builds@cassandra.apache.org by Apache Jenkins Server <je...@builds.apache.org> on 2024/08/15 05:24:09 UTC
Build complete: Cassandra-5.0 #274 [UNSTABLE] c2c9d73019475b304ff3f4d4152ff76515b1280e
-------------------------------------------------------------------------------
Build Cassandra-5.0 #274 Still Unstable
URL: https://ci-cassandra.apache.org/job/Cassandra-5.0/274/
-------------------------------------------------------------------------------
Changes:
[Alex Petrov] Ninja: Fix test merge after fixing CASSANDRA-19534
[Brandon Williams] Add note to NEWS about query handler interface
-------------------------------------------------------------------------------
Failed Tests:
36 tests failed.
FAILED: org.apache.cassandra.index.sai.cql.intersection.RandomStaticPartitionIntersectionTest.Tests / test-latest jdk11 1/8 / testStaticIntersection[Small partition restricted, low, low]-cassandra.testtag_IS_UNDEFINED
FAILED: org.apache.cassandra.distributed.upgrade.CompactStorageImplicitNullInClusteringTest.Tests / jvm-dtest-upgrade jdk11 5/8 / testImplicitNullInClusteringWithCompactStorage-_jdk11_x86_64
FAILED: org.apache.cassandra.distributed.upgrade.MixedModeAvailabilityUpgradedReplicaTest.Tests / jvm-dtest-upgrade jdk11 5/8 / testAvailability-_jdk11_x86_64
FAILED: org.apache.cassandra.distributed.upgrade.MixedModeReadRepairWriteTest.Tests / jvm-dtest-upgrade jdk11 5/8 / mixedModeReadRepairInsert-_jdk11_x86_64
FAILED: org.apache.cassandra.distributed.upgrade.MixedModeReadRepairWriteTest.Tests / jvm-dtest-upgrade jdk11 5/8 / mixedModeReadRepairUpdate-_jdk11_x86_64
FAILED: org.apache.cassandra.distributed.upgrade.CompactStoragePagingTest.Tests / jvm-dtest-upgrade jdk11 6/8 / testPagingWithCompactStorage-_jdk11_x86_64
FAILED: org.apache.cassandra.distributed.upgrade.MixedModeConsistencyV30Test.Tests / jvm-dtest-upgrade jdk11 6/8 / testConsistency-_jdk11_x86_64
FAILED: org.apache.cassandra.distributed.upgrade.MixedModeRepairTest.Tests / jvm-dtest-upgrade jdk11 6/8 / testRepairDuringMajorUpgrade-_jdk11_x86_64
FAILED: org.apache.cassandra.index.sai.cql.intersection.TwoRegularOneStaticPartitionIntersectionTest.Tests / test-latest jdk11 3/8 / testMixedIntersection[Small partition restricted, low, low]-cassandra.testtag_IS_UNDEFINED
FAILED: org.apache.cassandra.distributed.upgrade.MixedModeFrom3LoggedBatchTest.Tests / jvm-dtest-upgrade jdk11 7/8 / testSimpleStrategy-_jdk11_x86_64
FAILED: org.apache.cassandra.distributed.upgrade.MixedModeTTLOverflowAfterUpgradeTest.Tests / jvm-dtest-upgrade jdk11 7/8 / testTTLOverflowAfterUpgrade-_jdk11_x86_64
FAILED: org.apache.cassandra.distributed.upgrade.CompactStoragePagingWithProtocolV41Test.Tests / jvm-dtest-upgrade jdk11 8/8 / testPagingWithCompactStorageMultipleClusterings-_jdk11_x86_64
FAILED: org.apache.cassandra.distributed.upgrade.CompactStoragePagingWithProtocolV41Test.Tests / jvm-dtest-upgrade jdk11 8/8 / testPagingWithCompactStorageSingleClustering-_jdk11_x86_64
FAILED: org.apache.cassandra.distributed.upgrade.CompactStoragePagingWithProtocolV41Test.Tests / jvm-dtest-upgrade jdk11 8/8 / testPagingWithCompactStorageWithoutClustering-_jdk11_x86_64
FAILED: org.apache.cassandra.distributed.upgrade.MixedModeFrom3ReplicationTest.Tests / jvm-dtest-upgrade jdk11 8/8 / testSimpleStrategy-_jdk11_x86_64
FAILED: org.apache.cassandra.distributed.upgrade.MixedModeTTLOverflowDuringUpgradeTest.Tests / jvm-dtest-upgrade jdk11 8/8 / testTTLOverflowDuringUpgrade-_jdk11_x86_64
FAILED: org.apache.cassandra.index.sai.cql.intersection.RandomMixedPartitionIntersectionTest.Tests / test-latest jdk11 5/8 / testMixedIntersection[Small partition restricted, low, low]-cassandra.testtag_IS_UNDEFINED
FAILED: org.apache.cassandra.index.sai.cql.intersection.RandomRegularIntersectionTest.Tests / test-latest jdk11 6/8 / testRegularIntersection[Small partition unrestricted, high, high]-cassandra.testtag_IS_UNDEFINED
FAILED: dtest-upgrade-novnode.upgrade_tests.upgrade_through_versions_test.TestProtoV3Upgrade_AllVersions_RandomPartitioner_EndsAt_Trunk_HEAD.Tests / dtest-upgrade-novnode jdk11 25/64 / test_parallel_upgrade
FAILED: dtest-upgrade-novnode.upgrade_tests.upgrade_through_versions_test.TestProtoV3Upgrade_AllVersions_RandomPartitioner_EndsAt_Trunk_HEAD.Tests / dtest-upgrade-novnode jdk11 27/64 / test_parallel_upgrade_with_internode_ssl
FAILED: dtest-upgrade.upgrade_tests.paging_test.TestPagingWithDeletionsNodes2RF1_Upgrade_indev_4_0_x_To_indev_5_0_x.Tests / dtest-upgrade jdk11 28/64 / test_ttl_deletions
FAILED: dtest-upgrade.upgrade_tests.cql_tests.TestCQLNodes3RF3_Upgrade_indev_4_1_x_To_indev_5_0_x.Tests / dtest-upgrade jdk11 29/64 / test_store_sets_with_if_not_exists
FAILED: dtest-upgrade.upgrade_tests.cql_tests.TestCQLNodes2RF1_Upgrade_indev_4_0_x_To_indev_5_0_x.Tests / dtest-upgrade jdk11 29/64 / test_reversed_compact_multikey
FAILED: dtest-upgrade.upgrade_tests.cql_tests.TestCQLNodes2RF1_Upgrade_indev_4_0_x_To_indev_5_0_x.Tests / dtest-upgrade jdk11 29/64 / test_whole_set_conditional
FAILED: dtest-upgrade.upgrade_tests.cql_tests.TestCQLNodes2RF1_Upgrade_indev_4_1_x_To_indev_5_0_x.Tests / dtest-upgrade jdk11 29/64 / test_select_count_paging
FAILED: dtest-upgrade.upgrade_tests.paging_test.TestPagingWithDeletionsNodes2RF1_Upgrade_indev_4_0_x_To_indev_5_0_x.Tests / dtest-upgrade jdk11 29/64 / test_failure_threshold_deletions
FAILED: dtest-upgrade-novnode.upgrade_tests.cql_tests.TestCQLNodes3RF3_Upgrade_indev_4_0_x_To_indev_5_0_x.Tests / dtest-upgrade-novnode jdk11 29/64 / test_static_with_limit
FAILED: dtest-upgrade-novnode.upgrade_tests.cql_tests.TestCQLNodes3RF3_Upgrade_indev_4_1_x_To_indev_5_0_x.Tests / dtest-upgrade-novnode jdk11 29/64 / test_no_clustering
FAILED: dtest-upgrade-novnode.upgrade_tests.cql_tests.TestCQLNodes3RF3_Upgrade_indev_4_1_x_To_indev_5_0_x.Tests / dtest-upgrade-novnode jdk11 29/64 / test_nan_infinity
FAILED: dtest-upgrade-novnode.upgrade_tests.cql_tests.TestCQLNodes2RF1_Upgrade_indev_4_0_x_To_indev_5_0_x.Tests / dtest-upgrade-novnode jdk11 29/64 / test_no_range_ghost
FAILED: dtest-upgrade-novnode.upgrade_tests.cql_tests.TestCQLNodes2RF1_Upgrade_indev_4_0_x_To_indev_5_0_x.Tests / dtest-upgrade-novnode jdk11 29/64 / test_empty_in
FAILED: dtest-upgrade-novnode.upgrade_tests.cql_tests.TestCQLNodes2RF1_Upgrade_indev_4_1_x_To_indev_5_0_x.Tests / dtest-upgrade-novnode jdk11 29/64 / test_limit_multiget
FAILED: dtest-upgrade-novnode.upgrade_tests.cql_tests.TestCQLNodes2RF1_Upgrade_indev_4_1_x_To_indev_5_0_x.Tests / dtest-upgrade-novnode jdk11 29/64 / test_float_with_exponent
FAILED: dtest-upgrade-novnode.upgrade_tests.cql_tests.TestCQLNodes2RF1_Upgrade_indev_4_1_x_To_indev_5_0_x.Tests / dtest-upgrade-novnode jdk11 29/64 / test_blobAs_functions
FAILED: dtest-upgrade-novnode.upgrade_tests.paging_test.TestPagingDataNodes2RF1_Upgrade_indev_4_1_x_To_indev_5_0_x.Tests / dtest-upgrade-novnode jdk11 29/64 / test_paging_using_secondary_indexes
FAILED: dtest-upgrade-novnode.upgrade_tests.upgrade_through_versions_test.TestProtoV4Upgrade_AllVersions_EndsAt_Trunk_HEAD.Tests / dtest-upgrade-novnode jdk11 29/64 / test_parallel_upgrade
-------------------------------------------------------------------------------
For complete test report and logs see https://nightlies.apache.org/cassandra/Cassandra-5.0/274/