You are viewing a plain text version of this content. The canonical link for it is here.
Posted to dev@lucene.apache.org by Policeman Jenkins Server <je...@thetaphi.de> on 2016/06/30 04:16:24 UTC
[JENKINS] Lucene-Solr-master-Windows (32bit/jdk1.8.0_92) - Build #
5945 - Failure!
Build: http://jenkins.thetaphi.de/job/Lucene-Solr-master-Windows/5945/
Java: 32bit/jdk1.8.0_92 -client -XX:+UseParallelGC
2 tests failed.
FAILED: junit.framework.TestSuite.org.apache.solr.cloud.CdcrVersionReplicationTest
Error Message:
ObjectTracker found 1 object(s) that were not released!!! [InternalHttpClient]
Stack Trace:
java.lang.AssertionError: ObjectTracker found 1 object(s) that were not released!!! [InternalHttpClient]
at __randomizedtesting.SeedInfo.seed([BF365ADBD2B9C69B]:0)
at org.junit.Assert.fail(Assert.java:93)
at org.junit.Assert.assertTrue(Assert.java:43)
at org.junit.Assert.assertNull(Assert.java:551)
at org.apache.solr.SolrTestCaseJ4.teardownTestCases(SolrTestCaseJ4.java:256)
at sun.reflect.GeneratedMethodAccessor17.invoke(Unknown Source)
at sun.reflect.DelegatingMethodAccessorImpl.invoke(DelegatingMethodAccessorImpl.java:43)
at java.lang.reflect.Method.invoke(Method.java:498)
at com.carrotsearch.randomizedtesting.RandomizedRunner.invoke(RandomizedRunner.java:1764)
at com.carrotsearch.randomizedtesting.RandomizedRunner$7.evaluate(RandomizedRunner.java:834)
at com.carrotsearch.randomizedtesting.rules.StatementAdapter.evaluate(StatementAdapter.java:36)
at com.carrotsearch.randomizedtesting.rules.SystemPropertiesRestoreRule$1.evaluate(SystemPropertiesRestoreRule.java:57)
at org.apache.lucene.util.AbstractBeforeAfterRule$1.evaluate(AbstractBeforeAfterRule.java:45)
at com.carrotsearch.randomizedtesting.rules.StatementAdapter.evaluate(StatementAdapter.java:36)
at org.apache.lucene.util.TestRuleStoreClassName$1.evaluate(TestRuleStoreClassName.java:41)
at com.carrotsearch.randomizedtesting.rules.NoShadowingOrOverridesOnMethodsRule$1.evaluate(NoShadowingOrOverridesOnMethodsRule.java:40)
at com.carrotsearch.randomizedtesting.rules.NoShadowingOrOverridesOnMethodsRule$1.evaluate(NoShadowingOrOverridesOnMethodsRule.java:40)
at com.carrotsearch.randomizedtesting.rules.StatementAdapter.evaluate(StatementAdapter.java:36)
at com.carrotsearch.randomizedtesting.rules.StatementAdapter.evaluate(StatementAdapter.java:36)
at com.carrotsearch.randomizedtesting.rules.StatementAdapter.evaluate(StatementAdapter.java:36)
at org.apache.lucene.util.TestRuleAssertionsRequired$1.evaluate(TestRuleAssertionsRequired.java:53)
at org.apache.lucene.util.TestRuleMarkFailure$1.evaluate(TestRuleMarkFailure.java:47)
at org.apache.lucene.util.TestRuleIgnoreAfterMaxFailures$1.evaluate(TestRuleIgnoreAfterMaxFailures.java:64)
at org.apache.lucene.util.TestRuleIgnoreTestSuites$1.evaluate(TestRuleIgnoreTestSuites.java:54)
at com.carrotsearch.randomizedtesting.rules.StatementAdapter.evaluate(StatementAdapter.java:36)
at com.carrotsearch.randomizedtesting.ThreadLeakControl$StatementRunner.run(ThreadLeakControl.java:367)
at java.lang.Thread.run(Thread.java:745)
FAILED: org.apache.solr.handler.TestSolrConfigHandlerConcurrent.test
Error Message:
Stack Trace:
java.lang.NullPointerException
at __randomizedtesting.SeedInfo.seed([BF365ADBD2B9C69B:376265017C45AB63]:0)
at org.apache.solr.handler.TestSolrConfigHandlerConcurrent.test(TestSolrConfigHandlerConcurrent.java:109)
at sun.reflect.NativeMethodAccessorImpl.invoke0(Native Method)
at sun.reflect.NativeMethodAccessorImpl.invoke(NativeMethodAccessorImpl.java:62)
at sun.reflect.DelegatingMethodAccessorImpl.invoke(DelegatingMethodAccessorImpl.java:43)
at java.lang.reflect.Method.invoke(Method.java:498)
at com.carrotsearch.randomizedtesting.RandomizedRunner.invoke(RandomizedRunner.java:1764)
at com.carrotsearch.randomizedtesting.RandomizedRunner$8.evaluate(RandomizedRunner.java:871)
at com.carrotsearch.randomizedtesting.RandomizedRunner$9.evaluate(RandomizedRunner.java:907)
at com.carrotsearch.randomizedtesting.RandomizedRunner$10.evaluate(RandomizedRunner.java:921)
at org.apache.solr.BaseDistributedSearchTestCase$ShardsRepeatRule$ShardsFixedStatement.callStatement(BaseDistributedSearchTestCase.java:985)
at org.apache.solr.BaseDistributedSearchTestCase$ShardsRepeatRule$ShardsStatement.evaluate(BaseDistributedSearchTestCase.java:960)
at com.carrotsearch.randomizedtesting.rules.SystemPropertiesRestoreRule$1.evaluate(SystemPropertiesRestoreRule.java:57)
at org.apache.lucene.util.TestRuleSetupTeardownChained$1.evaluate(TestRuleSetupTeardownChained.java:49)
at org.apache.lucene.util.AbstractBeforeAfterRule$1.evaluate(AbstractBeforeAfterRule.java:45)
at org.apache.lucene.util.TestRuleThreadAndTestName$1.evaluate(TestRuleThreadAndTestName.java:48)
at org.apache.lucene.util.TestRuleIgnoreAfterMaxFailures$1.evaluate(TestRuleIgnoreAfterMaxFailures.java:64)
at org.apache.lucene.util.TestRuleMarkFailure$1.evaluate(TestRuleMarkFailure.java:47)
at com.carrotsearch.randomizedtesting.rules.StatementAdapter.evaluate(StatementAdapter.java:36)
at com.carrotsearch.randomizedtesting.ThreadLeakControl$StatementRunner.run(ThreadLeakControl.java:367)
at com.carrotsearch.randomizedtesting.ThreadLeakControl.forkTimeoutingTask(ThreadLeakControl.java:809)
at com.carrotsearch.randomizedtesting.ThreadLeakControl$3.evaluate(ThreadLeakControl.java:460)
at com.carrotsearch.randomizedtesting.RandomizedRunner.runSingleTest(RandomizedRunner.java:880)
at com.carrotsearch.randomizedtesting.RandomizedRunner$5.evaluate(RandomizedRunner.java:781)
at com.carrotsearch.randomizedtesting.RandomizedRunner$6.evaluate(RandomizedRunner.java:816)
at com.carrotsearch.randomizedtesting.RandomizedRunner$7.evaluate(RandomizedRunner.java:827)
at com.carrotsearch.randomizedtesting.rules.StatementAdapter.evaluate(StatementAdapter.java:36)
at com.carrotsearch.randomizedtesting.rules.SystemPropertiesRestoreRule$1.evaluate(SystemPropertiesRestoreRule.java:57)
at org.apache.lucene.util.AbstractBeforeAfterRule$1.evaluate(AbstractBeforeAfterRule.java:45)
at com.carrotsearch.randomizedtesting.rules.StatementAdapter.evaluate(StatementAdapter.java:36)
at org.apache.lucene.util.TestRuleStoreClassName$1.evaluate(TestRuleStoreClassName.java:41)
at com.carrotsearch.randomizedtesting.rules.NoShadowingOrOverridesOnMethodsRule$1.evaluate(NoShadowingOrOverridesOnMethodsRule.java:40)
at com.carrotsearch.randomizedtesting.rules.NoShadowingOrOverridesOnMethodsRule$1.evaluate(NoShadowingOrOverridesOnMethodsRule.java:40)
at com.carrotsearch.randomizedtesting.rules.StatementAdapter.evaluate(StatementAdapter.java:36)
at com.carrotsearch.randomizedtesting.rules.StatementAdapter.evaluate(StatementAdapter.java:36)
at com.carrotsearch.randomizedtesting.rules.StatementAdapter.evaluate(StatementAdapter.java:36)
at org.apache.lucene.util.TestRuleAssertionsRequired$1.evaluate(TestRuleAssertionsRequired.java:53)
at org.apache.lucene.util.TestRuleMarkFailure$1.evaluate(TestRuleMarkFailure.java:47)
at org.apache.lucene.util.TestRuleIgnoreAfterMaxFailures$1.evaluate(TestRuleIgnoreAfterMaxFailures.java:64)
at org.apache.lucene.util.TestRuleIgnoreTestSuites$1.evaluate(TestRuleIgnoreTestSuites.java:54)
at com.carrotsearch.randomizedtesting.rules.StatementAdapter.evaluate(StatementAdapter.java:36)
at com.carrotsearch.randomizedtesting.ThreadLeakControl$StatementRunner.run(ThreadLeakControl.java:367)
at java.lang.Thread.run(Thread.java:745)
Build Log:
[...truncated 12034 lines...]
[junit4] Suite: org.apache.solr.cloud.CdcrVersionReplicationTest
[junit4] 2> Creating dataDir: C:\Users\jenkins\workspace\Lucene-Solr-master-Windows\solr\build\solr-core\test\J0\temp\solr.cloud.CdcrVersionReplicationTest_BF365ADBD2B9C69B-001\init-core-data-001
[junit4] 2> 1892554 INFO (SUITE-CdcrVersionReplicationTest-seed#[BF365ADBD2B9C69B]-worker) [ ] o.a.s.SolrTestCaseJ4 Randomized ssl (false) and clientAuth (false) via: @org.apache.solr.util.RandomizeSSL(reason=, value=NaN, ssl=NaN, clientAuth=NaN)
[junit4] 2> 1892554 INFO (SUITE-CdcrVersionReplicationTest-seed#[BF365ADBD2B9C69B]-worker) [ ] o.a.s.BaseDistributedSearchTestCase Setting hostContext system property: /
[junit4] 2> 1892563 INFO (TEST-CdcrVersionReplicationTest.testCdcrDocVersions-seed#[BF365ADBD2B9C69B]) [ ] o.a.s.c.ZkTestServer STARTING ZK TEST SERVER
[junit4] 2> 1892568 INFO (Thread-4729) [ ] o.a.s.c.ZkTestServer client port:0.0.0.0/0.0.0.0:0
[junit4] 2> 1892568 INFO (Thread-4729) [ ] o.a.s.c.ZkTestServer Starting server
[junit4] 2> 1892664 INFO (TEST-CdcrVersionReplicationTest.testCdcrDocVersions-seed#[BF365ADBD2B9C69B]) [ ] o.a.s.c.ZkTestServer start zk server on port:62492
[junit4] 2> 1892664 INFO (TEST-CdcrVersionReplicationTest.testCdcrDocVersions-seed#[BF365ADBD2B9C69B]) [ ] o.a.s.c.c.SolrZkClient Using default ZkCredentialsProvider
[junit4] 2> 1892665 INFO (TEST-CdcrVersionReplicationTest.testCdcrDocVersions-seed#[BF365ADBD2B9C69B]) [ ] o.a.s.c.c.ConnectionManager Waiting for client to connect to ZooKeeper
[junit4] 2> 1892675 INFO (zkCallback-8571-thread-1) [ ] o.a.s.c.c.ConnectionManager Watcher org.apache.solr.common.cloud.ConnectionManager@739829 name:ZooKeeperConnection Watcher:127.0.0.1:62492 got event WatchedEvent state:SyncConnected type:None path:null path:null type:None
[junit4] 2> 1892675 INFO (TEST-CdcrVersionReplicationTest.testCdcrDocVersions-seed#[BF365ADBD2B9C69B]) [ ] o.a.s.c.c.ConnectionManager Client is connected to ZooKeeper
[junit4] 2> 1892675 INFO (TEST-CdcrVersionReplicationTest.testCdcrDocVersions-seed#[BF365ADBD2B9C69B]) [ ] o.a.s.c.c.SolrZkClient Using default ZkACLProvider
[junit4] 2> 1892675 INFO (TEST-CdcrVersionReplicationTest.testCdcrDocVersions-seed#[BF365ADBD2B9C69B]) [ ] o.a.s.c.c.SolrZkClient makePath: /solr
[junit4] 2> 1892681 WARN (NIOServerCxn.Factory:0.0.0.0/0.0.0.0:0) [ ] o.a.z.s.NIOServerCnxn caught end of stream exception
[junit4] 2> EndOfStreamException: Unable to read additional data from client sessionid 0x1559f727f650000, likely client has closed socket
[junit4] 2> at org.apache.zookeeper.server.NIOServerCnxn.doIO(NIOServerCnxn.java:228)
[junit4] 2> at org.apache.zookeeper.server.NIOServerCnxnFactory.run(NIOServerCnxnFactory.java:208)
[junit4] 2> at java.lang.Thread.run(Thread.java:745)
[junit4] 2> 1892682 INFO (TEST-CdcrVersionReplicationTest.testCdcrDocVersions-seed#[BF365ADBD2B9C69B]) [ ] o.a.s.c.c.SolrZkClient Using default ZkCredentialsProvider
[junit4] 2> 1892685 INFO (TEST-CdcrVersionReplicationTest.testCdcrDocVersions-seed#[BF365ADBD2B9C69B]) [ ] o.a.s.c.c.ConnectionManager Waiting for client to connect to ZooKeeper
[junit4] 2> 1892689 INFO (zkCallback-8572-thread-1) [ ] o.a.s.c.c.ConnectionManager Watcher org.apache.solr.common.cloud.ConnectionManager@1b01d29 name:ZooKeeperConnection Watcher:127.0.0.1:62492/solr got event WatchedEvent state:SyncConnected type:None path:null path:null type:None
[junit4] 2> 1892689 INFO (TEST-CdcrVersionReplicationTest.testCdcrDocVersions-seed#[BF365ADBD2B9C69B]) [ ] o.a.s.c.c.ConnectionManager Client is connected to ZooKeeper
[junit4] 2> 1892690 INFO (TEST-CdcrVersionReplicationTest.testCdcrDocVersions-seed#[BF365ADBD2B9C69B]) [ ] o.a.s.c.c.SolrZkClient Using default ZkACLProvider
[junit4] 2> 1892690 INFO (TEST-CdcrVersionReplicationTest.testCdcrDocVersions-seed#[BF365ADBD2B9C69B]) [ ] o.a.s.c.c.SolrZkClient makePath: /collections/collection1
[junit4] 2> 1892697 INFO (TEST-CdcrVersionReplicationTest.testCdcrDocVersions-seed#[BF365ADBD2B9C69B]) [ ] o.a.s.c.c.SolrZkClient makePath: /collections/collection1/shards
[junit4] 2> 1892703 INFO (TEST-CdcrVersionReplicationTest.testCdcrDocVersions-seed#[BF365ADBD2B9C69B]) [ ] o.a.s.c.c.SolrZkClient makePath: /collections/control_collection
[junit4] 2> 1892707 INFO (TEST-CdcrVersionReplicationTest.testCdcrDocVersions-seed#[BF365ADBD2B9C69B]) [ ] o.a.s.c.c.SolrZkClient makePath: /collections/control_collection/shards
[junit4] 2> 1892712 INFO (TEST-CdcrVersionReplicationTest.testCdcrDocVersions-seed#[BF365ADBD2B9C69B]) [ ] o.a.s.c.AbstractZkTestCase put C:\Users\jenkins\workspace\Lucene-Solr-master-Windows\solr\core\src\test-files\solr\collection1\conf\solrconfig-cdcr.xml to /configs/conf1/solrconfig.xml
[junit4] 2> 1892713 INFO (TEST-CdcrVersionReplicationTest.testCdcrDocVersions-seed#[BF365ADBD2B9C69B]) [ ] o.a.s.c.c.SolrZkClient makePath: /configs/conf1/solrconfig.xml
[junit4] 2> 1892721 INFO (TEST-CdcrVersionReplicationTest.testCdcrDocVersions-seed#[BF365ADBD2B9C69B]) [ ] o.a.s.c.AbstractZkTestCase put C:\Users\jenkins\workspace\Lucene-Solr-master-Windows\solr\core\src\test-files\solr\collection1\conf\schema15.xml to /configs/conf1/schema.xml
[junit4] 2> 1892722 INFO (TEST-CdcrVersionReplicationTest.testCdcrDocVersions-seed#[BF365ADBD2B9C69B]) [ ] o.a.s.c.c.SolrZkClient makePath: /configs/conf1/schema.xml
[junit4] 2> 1892729 INFO (TEST-CdcrVersionReplicationTest.testCdcrDocVersions-seed#[BF365ADBD2B9C69B]) [ ] o.a.s.c.AbstractZkTestCase put C:\Users\jenkins\workspace\Lucene-Solr-master-Windows\solr\core\src\test-files\solr\collection1\conf\solrconfig.snippet.randomindexconfig.xml to /configs/conf1/solrconfig.snippet.randomindexconfig.xml
[junit4] 2> 1892730 INFO (TEST-CdcrVersionReplicationTest.testCdcrDocVersions-seed#[BF365ADBD2B9C69B]) [ ] o.a.s.c.c.SolrZkClient makePath: /configs/conf1/solrconfig.snippet.randomindexconfig.xml
[junit4] 2> 1892734 INFO (TEST-CdcrVersionReplicationTest.testCdcrDocVersions-seed#[BF365ADBD2B9C69B]) [ ] o.a.s.c.AbstractZkTestCase put C:\Users\jenkins\workspace\Lucene-Solr-master-Windows\solr\core\src\test-files\solr\collection1\conf\stopwords.txt to /configs/conf1/stopwords.txt
[junit4] 2> 1892734 INFO (TEST-CdcrVersionReplicationTest.testCdcrDocVersions-seed#[BF365ADBD2B9C69B]) [ ] o.a.s.c.c.SolrZkClient makePath: /configs/conf1/stopwords.txt
[junit4] 2> 1892738 INFO (TEST-CdcrVersionReplicationTest.testCdcrDocVersions-seed#[BF365ADBD2B9C69B]) [ ] o.a.s.c.AbstractZkTestCase put C:\Users\jenkins\workspace\Lucene-Solr-master-Windows\solr\core\src\test-files\solr\collection1\conf\protwords.txt to /configs/conf1/protwords.txt
[junit4] 2> 1892739 INFO (TEST-CdcrVersionReplicationTest.testCdcrDocVersions-seed#[BF365ADBD2B9C69B]) [ ] o.a.s.c.c.SolrZkClient makePath: /configs/conf1/protwords.txt
[junit4] 2> 1892745 INFO (TEST-CdcrVersionReplicationTest.testCdcrDocVersions-seed#[BF365ADBD2B9C69B]) [ ] o.a.s.c.AbstractZkTestCase put C:\Users\jenkins\workspace\Lucene-Solr-master-Windows\solr\core\src\test-files\solr\collection1\conf\currency.xml to /configs/conf1/currency.xml
[junit4] 2> 1892746 INFO (TEST-CdcrVersionReplicationTest.testCdcrDocVersions-seed#[BF365ADBD2B9C69B]) [ ] o.a.s.c.c.SolrZkClient makePath: /configs/conf1/currency.xml
[junit4] 2> 1892754 INFO (TEST-CdcrVersionReplicationTest.testCdcrDocVersions-seed#[BF365ADBD2B9C69B]) [ ] o.a.s.c.AbstractZkTestCase put C:\Users\jenkins\workspace\Lucene-Solr-master-Windows\solr\core\src\test-files\solr\collection1\conf\enumsConfig.xml to /configs/conf1/enumsConfig.xml
[junit4] 2> 1892754 INFO (TEST-CdcrVersionReplicationTest.testCdcrDocVersions-seed#[BF365ADBD2B9C69B]) [ ] o.a.s.c.c.SolrZkClient makePath: /configs/conf1/enumsConfig.xml
[junit4] 2> 1892758 INFO (TEST-CdcrVersionReplicationTest.testCdcrDocVersions-seed#[BF365ADBD2B9C69B]) [ ] o.a.s.c.AbstractZkTestCase put C:\Users\jenkins\workspace\Lucene-Solr-master-Windows\solr\core\src\test-files\solr\collection1\conf\open-exchange-rates.json to /configs/conf1/open-exchange-rates.json
[junit4] 2> 1892759 INFO (TEST-CdcrVersionReplicationTest.testCdcrDocVersions-seed#[BF365ADBD2B9C69B]) [ ] o.a.s.c.c.SolrZkClient makePath: /configs/conf1/open-exchange-rates.json
[junit4] 2> 1892763 INFO (TEST-CdcrVersionReplicationTest.testCdcrDocVersions-seed#[BF365ADBD2B9C69B]) [ ] o.a.s.c.AbstractZkTestCase put C:\Users\jenkins\workspace\Lucene-Solr-master-Windows\solr\core\src\test-files\solr\collection1\conf\mapping-ISOLatin1Accent.txt to /configs/conf1/mapping-ISOLatin1Accent.txt
[junit4] 2> 1892763 INFO (TEST-CdcrVersionReplicationTest.testCdcrDocVersions-seed#[BF365ADBD2B9C69B]) [ ] o.a.s.c.c.SolrZkClient makePath: /configs/conf1/mapping-ISOLatin1Accent.txt
[junit4] 2> 1892769 INFO (TEST-CdcrVersionReplicationTest.testCdcrDocVersions-seed#[BF365ADBD2B9C69B]) [ ] o.a.s.c.AbstractZkTestCase put C:\Users\jenkins\workspace\Lucene-Solr-master-Windows\solr\core\src\test-files\solr\collection1\conf\old_synonyms.txt to /configs/conf1/old_synonyms.txt
[junit4] 2> 1892769 INFO (TEST-CdcrVersionReplicationTest.testCdcrDocVersions-seed#[BF365ADBD2B9C69B]) [ ] o.a.s.c.c.SolrZkClient makePath: /configs/conf1/old_synonyms.txt
[junit4] 2> 1892776 INFO (TEST-CdcrVersionReplicationTest.testCdcrDocVersions-seed#[BF365ADBD2B9C69B]) [ ] o.a.s.c.AbstractZkTestCase put C:\Users\jenkins\workspace\Lucene-Solr-master-Windows\solr\core\src\test-files\solr\collection1\conf\synonyms.txt to /configs/conf1/synonyms.txt
[junit4] 2> 1892777 INFO (TEST-CdcrVersionReplicationTest.testCdcrDocVersions-seed#[BF365ADBD2B9C69B]) [ ] o.a.s.c.c.SolrZkClient makePath: /configs/conf1/synonyms.txt
[junit4] 2> 1892782 WARN (NIOServerCxn.Factory:0.0.0.0/0.0.0.0:0) [ ] o.a.z.s.NIOServerCnxn caught end of stream exception
[junit4] 2> EndOfStreamException: Unable to read additional data from client sessionid 0x1559f727f650001, likely client has closed socket
[junit4] 2> at org.apache.zookeeper.server.NIOServerCnxn.doIO(NIOServerCnxn.java:228)
[junit4] 2> at org.apache.zookeeper.server.NIOServerCnxnFactory.run(NIOServerCnxnFactory.java:208)
[junit4] 2> at java.lang.Thread.run(Thread.java:745)
[junit4] 2> 1892783 INFO (TEST-CdcrVersionReplicationTest.testCdcrDocVersions-seed#[BF365ADBD2B9C69B]) [ ] o.a.s.SolrTestCaseJ4 ###Starting testCdcrDocVersions
[junit4] 2> 1893421 INFO (TEST-CdcrVersionReplicationTest.testCdcrDocVersions-seed#[BF365ADBD2B9C69B]) [ ] o.a.s.SolrTestCaseJ4 Writing core.properties file to C:\Users\jenkins\workspace\Lucene-Solr-master-Windows\solr\build\solr-core\test\J0\temp\solr.cloud.CdcrVersionReplicationTest_BF365ADBD2B9C69B-001\jetty-001\cores\collection1
[junit4] 2> 1893426 INFO (TEST-CdcrVersionReplicationTest.testCdcrDocVersions-seed#[BF365ADBD2B9C69B]) [ ] o.e.j.s.Server jetty-9.3.8.v20160314
[junit4] 2> 1893428 INFO (TEST-CdcrVersionReplicationTest.testCdcrDocVersions-seed#[BF365ADBD2B9C69B]) [ ] o.e.j.s.h.ContextHandler Started o.e.j.s.ServletContextHandler@1dce0d2{/,null,AVAILABLE}
[junit4] 2> 1893430 INFO (TEST-CdcrVersionReplicationTest.testCdcrDocVersions-seed#[BF365ADBD2B9C69B]) [ ] o.e.j.s.ServerConnector Started ServerConnector@1131e9c{HTTP/1.1,[http/1.1]}{127.0.0.1:62511}
[junit4] 2> 1893430 INFO (TEST-CdcrVersionReplicationTest.testCdcrDocVersions-seed#[BF365ADBD2B9C69B]) [ ] o.e.j.s.Server Started @1902724ms
[junit4] 2> 1893430 INFO (TEST-CdcrVersionReplicationTest.testCdcrDocVersions-seed#[BF365ADBD2B9C69B]) [ ] o.a.s.c.s.e.JettySolrRunner Jetty properties: {shards=shard1, hostContext=/, hostPort=62511, coreRootDirectory=C:\Users\jenkins\workspace\Lucene-Solr-master-Windows\solr\build\solr-core\test\J0\temp\solr.cloud.CdcrVersionReplicationTest_BF365ADBD2B9C69B-001\jetty-001\cores}
[junit4] 2> 1893430 INFO (TEST-CdcrVersionReplicationTest.testCdcrDocVersions-seed#[BF365ADBD2B9C69B]) [ ] o.a.s.s.SolrDispatchFilter SolrDispatchFilter.init(): sun.misc.Launcher$AppClassLoader@1d16e93
[junit4] 2> 1893431 INFO (TEST-CdcrVersionReplicationTest.testCdcrDocVersions-seed#[BF365ADBD2B9C69B]) [ ] o.a.s.c.SolrResourceLoader new SolrResourceLoader for directory: 'C:\Users\jenkins\workspace\Lucene-Solr-master-Windows\solr\build\solr-core\test\J0\temp\solr.cloud.CdcrVersionReplicationTest_BF365ADBD2B9C69B-001\jetty-001'
[junit4] 2> 1893431 INFO (TEST-CdcrVersionReplicationTest.testCdcrDocVersions-seed#[BF365ADBD2B9C69B]) [ ] o.a.s.c.SolrResourceLoader JNDI not configured for solr (NoInitialContextEx)
[junit4] 2> 1893431 INFO (TEST-CdcrVersionReplicationTest.testCdcrDocVersions-seed#[BF365ADBD2B9C69B]) [ ] o.a.s.c.SolrResourceLoader solr home defaulted to 'solr/' (could not find system property or JNDI)
[junit4] 2> 1893432 INFO (TEST-CdcrVersionReplicationTest.testCdcrDocVersions-seed#[BF365ADBD2B9C69B]) [ ] o.a.s.c.c.SolrZkClient Using default ZkCredentialsProvider
[junit4] 2> 1893433 INFO (TEST-CdcrVersionReplicationTest.testCdcrDocVersions-seed#[BF365ADBD2B9C69B]) [ ] o.a.s.c.c.ConnectionManager Waiting for client to connect to ZooKeeper
[junit4] 2> 1893435 INFO (zkCallback-8573-thread-1) [ ] o.a.s.c.c.ConnectionManager Watcher org.apache.solr.common.cloud.ConnectionManager@1cc7985 name:ZooKeeperConnection Watcher:127.0.0.1:62492/solr got event WatchedEvent state:SyncConnected type:None path:null path:null type:None
[junit4] 2> 1893437 INFO (TEST-CdcrVersionReplicationTest.testCdcrDocVersions-seed#[BF365ADBD2B9C69B]) [ ] o.a.s.c.c.ConnectionManager Client is connected to ZooKeeper
[junit4] 2> 1893437 INFO (TEST-CdcrVersionReplicationTest.testCdcrDocVersions-seed#[BF365ADBD2B9C69B]) [ ] o.a.s.c.c.SolrZkClient Using default ZkACLProvider
[junit4] 2> 1893439 WARN (NIOServerCxn.Factory:0.0.0.0/0.0.0.0:0) [ ] o.a.z.s.NIOServerCnxn caught end of stream exception
[junit4] 2> EndOfStreamException: Unable to read additional data from client sessionid 0x1559f727f650002, likely client has closed socket
[junit4] 2> at org.apache.zookeeper.server.NIOServerCnxn.doIO(NIOServerCnxn.java:228)
[junit4] 2> at org.apache.zookeeper.server.NIOServerCnxnFactory.run(NIOServerCnxnFactory.java:208)
[junit4] 2> at java.lang.Thread.run(Thread.java:745)
[junit4] 2> 1893440 INFO (TEST-CdcrVersionReplicationTest.testCdcrDocVersions-seed#[BF365ADBD2B9C69B]) [ ] o.a.s.s.SolrDispatchFilter Loading solr.xml from SolrHome (not found in ZooKeeper)
[junit4] 2> 1893440 INFO (TEST-CdcrVersionReplicationTest.testCdcrDocVersions-seed#[BF365ADBD2B9C69B]) [ ] o.a.s.c.SolrXmlConfig Loading container configuration from C:\Users\jenkins\workspace\Lucene-Solr-master-Windows\solr\build\solr-core\test\J0\temp\solr.cloud.CdcrVersionReplicationTest_BF365ADBD2B9C69B-001\jetty-001\solr.xml
[junit4] 2> 1893454 INFO (TEST-CdcrVersionReplicationTest.testCdcrDocVersions-seed#[BF365ADBD2B9C69B]) [ ] o.a.s.c.CorePropertiesLocator Config-defined core root directory: C:\Users\jenkins\workspace\Lucene-Solr-master-Windows\solr\build\solr-core\test\J0\temp\solr.cloud.CdcrVersionReplicationTest_BF365ADBD2B9C69B-001\jetty-001\cores
[junit4] 2> 1893454 INFO (TEST-CdcrVersionReplicationTest.testCdcrDocVersions-seed#[BF365ADBD2B9C69B]) [ ] o.a.s.c.CoreContainer New CoreContainer 23691
[junit4] 2> 1893454 INFO (TEST-CdcrVersionReplicationTest.testCdcrDocVersions-seed#[BF365ADBD2B9C69B]) [ ] o.a.s.c.CoreContainer Loading cores into CoreContainer [instanceDir=C:\Users\jenkins\workspace\Lucene-Solr-master-Windows\solr\build\solr-core\test\J0\temp\solr.cloud.CdcrVersionReplicationTest_BF365ADBD2B9C69B-001\jetty-001]
[junit4] 2> 1893454 WARN (TEST-CdcrVersionReplicationTest.testCdcrDocVersions-seed#[BF365ADBD2B9C69B]) [ ] o.a.s.c.CoreContainer Couldn't add files from C:\Users\jenkins\workspace\Lucene-Solr-master-Windows\solr\build\solr-core\test\J0\temp\solr.cloud.CdcrVersionReplicationTest_BF365ADBD2B9C69B-001\jetty-001\lib to classpath: C:\Users\jenkins\workspace\Lucene-Solr-master-Windows\solr\build\solr-core\test\J0\temp\solr.cloud.CdcrVersionReplicationTest_BF365ADBD2B9C69B-001\jetty-001\lib
[junit4] 2> 1893454 INFO (TEST-CdcrVersionReplicationTest.testCdcrDocVersions-seed#[BF365ADBD2B9C69B]) [ ] o.a.s.h.c.HttpShardHandlerFactory created with socketTimeout : 90000,urlScheme : ,connTimeout : 15000,maxConnectionsPerHost : 20,maxConnections : 10000,corePoolSize : 0,maximumPoolSize : 2147483647,maxThreadIdleTime : 5,sizeOfQueue : -1,fairnessPolicy : false,
[junit4] 2> 1893459 INFO (TEST-CdcrVersionReplicationTest.testCdcrDocVersions-seed#[BF365ADBD2B9C69B]) [ ] o.a.s.u.UpdateShardHandler Creating UpdateShardHandler HTTP client with params:
[junit4] 2> 1893462 INFO (TEST-CdcrVersionReplicationTest.testCdcrDocVersions-seed#[BF365ADBD2B9C69B]) [ ] o.a.s.l.LogWatcher SLF4J impl is org.slf4j.impl.Log4jLoggerFactory
[junit4] 2> 1893462 INFO (TEST-CdcrVersionReplicationTest.testCdcrDocVersions-seed#[BF365ADBD2B9C69B]) [ ] o.a.s.l.LogWatcher Registering Log Listener [Log4j (org.slf4j.impl.Log4jLoggerFactory)]
[junit4] 2> 1893462 INFO (TEST-CdcrVersionReplicationTest.testCdcrDocVersions-seed#[BF365ADBD2B9C69B]) [ ] o.a.s.c.ZkContainer Zookeeper client=127.0.0.1:62492/solr
[junit4] 2> 1893462 INFO (TEST-CdcrVersionReplicationTest.testCdcrDocVersions-seed#[BF365ADBD2B9C69B]) [ ] o.a.s.c.ZkController zkHost includes chroot
[junit4] 2> 1893463 INFO (TEST-CdcrVersionReplicationTest.testCdcrDocVersions-seed#[BF365ADBD2B9C69B]) [ ] o.a.s.c.c.SolrZkClient Using default ZkCredentialsProvider
[junit4] 2> 1893464 INFO (TEST-CdcrVersionReplicationTest.testCdcrDocVersions-seed#[BF365ADBD2B9C69B]) [ ] o.a.s.c.c.ConnectionManager Waiting for client to connect to ZooKeeper
[junit4] 2> 1893465 INFO (zkCallback-8576-thread-1) [ ] o.a.s.c.c.ConnectionManager Watcher org.apache.solr.common.cloud.ConnectionManager@16bd5ae name:ZooKeeperConnection Watcher:127.0.0.1:62492 got event WatchedEvent state:SyncConnected type:None path:null path:null type:None
[junit4] 2> 1893466 INFO (TEST-CdcrVersionReplicationTest.testCdcrDocVersions-seed#[BF365ADBD2B9C69B]) [ ] o.a.s.c.c.ConnectionManager Client is connected to ZooKeeper
[junit4] 2> 1893466 INFO (TEST-CdcrVersionReplicationTest.testCdcrDocVersions-seed#[BF365ADBD2B9C69B]) [ ] o.a.s.c.c.SolrZkClient Using default ZkACLProvider
[junit4] 2> 1893468 INFO (TEST-CdcrVersionReplicationTest.testCdcrDocVersions-seed#[BF365ADBD2B9C69B]) [n:127.0.0.1:62511_ ] o.a.s.c.ZkController Added new OnReconnect listener org.apache.solr.cloud.ZkController$$Lambda$51/32228217@17e32f4
[junit4] 2> 1893471 INFO (TEST-CdcrVersionReplicationTest.testCdcrDocVersions-seed#[BF365ADBD2B9C69B]) [n:127.0.0.1:62511_ ] o.a.s.c.c.ConnectionManager Waiting for client to connect to ZooKeeper
[junit4] 2> 1893475 INFO (zkCallback-8577-thread-1-processing-n:127.0.0.1:62511_) [n:127.0.0.1:62511_ ] o.a.s.c.c.ConnectionManager Watcher org.apache.solr.common.cloud.ConnectionManager@1712852 name:ZooKeeperConnection Watcher:127.0.0.1:62492/solr got event WatchedEvent state:SyncConnected type:None path:null path:null type:None
[junit4] 2> 1893475 INFO (TEST-CdcrVersionReplicationTest.testCdcrDocVersions-seed#[BF365ADBD2B9C69B]) [n:127.0.0.1:62511_ ] o.a.s.c.c.ConnectionManager Client is connected to ZooKeeper
[junit4] 2> 1893478 INFO (TEST-CdcrVersionReplicationTest.testCdcrDocVersions-seed#[BF365ADBD2B9C69B]) [n:127.0.0.1:62511_ ] o.a.s.c.c.SolrZkClient makePath: /overseer/queue
[junit4] 2> 1893483 INFO (TEST-CdcrVersionReplicationTest.testCdcrDocVersions-seed#[BF365ADBD2B9C69B]) [n:127.0.0.1:62511_ ] o.a.s.c.c.SolrZkClient makePath: /overseer/collection-queue-work
[junit4] 2> 1893492 INFO (TEST-CdcrVersionReplicationTest.testCdcrDocVersions-seed#[BF365ADBD2B9C69B]) [n:127.0.0.1:62511_ ] o.a.s.c.c.SolrZkClient makePath: /overseer/collection-map-running
[junit4] 2> 1893498 INFO (TEST-CdcrVersionReplicationTest.testCdcrDocVersions-seed#[BF365ADBD2B9C69B]) [n:127.0.0.1:62511_ ] o.a.s.c.c.SolrZkClient makePath: /overseer/collection-map-completed
[junit4] 2> 1893502 INFO (TEST-CdcrVersionReplicationTest.testCdcrDocVersions-seed#[BF365ADBD2B9C69B]) [n:127.0.0.1:62511_ ] o.a.s.c.c.SolrZkClient makePath: /overseer/collection-map-failure
[junit4] 2> 1893506 INFO (TEST-CdcrVersionReplicationTest.testCdcrDocVersions-seed#[BF365ADBD2B9C69B]) [n:127.0.0.1:62511_ ] o.a.s.c.c.SolrZkClient makePath: /live_nodes
[junit4] 2> 1893512 INFO (TEST-CdcrVersionReplicationTest.testCdcrDocVersions-seed#[BF365ADBD2B9C69B]) [n:127.0.0.1:62511_ ] o.a.s.c.c.SolrZkClient makePath: /aliases.json
[junit4] 2> 1893515 INFO (TEST-CdcrVersionReplicationTest.testCdcrDocVersions-seed#[BF365ADBD2B9C69B]) [n:127.0.0.1:62511_ ] o.a.s.c.c.SolrZkClient makePath: /clusterstate.json
[junit4] 2> 1893518 INFO (TEST-CdcrVersionReplicationTest.testCdcrDocVersions-seed#[BF365ADBD2B9C69B]) [n:127.0.0.1:62511_ ] o.a.s.c.c.SolrZkClient makePath: /security.json
[junit4] 2> 1893521 INFO (TEST-CdcrVersionReplicationTest.testCdcrDocVersions-seed#[BF365ADBD2B9C69B]) [n:127.0.0.1:62511_ ] o.a.s.c.c.ZkStateReader Updating cluster state from ZooKeeper...
[junit4] 2> 1893523 INFO (TEST-CdcrVersionReplicationTest.testCdcrDocVersions-seed#[BF365ADBD2B9C69B]) [n:127.0.0.1:62511_ ] o.a.s.c.c.ZkStateReader Loaded empty cluster properties
[junit4] 2> 1893525 INFO (TEST-CdcrVersionReplicationTest.testCdcrDocVersions-seed#[BF365ADBD2B9C69B]) [n:127.0.0.1:62511_ ] o.a.s.c.c.ZkStateReader Updated live nodes from ZooKeeper... (0) -> (0)
[junit4] 2> 1893533 INFO (TEST-CdcrVersionReplicationTest.testCdcrDocVersions-seed#[BF365ADBD2B9C69B]) [n:127.0.0.1:62511_ ] o.a.s.c.c.SolrZkClient makePath: /overseer_elect
[junit4] 2> 1893536 INFO (TEST-CdcrVersionReplicationTest.testCdcrDocVersions-seed#[BF365ADBD2B9C69B]) [n:127.0.0.1:62511_ ] o.a.s.c.c.SolrZkClient makePath: /overseer_elect/election
[junit4] 2> 1893540 INFO (TEST-CdcrVersionReplicationTest.testCdcrDocVersions-seed#[BF365ADBD2B9C69B]) [n:127.0.0.1:62511_ ] o.a.s.c.Overseer Overseer (id=null) closing
[junit4] 2> 1893541 INFO (TEST-CdcrVersionReplicationTest.testCdcrDocVersions-seed#[BF365ADBD2B9C69B]) [n:127.0.0.1:62511_ ] o.a.s.c.LeaderElector Joined leadership election with path: /overseer_elect/election/96158281170747396-127.0.0.1:62511_-n_0000000000
[junit4] 2> 1893541 INFO (TEST-CdcrVersionReplicationTest.testCdcrDocVersions-seed#[BF365ADBD2B9C69B]) [n:127.0.0.1:62511_ ] o.a.s.c.OverseerElectionContext I am going to be the leader 127.0.0.1:62511_
[junit4] 2> 1893541 INFO (TEST-CdcrVersionReplicationTest.testCdcrDocVersions-seed#[BF365ADBD2B9C69B]) [n:127.0.0.1:62511_ ] o.a.s.c.c.SolrZkClient makePath: /overseer_elect/leader
[junit4] 2> 1893546 INFO (TEST-CdcrVersionReplicationTest.testCdcrDocVersions-seed#[BF365ADBD2B9C69B]) [n:127.0.0.1:62511_ ] o.a.s.c.Overseer Overseer (id=96158281170747396-127.0.0.1:62511_-n_0000000000) starting
[junit4] 2> 1893550 INFO (TEST-CdcrVersionReplicationTest.testCdcrDocVersions-seed#[BF365ADBD2B9C69B]) [n:127.0.0.1:62511_ ] o.a.s.c.c.SolrZkClient makePath: /overseer/queue-work
[junit4] 2> 1893567 INFO (TEST-CdcrVersionReplicationTest.testCdcrDocVersions-seed#[BF365ADBD2B9C69B]) [n:127.0.0.1:62511_ ] o.a.s.c.OverseerAutoReplicaFailoverThread Starting OverseerAutoReplicaFailoverThread autoReplicaFailoverWorkLoopDelay=10000 autoReplicaFailoverWaitAfterExpiration=30000 autoReplicaFailoverBadNodeExpiration=60000
[junit4] 2> 1893570 INFO (OverseerCollectionConfigSetProcessor-96158281170747396-127.0.0.1:62511_-n_0000000000) [n:127.0.0.1:62511_ ] o.a.s.c.OverseerTaskProcessor Process current queue of overseer operations
[junit4] 2> 1893570 INFO (TEST-CdcrVersionReplicationTest.testCdcrDocVersions-seed#[BF365ADBD2B9C69B]) [n:127.0.0.1:62511_ ] o.a.s.c.ZkController Register node as live in ZooKeeper:/live_nodes/127.0.0.1:62511_
[junit4] 2> 1893570 INFO (TEST-CdcrVersionReplicationTest.testCdcrDocVersions-seed#[BF365ADBD2B9C69B]) [n:127.0.0.1:62511_ ] o.a.s.c.c.SolrZkClient makePath: /live_nodes/127.0.0.1:62511_
[junit4] 2> 1893570 INFO (OverseerStateUpdate-96158281170747396-127.0.0.1:62511_-n_0000000000) [n:127.0.0.1:62511_ ] o.a.s.c.Overseer Starting to work on the main queue
[junit4] 2> 1893573 INFO (zkCallback-8577-thread-1-processing-n:127.0.0.1:62511_) [n:127.0.0.1:62511_ ] o.a.s.c.c.ZkStateReader A live node change: [WatchedEvent state:SyncConnected type:NodeChildrenChanged path:/live_nodes], has occurred - updating... (live nodes size: [0])
[junit4] 2> 1893575 INFO (OverseerStateUpdate-96158281170747396-127.0.0.1:62511_-n_0000000000) [n:127.0.0.1:62511_ ] o.a.s.c.c.ZkStateReader Updated live nodes from ZooKeeper... (0) -> (1)
[junit4] 2> 1893617 INFO (TEST-CdcrVersionReplicationTest.testCdcrDocVersions-seed#[BF365ADBD2B9C69B]) [n:127.0.0.1:62511_ ] o.a.s.c.CoreContainer Security conf doesn't exist. Skipping setup for authorization module.
[junit4] 2> 1893617 INFO (TEST-CdcrVersionReplicationTest.testCdcrDocVersions-seed#[BF365ADBD2B9C69B]) [n:127.0.0.1:62511_ ] o.a.s.c.CoreContainer No authentication plugin used.
[junit4] 2> 1893622 INFO (TEST-CdcrVersionReplicationTest.testCdcrDocVersions-seed#[BF365ADBD2B9C69B]) [n:127.0.0.1:62511_ ] o.a.s.c.CorePropertiesLocator Looking for core definitions underneath C:\Users\jenkins\workspace\Lucene-Solr-master-Windows\solr\build\solr-core\test\J0\temp\solr.cloud.CdcrVersionReplicationTest_BF365ADBD2B9C69B-001\jetty-001\cores
[junit4] 2> 1893625 INFO (TEST-CdcrVersionReplicationTest.testCdcrDocVersions-seed#[BF365ADBD2B9C69B]) [n:127.0.0.1:62511_ ] o.a.s.c.CoreDescriptor Created CoreDescriptor: {name=collection1, config=solrconfig.xml, transient=false, schema=schema.xml, loadOnStartup=true, configSetProperties=configsetprops.json, collection=tmp_collection, coreNodeName=, dataDir=data\, shard=}
[junit4] 2> 1893626 INFO (TEST-CdcrVersionReplicationTest.testCdcrDocVersions-seed#[BF365ADBD2B9C69B]) [n:127.0.0.1:62511_ ] o.a.s.c.CorePropertiesLocator Found core collection1 in C:\Users\jenkins\workspace\Lucene-Solr-master-Windows\solr\build\solr-core\test\J0\temp\solr.cloud.CdcrVersionReplicationTest_BF365ADBD2B9C69B-001\jetty-001\cores\collection1
[junit4] 2> 1893626 INFO (TEST-CdcrVersionReplicationTest.testCdcrDocVersions-seed#[BF365ADBD2B9C69B]) [n:127.0.0.1:62511_ ] o.a.s.c.CorePropertiesLocator Found 1 core definitions
[junit4] 2> 1893627 INFO (coreLoadExecutor-7656-thread-1-processing-n:127.0.0.1:62511_) [n:127.0.0.1:62511_ c:tmp_collection x:collection1] o.a.s.c.ZkController publishing state=down
[junit4] 2> 1893627 INFO (TEST-CdcrVersionReplicationTest.testCdcrDocVersions-seed#[BF365ADBD2B9C69B]) [n:127.0.0.1:62511_ ] o.a.s.s.SolrDispatchFilter user.dir=C:\Users\jenkins\workspace\Lucene-Solr-master-Windows\solr\build\solr-core\test\J0
[junit4] 2> 1893627 INFO (TEST-CdcrVersionReplicationTest.testCdcrDocVersions-seed#[BF365ADBD2B9C69B]) [n:127.0.0.1:62511_ ] o.a.s.s.SolrDispatchFilter SolrDispatchFilter.init() done
[junit4] 2> 1893627 INFO (coreLoadExecutor-7656-thread-1-processing-n:127.0.0.1:62511_) [n:127.0.0.1:62511_ c:tmp_collection x:collection1] o.a.s.c.ZkController numShards not found on descriptor - reading it from system property
[junit4] 2> 1893630 INFO (coreLoadExecutor-7656-thread-1-processing-n:127.0.0.1:62511_) [n:127.0.0.1:62511_ c:tmp_collection x:collection1] o.a.s.c.ZkController Collection tmp_collection not visible yet, but flagging it so a watch is registered when it becomes visible
[junit4] 2> 1893632 INFO (OverseerStateUpdate-96158281170747396-127.0.0.1:62511_-n_0000000000) [n:127.0.0.1:62511_ ] o.a.s.c.Overseer processMessage: queueSize: 1, message = {
[junit4] 2> "core":"collection1",
[junit4] 2> "roles":null,
[junit4] 2> "base_url":"http://127.0.0.1:62511",
[junit4] 2> "node_name":"127.0.0.1:62511_",
[junit4] 2> "numShards":"2",
[junit4] 2> "state":"down",
[junit4] 2> "shard":null,
[junit4] 2> "collection":"tmp_collection",
[junit4] 2> "operation":"state"} current state version: 0
[junit4] 2> 1893632 INFO (OverseerStateUpdate-96158281170747396-127.0.0.1:62511_-n_0000000000) [n:127.0.0.1:62511_ ] o.a.s.c.o.ReplicaMutator Update state numShards=2 message={
[junit4] 2> "core":"collection1",
[junit4] 2> "roles":null,
[junit4] 2> "base_url":"http://127.0.0.1:62511",
[junit4] 2> "node_name":"127.0.0.1:62511_",
[junit4] 2> "numShards":"2",
[junit4] 2> "state":"down",
[junit4] 2> "shard":null,
[junit4] 2> "collection":"tmp_collection",
[junit4] 2> "operation":"state"}
[junit4] 2> 1893632 INFO (OverseerStateUpdate-96158281170747396-127.0.0.1:62511_-n_0000000000) [n:127.0.0.1:62511_ ] o.a.s.c.o.ClusterStateMutator building a new cName: tmp_collection
[junit4] 2> 1893632 INFO (OverseerStateUpdate-96158281170747396-127.0.0.1:62511_-n_0000000000) [n:127.0.0.1:62511_ ] o.a.s.c.o.ReplicaMutator Assigning new node to shard shard=shard2
[junit4] 2> 1893632 INFO (coreLoadExecutor-7656-thread-1-processing-n:127.0.0.1:62511_) [n:127.0.0.1:62511_ c:tmp_collection x:collection1] o.a.s.c.c.ZkStateReader Deleting data for [tmp_collection]
[junit4] 2> 1893635 INFO (zkCallback-8577-thread-1-processing-n:127.0.0.1:62511_) [n:127.0.0.1:62511_ ] o.a.s.c.c.ZkStateReader A cluster state change: [WatchedEvent state:SyncConnected type:NodeDataChanged path:/clusterstate.json], has occurred - updating... (live nodes size: [1])
[junit4] 2> 1893635 INFO (coreLoadExecutor-7656-thread-1-processing-n:127.0.0.1:62511_) [n:127.0.0.1:62511_ c:tmp_collection x:collection1] o.a.s.c.ZkController look for our core node name
[junit4] 2> 1894637 INFO (coreLoadExecutor-7656-thread-1-processing-n:127.0.0.1:62511_) [n:127.0.0.1:62511_ c:tmp_collection x:collection1] o.a.s.c.ZkController waiting to find shard id in clusterstate for collection1
[junit4] 2> 1894637 INFO (coreLoadExecutor-7656-thread-1-processing-n:127.0.0.1:62511_) [n:127.0.0.1:62511_ c:tmp_collection x:collection1] o.a.s.c.ZkController Check for collection zkNode:tmp_collection
[junit4] 2> 1894638 INFO (coreLoadExecutor-7656-thread-1-processing-n:127.0.0.1:62511_) [n:127.0.0.1:62511_ c:tmp_collection x:collection1] o.a.s.c.ZkController Creating collection in ZooKeeper:tmp_collection
[junit4] 2> 1894638 INFO (coreLoadExecutor-7656-thread-1-processing-n:127.0.0.1:62511_) [n:127.0.0.1:62511_ c:tmp_collection x:collection1] o.a.s.c.ZkController Looking for collection configName
[junit4] 2> 1894639 INFO (coreLoadExecutor-7656-thread-1-processing-n:127.0.0.1:62511_) [n:127.0.0.1:62511_ c:tmp_collection x:collection1] o.a.s.c.ZkController Only one config set found in zk - using it:conf1
[junit4] 2> 1894639 INFO (coreLoadExecutor-7656-thread-1-processing-n:127.0.0.1:62511_) [n:127.0.0.1:62511_ c:tmp_collection x:collection1] o.a.s.c.c.SolrZkClient makePath: /collections/tmp_collection
[junit4] 2> 1894642 INFO (zkCallback-8577-thread-1-processing-n:127.0.0.1:62511_) [n:127.0.0.1:62511_ ] o.a.s.c.c.ZkStateReader A collections change: [WatchedEvent state:SyncConnected type:NodeChildrenChanged path:/collections], has occurred - updating...
[junit4] 2> 1894643 INFO (coreLoadExecutor-7656-thread-1-processing-n:127.0.0.1:62511_) [n:127.0.0.1:62511_ c:tmp_collection x:collection1] o.a.s.c.c.ZkStateReader Load collection config from: [/collections/tmp_collection]
[junit4] 2> 1894644 INFO (coreLoadExecutor-7656-thread-1-processing-n:127.0.0.1:62511_) [n:127.0.0.1:62511_ c:tmp_collection x:collection1] o.a.s.c.c.ZkStateReader path=[/collections/tmp_collection] [configName]=[conf1] specified config exists in ZooKeeper
[junit4] 2> 1894645 INFO (coreLoadExecutor-7656-thread-1-processing-n:127.0.0.1:62511_) [n:127.0.0.1:62511_ c:tmp_collection x:collection1] o.a.s.c.SolrResourceLoader new SolrResourceLoader for directory: 'C:\Users\jenkins\workspace\Lucene-Solr-master-Windows\solr\build\solr-core\test\J0\temp\solr.cloud.CdcrVersionReplicationTest_BF365ADBD2B9C69B-001\jetty-001\cores\collection1'
[junit4] 2> 1894645 INFO (coreLoadExecutor-7656-thread-1-processing-n:127.0.0.1:62511_) [n:127.0.0.1:62511_ c:tmp_collection x:collection1] o.a.s.c.SolrResourceLoader JNDI not configured for solr (NoInitialContextEx)
[junit4] 2> 1894645 INFO (coreLoadExecutor-7656-thread-1-processing-n:127.0.0.1:62511_) [n:127.0.0.1:62511_ c:tmp_collection x:collection1] o.a.s.c.SolrResourceLoader solr home defaulted to 'solr/' (could not find system property or JNDI)
[junit4] 2> 1894652 INFO (coreLoadExecutor-7656-thread-1-processing-n:127.0.0.1:62511_) [n:127.0.0.1:62511_ c:tmp_collection x:collection1] o.a.s.c.Config loaded config solrconfig.xml with version 0
[junit4] 2> 1894667 INFO (coreLoadExecutor-7656-thread-1-processing-n:127.0.0.1:62511_) [n:127.0.0.1:62511_ c:tmp_collection x:collection1] o.a.s.c.SolrConfig current version of requestparams : -1
[junit4] 2> 1894673 WARN (coreLoadExecutor-7656-thread-1-processing-n:127.0.0.1:62511_) [n:127.0.0.1:62511_ c:tmp_collection x:collection1] o.a.s.c.Config Beginning with Solr 5.5, <mergePolicy> is deprecated, use <mergePolicyFactory> instead.
[junit4] 2> 1894673 INFO (coreLoadExecutor-7656-thread-1-processing-n:127.0.0.1:62511_) [n:127.0.0.1:62511_ c:tmp_collection x:collection1] o.a.s.c.SolrConfig Using Lucene MatchVersion: 7.0.0
[junit4] 2> 1894680 INFO (coreLoadExecutor-7656-thread-1-processing-n:127.0.0.1:62511_) [n:127.0.0.1:62511_ c:tmp_collection x:collection1] o.a.s.c.SolrConfig Loaded SolrConfig: solrconfig.xml
[junit4] 2> 1894692 INFO (coreLoadExecutor-7656-thread-1-processing-n:127.0.0.1:62511_) [n:127.0.0.1:62511_ c:tmp_collection x:collection1] o.a.s.s.IndexSchema [collection1] Schema name=test
[junit4] 2> 1894787 INFO (coreLoadExecutor-7656-thread-1-processing-n:127.0.0.1:62511_) [n:127.0.0.1:62511_ c:tmp_collection x:collection1] o.a.s.s.IndexSchema default search field in schema is text
[junit4] 2> 1894788 INFO (coreLoadExecutor-7656-thread-1-processing-n:127.0.0.1:62511_) [n:127.0.0.1:62511_ c:tmp_collection x:collection1] o.a.s.s.IndexSchema unique key field: id
[junit4] 2> 1894788 INFO (coreLoadExecutor-7656-thread-1-processing-n:127.0.0.1:62511_) [n:127.0.0.1:62511_ c:tmp_collection x:collection1] o.a.s.s.FileExchangeRateProvider Reloading exchange rates from file currency.xml
[junit4] 2> 1894795 INFO (coreLoadExecutor-7656-thread-1-processing-n:127.0.0.1:62511_) [n:127.0.0.1:62511_ c:tmp_collection x:collection1] o.a.s.s.FileExchangeRateProvider Reloading exchange rates from file currency.xml
[junit4] 2> 1894844 INFO (coreLoadExecutor-7656-thread-1-processing-n:127.0.0.1:62511_) [n:127.0.0.1:62511_ c:tmp_collection x:collection1] o.a.s.c.ConfigSetProperties Did not find ConfigSet properties, assuming default properties: Can't find resource 'configsetprops.json' in classpath or '/configs/conf1', cwd=C:\Users\jenkins\workspace\Lucene-Solr-master-Windows\solr\build\solr-core\test\J0
[junit4] 2> 1894844 INFO (coreLoadExecutor-7656-thread-1-processing-n:127.0.0.1:62511_) [n:127.0.0.1:62511_ c:tmp_collection x:collection1] o.a.s.c.CoreContainer Creating SolrCore 'collection1' using configuration from collection tmp_collection
[junit4] 2> 1894845 INFO (coreLoadExecutor-7656-thread-1-processing-n:127.0.0.1:62511_) [n:127.0.0.1:62511_ c:tmp_collection s:shard2 r:core_node1 x:collection1] o.a.s.c.SolrCore org.apache.solr.core.MockDirectoryFactory
[junit4] 2> 1894845 INFO (coreLoadExecutor-7656-thread-1-processing-n:127.0.0.1:62511_) [n:127.0.0.1:62511_ c:tmp_collection s:shard2 r:core_node1 x:collection1] o.a.s.c.SolrCore [[collection1] ] Opening new SolrCore at [C:\Users\jenkins\workspace\Lucene-Solr-master-Windows\solr\build\solr-core\test\J0\temp\solr.cloud.CdcrVersionReplicationTest_BF365ADBD2B9C69B-001\jetty-001\cores\collection1], dataDir=[C:\Users\jenkins\workspace\Lucene-Solr-master-Windows\solr\build\solr-core\test\J0\temp\solr.cloud.CdcrVersionReplicationTest_BF365ADBD2B9C69B-001\jetty-001\cores\collection1\data\]
[junit4] 2> 1894845 INFO (coreLoadExecutor-7656-thread-1-processing-n:127.0.0.1:62511_) [n:127.0.0.1:62511_ c:tmp_collection s:shard2 r:core_node1 x:collection1] o.a.s.c.JmxMonitoredMap JMX monitoring is enabled. Adding Solr mbeans to JMX Server: com.sun.jmx.mbeanserver.JmxMBeanServer@108a40a
[junit4] 2> 1894846 INFO (coreLoadExecutor-7656-thread-1-processing-n:127.0.0.1:62511_) [n:127.0.0.1:62511_ c:tmp_collection s:shard2 r:core_node1 x:collection1] o.a.s.c.CachingDirectoryFactory return new directory for C:\Users\jenkins\workspace\Lucene-Solr-master-Windows\solr\build\solr-core\test\J0\temp\solr.cloud.CdcrVersionReplicationTest_BF365ADBD2B9C69B-001\jetty-001\cores\collection1\data\
[junit4] 2> 1894847 INFO (coreLoadExecutor-7656-thread-1-processing-n:127.0.0.1:62511_) [n:127.0.0.1:62511_ c:tmp_collection s:shard2 r:core_node1 x:collection1] o.a.s.c.SolrCore New index directory detected: old=null new=C:\Users\jenkins\workspace\Lucene-Solr-master-Windows\solr\build\solr-core\test\J0\temp\solr.cloud.CdcrVersionReplicationTest_BF365ADBD2B9C69B-001\jetty-001\cores\collection1\data\index/
[junit4] 2> 1894847 WARN (coreLoadExecutor-7656-thread-1-processing-n:127.0.0.1:62511_) [n:127.0.0.1:62511_ c:tmp_collection s:shard2 r:core_node1 x:collection1] o.a.s.c.SolrCore [collection1] Solr index directory 'C:\Users\jenkins\workspace\Lucene-Solr-master-Windows\solr\build\solr-core\test\J0\temp\solr.cloud.CdcrVersionReplicationTest_BF365ADBD2B9C69B-001\jetty-001\cores\collection1\data\index' doesn't exist. Creating new index...
[junit4] 2> 1894847 INFO (coreLoadExecutor-7656-thread-1-processing-n:127.0.0.1:62511_) [n:127.0.0.1:62511_ c:tmp_collection s:shard2 r:core_node1 x:collection1] o.a.s.c.CachingDirectoryFactory return new directory for C:\Users\jenkins\workspace\Lucene-Solr-master-Windows\solr\build\solr-core\test\J0\temp\solr.cloud.CdcrVersionReplicationTest_BF365ADBD2B9C69B-001\jetty-001\cores\collection1\data\index
[junit4] 2> 1894847 INFO (coreLoadExecutor-7656-thread-1-processing-n:127.0.0.1:62511_) [n:127.0.0.1:62511_ c:tmp_collection s:shard2 r:core_node1 x:collection1] o.a.s.u.RandomMergePolicy RandomMergePolicy wrapping class org.apache.lucene.index.LogDocMergePolicy: [LogDocMergePolicy: minMergeSize=1000, mergeFactor=29, maxMergeSize=9223372036854775807, maxMergeSizeForForcedMerge=9223372036854775807, calibrateSizeByDeletes=false, maxMergeDocs=2147483647, maxCFSSegmentSizeMB=8.796093022207999E12, noCFSRatio=0.0]
[junit4] 2> 1894849 INFO (coreLoadExecutor-7656-thread-1-processing-n:127.0.0.1:62511_) [n:127.0.0.1:62511_ c:tmp_collection s:shard2 r:core_node1 x:collection1] o.a.s.c.SolrDeletionPolicy SolrDeletionPolicy.onCommit: commits: num=1
[junit4] 2> commit{dir=MockDirectoryWrapper(RAMDirectory@d9d06f lockFactory=org.apache.lucene.store.SingleInstanceLockFactory@16116a4),segFN=segments_1,generation=1}
[junit4] 2> 1894849 INFO (coreLoadExecutor-7656-thread-1-processing-n:127.0.0.1:62511_) [n:127.0.0.1:62511_ c:tmp_collection s:shard2 r:core_node1 x:collection1] o.a.s.c.SolrDeletionPolicy newest commit generation = 1
[junit4] 2> 1894849 INFO (OldIndexDirectoryCleanupThreadForCore-collection1) [n:127.0.0.1:62511_ c:tmp_collection s:shard2 r:core_node1 x:collection1] o.a.s.c.SolrCore Looking for old index directories to cleanup for core collection1 in C:\Users\jenkins\workspace\Lucene-Solr-master-Windows\solr\build\solr-core\test\J0\temp\solr.cloud.CdcrVersionReplicationTest_BF365ADBD2B9C69B-001\jetty-001\cores\collection1\data\
[junit4] 2> 1894851 WARN (OldIndexDirectoryCleanupThreadForCore-collection1) [n:127.0.0.1:62511_ c:tmp_collection s:shard2 r:core_node1 x:collection1] o.a.s.c.DirectoryFactory C:\Users\jenkins\workspace\Lucene-Solr-master-Windows\solr\build\solr-core\test\J0\temp\solr.cloud.CdcrVersionReplicationTest_BF365ADBD2B9C69B-001\jetty-001\cores\collection1\data\ does not point to a valid data directory; skipping clean-up of old index directories.
[junit4] 2> 1894857 INFO (coreLoadExecutor-7656-thread-1-processing-n:127.0.0.1:62511_) [n:127.0.0.1:62511_ c:tmp_collection s:shard2 r:core_node1 x:collection1] o.a.s.u.p.UpdateRequestProcessorChain creating updateRequestProcessorChain "cdcr-processor-chain"
[junit4] 2> 1894941 INFO (coreLoadExecutor-7656-thread-1-processing-n:127.0.0.1:62511_) [n:127.0.0.1:62511_ c:tmp_collection s:shard2 r:core_node1 x:collection1] o.a.s.c.SolrCore no updateRequestProcessorChain defined as default, creating implicit default
[junit4] 2> 1894951 INFO (coreLoadExecutor-7656-thread-1-processing-n:127.0.0.1:62511_) [n:127.0.0.1:62511_ c:tmp_collection s:shard2 r:core_node1 x:collection1] o.a.s.h.l.XMLLoader xsltCacheLifetimeSeconds=60
[junit4] 2> 1894953 INFO (coreLoadExecutor-7656-thread-1-processing-n:127.0.0.1:62511_) [n:127.0.0.1:62511_ c:tmp_collection s:shard2 r:core_node1 x:collection1] o.a.s.h.l.XMLLoader xsltCacheLifetimeSeconds=60
[junit4] 2> 1894954 INFO (coreLoadExecutor-7656-thread-1-processing-n:127.0.0.1:62511_) [n:127.0.0.1:62511_ c:tmp_collection s:shard2 r:core_node1 x:collection1] o.a.s.h.l.XMLLoader xsltCacheLifetimeSeconds=60
[junit4] 2> 1894956 INFO (coreLoadExecutor-7656-thread-1-processing-n:127.0.0.1:62511_) [n:127.0.0.1:62511_ c:tmp_collection s:shard2 r:core_node1 x:collection1] o.a.s.h.l.XMLLoader xsltCacheLifetimeSeconds=60
[junit4] 2> 1895004 INFO (coreLoadExecutor-7656-thread-1-processing-n:127.0.0.1:62511_) [n:127.0.0.1:62511_ c:tmp_collection s:shard2 r:core_node1 x:collection1] o.a.s.c.RequestHandlers Registered paths: /admin/mbeans,standard,/update/json/docs,/admin/luke,/export,/get,/admin/properties,/update/json,/admin/threads,/update/csv,/sql,/graph,/admin/segments,/admin/system,/replication,/config,/stream,/schema,/admin/plugins,/admin/logging,/admin/ping,/cdcr,/update,/admin/file
[junit4] 2> 1895004 INFO (coreLoadExecutor-7656-thread-1-processing-n:127.0.0.1:62511_) [n:127.0.0.1:62511_ c:tmp_collection s:shard2 r:core_node1 x:collection1] o.a.s.c.SolrCore Using default statsCache cache: org.apache.solr.search.stats.LocalStatsCache
[junit4] 2> 1895051 INFO (coreLoadExecutor-7656-thread-1-processing-n:127.0.0.1:62511_) [n:127.0.0.1:62511_ c:tmp_collection s:shard2 r:core_node1 x:collection1] o.a.s.u.UpdateHandler Using UpdateLog implementation: org.apache.solr.update.CdcrUpdateLog
[junit4] 2> 1895052 INFO (coreLoadExecutor-7656-thread-1-processing-n:127.0.0.1:62511_) [n:127.0.0.1:62511_ c:tmp_collection s:shard2 r:core_node1 x:collection1] o.a.s.u.UpdateLog Initializing UpdateLog: dataDir= defaultSyncLevel=FLUSH numRecordsToKeep=100 maxNumLogsToKeep=10 numVersionBuckets=65536
[junit4] 2> 1895054 INFO (coreLoadExecutor-7656-thread-1-processing-n:127.0.0.1:62511_) [n:127.0.0.1:62511_ c:tmp_collection s:shard2 r:core_node1 x:collection1] o.a.s.u.CommitTracker Hard AutoCommit: disabled
[junit4] 2> 1895054 INFO (coreLoadExecutor-7656-thread-1-processing-n:127.0.0.1:62511_) [n:127.0.0.1:62511_ c:tmp_collection s:shard2 r:core_node1 x:collection1] o.a.s.u.CommitTracker Soft AutoCommit: disabled
[junit4] 2> 1895055 INFO (coreLoadExecutor-7656-thread-1-processing-n:127.0.0.1:62511_) [n:127.0.0.1:62511_ c:tmp_collection s:shard2 r:core_node1 x:collection1] o.a.s.u.RandomMergePolicy RandomMergePolicy wrapping class org.apache.lucene.index.LogDocMergePolicy: [LogDocMergePolicy: minMergeSize=1000, mergeFactor=20, maxMergeSize=9223372036854775807, maxMergeSizeForForcedMerge=9223372036854775807, calibrateSizeByDeletes=false, maxMergeDocs=2147483647, maxCFSSegmentSizeMB=8.796093022207999E12, noCFSRatio=1.0]
[junit4] 2> 1895057 INFO (coreLoadExecutor-7656-thread-1-processing-n:127.0.0.1:62511_) [n:127.0.0.1:62511_ c:tmp_collection s:shard2 r:core_node1 x:collection1] o.a.s.c.SolrDeletionPolicy SolrDeletionPolicy.onInit: commits: num=1
[junit4] 2> commit{dir=MockDirectoryWrapper(RAMDirectory@d9d06f lockFactory=org.apache.lucene.store.SingleInstanceLockFactory@16116a4),segFN=segments_1,generation=1}
[junit4] 2> 1895057 INFO (coreLoadExecutor-7656-thread-1-processing-n:127.0.0.1:62511_) [n:127.0.0.1:62511_ c:tmp_collection s:shard2 r:core_node1 x:collection1] o.a.s.c.SolrDeletionPolicy newest commit generation = 1
[junit4] 2> 1895057 INFO (coreLoadExecutor-7656-thread-1-processing-n:127.0.0.1:62511_) [n:127.0.0.1:62511_ c:tmp_collection s:shard2 r:core_node1 x:collection1] o.a.s.s.SolrIndexSearcher Opening [Searcher@1d6a938[collection1] main]
[junit4] 2> 1895057 INFO (coreLoadExecutor-7656-thread-1-processing-n:127.0.0.1:62511_) [n:127.0.0.1:62511_ c:tmp_collection s:shard2 r:core_node1 x:collection1] o.a.s.c.c.ZkStateReader Load collection config from: [/collections/tmp_collection]
[junit4] 2> 1895059 INFO (coreLoadExecutor-7656-thread-1-processing-n:127.0.0.1:62511_) [n:127.0.0.1:62511_ c:tmp_collection s:shard2 r:core_node1 x:collection1] o.a.s.c.c.ZkStateReader path=[/collections/tmp_collection] [configName]=[conf1] specified config exists in ZooKeeper
[junit4] 2> 1895059 INFO (coreLoadExecutor-7656-thread-1-processing-n:127.0.0.1:62511_) [n:127.0.0.1:62511_ c:tmp_collection s:shard2 r:core_node1 x:collection1] o.a.s.r.ManagedResourceStorage Setting up ZooKeeper-based storage for the RestManager with znodeBase: /configs/conf1
[junit4] 2> 1895060 INFO (coreLoadExecutor-7656-thread-1-processing-n:127.0.0.1:62511_) [n:127.0.0.1:62511_ c:tmp_collection s:shard2 r:core_node1 x:collection1] o.a.s.r.ManagedResourceStorage Configured ZooKeeperStorageIO with znodeBase: /configs/conf1
[junit4] 2> 1895060 INFO (coreLoadExecutor-7656-thread-1-processing-n:127.0.0.1:62511_) [n:127.0.0.1:62511_ c:tmp_collection s:shard2 r:core_node1 x:collection1] o.a.s.r.RestManager Initializing RestManager with initArgs: {}
[junit4] 2> 1895060 INFO (coreLoadExecutor-7656-thread-1-processing-n:127.0.0.1:62511_) [n:127.0.0.1:62511_ c:tmp_collection s:shard2 r:core_node1 x:collection1] o.a.s.r.ManagedResourceStorage Reading _rest_managed.json using ZooKeeperStorageIO:path=/configs/conf1
[junit4] 2> 1895061 INFO (coreLoadExecutor-7656-thread-1-processing-n:127.0.0.1:62511_) [n:127.0.0.1:62511_ c:tmp_collection s:shard2 r:core_node1 x:collection1] o.a.s.r.ManagedResourceStorage No data found for znode /configs/conf1/_rest_managed.json
[junit4] 2> 1895061 INFO (coreLoadExecutor-7656-thread-1-processing-n:127.0.0.1:62511_) [n:127.0.0.1:62511_ c:tmp_collection s:shard2 r:core_node1 x:collection1] o.a.s.r.ManagedResourceStorage Loaded null at path _rest_managed.json using ZooKeeperStorageIO:path=/configs/conf1
[junit4] 2> 1895061 INFO (coreLoadExecutor-7656-thread-1-processing-n:127.0.0.1:62511_) [n:127.0.0.1:62511_ c:tmp_collection s:shard2 r:core_node1 x:collection1] o.a.s.r.RestManager Initializing 0 registered ManagedResources
[junit4] 2> 1895061 INFO (coreLoadExecutor-7656-thread-1-processing-n:127.0.0.1:62511_) [n:127.0.0.1:62511_ c:tmp_collection s:shard2 r:core_node1 x:collection1] o.a.s.h.ReplicationHandler Commits will be reserved for 10000
[junit4] 2> 1895076 INFO (coreLoadExecutor-7656-thread-1-processing-n:127.0.0.1:62511_) [n:127.0.0.1:62511_ c:tmp_collection s:shard2 r:core_node1 x:collection1] o.a.s.c.c.SolrZkClient makePath: /collections/tmp_collection/cdcr/state
[junit4] 2> 1895088 INFO (coreLoadExecutor-7656-thread-1-processing-n:127.0.0.1:62511_) [n:127.0.0.1:62511_ c:tmp_collection s:shard2 r:core_node1 x:collection1] o.a.s.h.CdcrBufferStateManager Created znode /collections/tmp_collection/cdcr/state/buffer
[junit4] 2> 1895102 INFO (coreLoadExecutor-7656-thread-1-processing-n:127.0.0.1:62511_) [n:127.0.0.1:62511_ c:tmp_collection s:shard2 r:core_node1 x:collection1] o.a.s.h.CdcrProcessStateManager Created znode /collections/tmp_collection/cdcr/state/process
[junit4] 2> 1895169 INFO (searcherExecutor-7657-thread-1-processing-n:127.0.0.1:62511_ x:collection1 s:shard2 c:tmp_collection r:core_node1) [n:127.0.0.1:62511_ c:tmp_collection s:shard2 r:core_node1 x:collection1] o.a.s.c.SolrCore [collection1] Registered new searcher Searcher@1d6a938[collection1] main{ExitableDirectoryReader(UninvertingDirectoryReader())}
[junit4] 2> 1895169 INFO (coreLoadExecutor-7656-thread-1-processing-n:127.0.0.1:62511_) [n:127.0.0.1:62511_ c:tmp_collection s:shard2 r:core_node1 x:collection1] o.a.s.u.UpdateLog Looking up max value of version field to seed version buckets
[junit4] 2> 1895170 INFO (coreLoadExecutor-7656-thread-1-processing-n:127.0.0.1:62511_) [n:127.0.0.1:62511_ c:tmp_collection s:shard2 r:core_node1 x:collection1] o.a.s.u.VersionInfo Refreshing highest value of _version_ for 65536 version buckets from index
[junit4] 2> 1895170 INFO (coreLoadExecutor-7656-thread-1-processing-n:127.0.0.1:62511_) [n:127.0.0.1:62511_ c:tmp_collection s:shard2 r:core_node1 x:collection1] o.a.s.u.VersionInfo No terms found for _version_, cannot seed version bucket highest value from index
[junit4] 2> 1895170 INFO (coreLoadExecutor-7656-thread-1-processing-n:127.0.0.1:62511_) [n:127.0.0.1:62511_ c:tmp_collection s:shard2 r:core_node1 x:collection1] o.a.s.u.UpdateLog Could not find max version in index or recent updates, using new clock 1538532501455110144
[junit4] 2> 1895171 INFO (coreLoadExecutor-7656-thread-1-processing-n:127.0.0.1:62511_) [n:127.0.0.1:62511_ c:tmp_collection s:shard2 r:core_node1 x:collection1] o.a.s.u.UpdateLog Took 2.0ms to seed version buckets with highest version 1538532501455110144
[junit4] 2> 1895171 INFO (coreLoadExecutor-7656-thread-1-processing-n:127.0.0.1:62511_) [n:127.0.0.1:62511_ c:tmp_collection s:shard2 r:core_node1 x:collection1] o.a.s.c.ZkController watch zkdir /configs/conf1
[junit4] 2> 1895172 INFO (coreLoadExecutor-7656-thread-1-processing-n:127.0.0.1:62511_) [n:127.0.0.1:62511_ c:tmp_collection s:shard2 r:core_node1 x:collection1] o.a.s.c.CoreContainer registering core: collection1
[junit4] 2> 1895174 INFO (coreZkRegister-7650-thread-1-processing-n:127.0.0.1:62511_ x:collection1 s:shard2 c:tmp_collection r:core_node1) [n:127.0.0.1:62511_ c:tmp_collection s:shard2 r:core_node1 x:collection1] o.a.s.c.ZkController Register replica - core:collection1 address:http://127.0.0.1:62511 collection:tmp_collection shard:shard2
[junit4] 2> 1895177 INFO (coreZkRegister-7650-thread-1-processing-n:127.0.0.1:62511_ x:collection1 s:shard2 c:tmp_collection r:core_node1) [n:127.0.0.1:62511_ c:tmp_collection s:shard2 r:core_node1 x:collection1] o.a.s.c.c.SolrZkClient makePath: /collections/tmp_collection/leader_elect/shard2/election
[junit4] 2> 1895190 INFO (coreZkRegister-7650-thread-1-processing-n:127.0.0.1:62511_ x:collection1 s:shard2 c:tmp_collection r:core_node1) [n:127.0.0.1:62511_ c:tmp_collection s:shard2 r:core_node1 x:collection1] o.a.s.c.LeaderElector Joined leadership election with path: /collections/tmp_collection/leader_elect/shard2/election/96158281170747396-core_node1-n_0000000000
[junit4] 2> 1895193 INFO (coreZkRegister-7650-thread-1-processing-n:127.0.0.1:62511_ x:collection1 s:shard2 c:tmp_collection r:core_node1) [n:127.0.0.1:62511_ c:tmp_collection s:shard2 r:core_node1 x:collection1] o.a.s.c.ShardLeaderElectionContext Running the leader process for shard=shard2 and weAreReplacement=false and leaderVoteWait=10000
[junit4] 2> 1895197 INFO (coreZkRegister-7650-thread-1-processing-n:127.0.0.1:62511_ x:collection1 s:shard2 c:tmp_collection r:core_node1) [n:127.0.0.1:62511_ c:tmp_collection s:shard2 r:core_node1 x:collection1] o.a.s.c.ShardLeaderElectionContext Enough replicas found to continue.
[junit4] 2> 1895197 INFO (coreZkRegister-7650-thread-1-processing-n:127.0.0.1:62511_ x:collection1 s:shard2 c:tmp_collection r:core_node1) [n:127.0.0.1:62511_ c:tmp_collection s:shard2 r:core_node1 x:collection1] o.a.s.c.ShardLeaderElectionContext I may be the new leader - try and sync
[junit4] 2> 1895197 INFO (coreZkRegister-7650-thread-1-processing-n:127.0.0.1:62511_ x:collection1 s:shard2 c:tmp_collection r:core_node1) [n:127.0.0.1:62511_ c:tmp_collection s:shard2 r:core_node1 x:collection1] o.a.s.c.SyncStrategy Sync replicas to http://127.0.0.1:62511/collection1/
[junit4] 2> 1895197 INFO (coreZkRegister-7650-thread-1-processing-n:127.0.0.1:62511_ x:collection1 s:shard2 c:tmp_collection r:core_node1) [n:127.0.0.1:62511_ c:tmp_collection s:shard2 r:core_node1 x:collection1] o.a.s.c.SyncStrategy Sync Success - now sync replicas to me
[junit4] 2> 1895197 INFO (coreZkRegister-7650-thread-1-processing-n:127.0.0.1:62511_ x:collection1 s:shard2 c:tmp_collection r:core_node1) [n:127.0.0.1:62511_ c:tmp_collection s:shard2 r:core_node1 x:collection1] o.a.s.c.SyncStrategy http://127.0.0.1:62511/collection1/ has no replicas
[junit4] 2> 1895197 INFO (OverseerStateUpdate-96158281170747396-127.0.0.1:62511_-n_0000000000) [n:127.0.0.1:62511_ ] o.a.s.c.Overseer processMessage: queueSize: 1, message = {
[junit4] 2> "operation":"leader",
[junit4] 2> "shard":"shard2",
[junit4] 2> "collection":"tmp_collection"} current state version: 1
[junit4] 2> 1895201 INFO (coreZkRegister-7650-thread-1-processing-n:127.0.0.1:62511_ x:collection1 s:shard2 c:tmp_collection r:core_node1) [n:127.0.0.1:62511_ c:tmp_collection s:shard2 r:core_node1 x:collection1] o.a.s.c.c.SolrZkClient makePath: /collections/tmp_collection/leaders/shard2
[junit4] 2> 1895203 INFO (zkCallback-8577-thread-1-processing-n:127.0.0.1:62511_) [n:127.0.0.1:62511_ ] o.a.s.c.c.ZkStateReader A cluster state change: [WatchedEvent state:SyncConnected type:NodeDataChanged path:/clusterstate.json], has occurred - updating... (live nodes size: [1])
[junit4] 2> 1895208 INFO (coreZkRegister-7650-thread-1-processing-n:127.0.0.1:62511_ x:collection1 s:shard2 c:tmp_collection r:core_node1) [n:127.0.0.1:62511_ c:tmp_collection s:shard2 r:core_node1 x:collection1] o.a.s.c.ShardLeaderElectionContextBase Creating leader registration node /collections/tmp_collection/leaders/shard2/leader after winning as /collections/tmp_collection/leader_elect/shard2/election/96158281170747396-core_node1-n_0000000000
[junit4] 2> 1895209 INFO (zkCallback-8577-thread-2-processing-n:127.0.0.1:62511_) [n:127.0.0.1:62511_ ] o.a.s.h.CdcrLeaderStateManager Received new leader state @ tmp_collection:shard2
[junit4] 2> 1895215 INFO (coreZkRegister-7650-thread-1-processing-n:127.0.0.1:62511_ x:collection1 s:shard2 c:tmp_collection r:core_node1) [n:127.0.0.1:62511_ c:tmp_collection s:shard2 r:core_node1 x:collection1] o.a.s.c.ShardLeaderElectionContext I am the new leader: http://127.0.0.1:62511/collection1/ shard2
[junit4] 2> 1895217 INFO (OverseerStateUpdate-96158281170747396-127.0.0.1:62511_-n_0000000000) [n:127.0.0.1:62511_ ] o.a.s.c.Overseer processMessage: queueSize: 1, message = {
[junit4] 2> "operation":"leader",
[junit4] 2> "shard":"shard2",
[junit4] 2> "collection":"tmp_collection",
[junit4] 2> "base_url":"http://127.0.0.1:62511",
[junit4] 2> "core":"collection1",
[junit4] 2> "state":"active"} current state version: 2
[junit4] 2> 1895327 INFO (zkCallback-8577-thread-1-processing-n:127.0.0.1:62511_) [n:127.0.0.1:62511_ ] o.a.s.c.c.ZkStateReader A cluster state change: [WatchedEvent state:SyncConnected type:NodeDataChanged path:/clusterstate.json], has occurred - updating... (live nodes size: [1])
[junit4] 2> 1895375 INFO (coreZkRegister-7650-thread-1-processing-n:127.0.0.1:62511_ x:collection1 s:shard2 c:tmp_collection r:core_node1) [n:127.0.0.1:62511_ c:tmp_collection s:shard2 r:core_node1 x:collection1] o.a.s.c.ZkController We are http://127.0.0.1:62511/collection1/ and leader is http://127.0.0.1:62511/collection1/
[junit4] 2> 1895375 INFO (coreZkRegister-7650-thread-1-processing-n:127.0.0.1:62511_ x:collection1 s:shard2 c:tmp_collection r:core_node1) [n:127.0.0.1:62511_ c:tmp_collection s:shard2 r:core_node1 x:collection1] o.a.s.c.ZkController No LogReplay needed for core=collection1 baseURL=http://127.0.0.1:62511
[junit4] 2> 1895375 INFO (coreZkRegister-7650-thread-1-processing-n:127.0.0.1:62511_ x:collection1 s:shard2 c:tmp_collection r:core_node1) [n:127.0.0.1:62511_ c:tmp_collection s:shard2 r:core_node1 x:collection1] o.a.s.c.ZkController I am the leader, no recovery necessary
[junit4] 2> 1895375 INFO (coreZkRegister-7650-thread-1-processing-n:127.0.0.1:62511_ x:collection1 s:shard2 c:tmp_collection r:core_node1) [n:127.0.0.1:62511_ c:tmp_collection s:shard2 r:core_node1 x:collection1] o.a.s.c.ZkController publishing state=active
[junit4] 2> 1895375 INFO (coreZkRegister-7650-thread-1-processing-n:127.0.0.1:62511_ x:collection1 s:shard2 c:tmp_collection r:core_node1) [n:127.0.0.1:62511_ c:tmp_collection s:shard2 r:core_node1 x:collection1] o.a.s.c.ZkController numShards not found on descriptor - reading it from system property
[junit4] 2> 1895385 INFO (OverseerStateUpdate-96158281170747396-127.0.0.1:62511_-n_0000000000) [n:127.0.0.1:62511_ ] o.a.s.c.Overseer processMessage: queueSize: 1, message = {
[junit4] 2> "core":"collection1",
[junit4] 2> "core_node_name":"core_node1",
[junit4] 2> "roles":null,
[junit4] 2> "base_url":"http://127.0.0.1:62511",
[junit4] 2> "node_name":"127.0.0.1:62511_",
[junit4] 2> "numShards":"2",
[junit4] 2> "state":"active",
[junit4] 2> "shard":"shard2",
[junit4] 2> "collection":"tmp_collection",
[junit4] 2> "operation":"state"} current state version: 3
[junit4] 2> 1895385 INFO (OverseerStateUpdate-96158281170747396-127.0.0.1:62511_-n_0000000000) [n:127.0.0.1:62511_ ] o.a.s.c.o.ReplicaMutator Update state numShards=2 message={
[junit4] 2> "core":"collection1",
[junit4] 2> "core_node_name":"core_node1",
[junit4] 2> "roles":null,
[junit4] 2> "base_url":"http://127.0.0.1:62511",
[junit4] 2> "node_name":"127.0.0.1:62511_",
[junit4] 2> "numShards":"2",
[junit4] 2> "state":"active",
[junit4] 2> "shard":"shard2",
[junit4] 2> "collection":"tmp_collection",
[junit4] 2> "operation":"state"}
[junit4] 2> 1895492 INFO (zkCallback-8577-thread-3-processing-n:127.0.0.1:62511_) [n:127.0.0.1:62511_ ] o.a.s.c.c.ZkStateReader A cluster state change: [WatchedEvent state:SyncConnected type:NodeDataChanged path:/clusterstate.json], has occurred - updating... (live nodes size: [1])
[junit4] 2> 1896457 INFO (TEST-CdcrVersionReplicationTest.testCdcrDocVersions-seed#[BF365ADBD2B9C69B]) [ ] o.a.s.SolrTestCaseJ4 Writing core.properties file to C:\Users\jenkins\workspace\Lucene-Solr-master-Windows\solr\build\solr-core\test\J0\temp\solr.cloud.CdcrVersionReplicationTest_BF365ADBD2B9C69B-001\jetty-002\cores\collection1
[junit4] 2> 1896464 INFO (TEST-CdcrVersionReplicationTest.testCdcrDocVersions-seed#[BF365ADBD2B9C69B]) [ ] o.e.j.s.Server jetty-9.3.8.v20160314
[junit4] 2> 1896466 INFO (TEST-CdcrVersionReplicationTest.testCdcrDocVersions-seed#[BF365ADBD2B9C69B]) [ ] o.e.j.s.h.ContextHandler Started o.e.j.s.ServletContextHandler@fec8a7{/,null,AVAILABLE}
[junit4] 2> 1896469 INFO (TEST-CdcrVersionReplicationTest.testCdcrDocVersions-seed#[BF365ADBD2B9C69B]) [ ] o.e.j.s.ServerConnector Started ServerConnector@f0441e{HTTP/1.1,[http/1.1]}{127.0.0.1:62523}
[junit4] 2> 1896469 INFO (TEST-CdcrVersionReplicationTest.testCdcrDocVersions-seed#[BF365ADBD2B9C69B]) [ ] o.e.j.s.Server Started @1905763ms
[junit4] 2> 1896469 INFO (TEST-CdcrVersionReplicationTest.testCdcrDocVersions-seed#[BF365ADBD2B9C69B]) [ ] o.a.s.c.s.e.JettySolrRunner Jetty properties: {shards=shard2, hostContext=/, hostPort=62523, coreRootDirectory=C:\Users\jenkins\workspace\Lucene-Solr-master-Windows\solr\build\solr-core\test\J0\temp\solr.cloud.CdcrVersionReplicationTest_BF365ADBD2B9C69B-001\jetty-002\cores}
[junit4] 2> 1896469 INFO (TEST-CdcrVersionReplicationTest.testCdcrDocVersions-seed#[BF365ADBD2B9C69B]) [ ] o.a.s.s.SolrDispatchFilter SolrDispatchFilter.init(): sun.misc.Launcher$AppClassLoader@1d16e93
[junit4] 2> 1896469 INFO (TEST-CdcrVersionReplicationTest.testCdcrDocVersions-seed#[BF365ADBD2B9C69B]) [ ] o.a.s.c.SolrResourceLoader new SolrResourceLoader for directory: 'C:\Users\jenkins\workspace\Lucene-Solr-master-Windows\solr\build\solr-core\test\J0\temp\solr.cloud.CdcrVersionReplicationTest_BF365ADBD2B9C69B-001\jetty-002'
[junit4] 2> 1896470 INFO (TEST-CdcrVersionReplicationTest.testCdcrDocVersions-seed#[BF365ADBD2B9C69B]) [ ] o.a.s.c.SolrResourceLoader JNDI not configured for solr (NoInitialContextEx)
[junit4] 2> 1896470 INFO (TEST-CdcrVersionReplicationTest.testCdcrDocVersions-seed#[BF365ADBD2B9C69B]) [ ] o.a.s.c.SolrResourceLoader solr home defaulted to 'solr/' (could not find system property or JNDI)
[junit4] 2> 1896475 INFO (TEST-CdcrVersionReplicationTest.testCdcrDocVersions-seed#[BF365ADBD2B9C69B]) [ ] o.a.s.c.c.SolrZkClient Using default ZkCredentialsProvider
[junit4] 2> 1896476 INFO (TEST-CdcrVersionReplicationTest.testCdcrDocVersions-seed#[BF365ADBD2B9C69B]) [ ] o.a.s.c.c.ConnectionManager Waiting for client to connect to ZooKeeper
[junit4] 2> 1896489 INFO (zkCallback-8579-thread-1) [ ] o.a.s.c.c.ConnectionManager Watcher org.apache.solr.common.cloud.ConnectionManager@1cc5a0d name:ZooKeeperConnection Watcher:127.0.0.1:62492/solr got event WatchedEvent state:SyncConnected type:None path:null path:null type:None
[junit4] 2> 1896489 INFO (TEST-CdcrVersionReplicationTest.testCdcrDocVersions-seed#[BF365ADBD2B9C69B]) [ ] o.a.s.c.c.ConnectionManager Client is connected to ZooKeeper
[junit4] 2> 1896490 INFO (TEST-CdcrVersionReplicationTest.testCdcrDocVersions-seed#[BF365ADBD2B9C69B]) [ ] o.a.s.c.c.SolrZkClient Using default ZkACLProvider
[junit4] 2> 1896493 WARN (NIOServerCxn.Factory:0.0.0.0/0.0.0.0:0) [ ] o.a.z.s.NIOServerCnxn caught end of stream exception
[junit4] 2> EndOfStreamException: Unable to read additional data from client sessionid 0x1559f727f650005, likely client has closed socket
[junit4] 2> at org.apache.zookeeper.server.NIOServerCnxn.doIO(NIOServerCnxn.java:228)
[junit4] 2> at org.apache.zookeeper.server.NIOServerCnxnFactory.run(NIOServerCnxnFactory.java:208)
[junit4] 2> at java.lang.Thread.run(Thread.java:745)
[junit4] 2> 1896494 INFO (TEST-CdcrVersionReplicationTest.testCdcrDocVersions-seed#[BF365ADBD2B9C69B]) [ ] o.a.s.s.SolrDispatchFilter Loading solr.xml from SolrHome (not found in ZooKeeper)
[junit4] 2> 1896494 INFO (TEST-CdcrVersionReplicationTest.testCdcrDocVersions-seed#[BF365ADBD2B9C69B]) [ ] o.a.s.c.SolrXmlConfig Loading container configuration from C:\Users\jenkins\workspace\Lucene-Solr-master-Windows\solr\build\solr-core\test\J0\temp\solr.cloud.CdcrVersionReplicationTest_BF365ADBD2B9C69B-001\jetty-002\solr.xml
[junit4] 2> 1896512 INFO (TEST-CdcrVersionReplicationTest.testCdcrDocVersions-seed#[BF365ADBD2B9C69B]) [ ] o.a.s.c.CorePropertiesLocator Config-defined core root directory: C:\Users\jenkins\workspace\Lucene-Solr-master-Windows\solr\build\solr-core\test\J0\temp\solr.cloud.CdcrVersionReplicationTest_BF365ADBD2B9C69B-001\jetty-002\cores
[junit4] 2> 1896513 INFO (TEST-CdcrVersionReplicationTest.testCdcrDocVersions-seed#[BF365ADBD2B9C69B]) [ ] o.a.s.c.CoreContainer New CoreContainer 25818979
[junit4] 2> 1896513 INFO (TEST-CdcrVersionReplicationTest.testCdcrDocVersions-seed#[BF365ADBD2B9C69B]) [ ] o.a.s.c.CoreContainer Loading cores into CoreContainer [instanceDir=C:\Users\jenkins\workspace\Lucene-Solr-master-Windows\solr\build\solr-core\test\J0\temp\solr.cloud.CdcrVersionReplicationTest_BF365ADBD2B9C69B-001\jetty-002]
[junit4] 2> 1896513 WARN (TEST-CdcrVersionReplicationTest.testCdcrDocVersions-seed#[BF365ADBD2B9C69B]) [ ] o.a.s.c.CoreContainer Couldn't add files from C:\Users\jenkins\workspace\Lucene-Solr-master-Windows\solr\build\solr-core\test\J0\temp\solr.cloud.CdcrVersionReplicationTest_BF365ADBD2B9C69B-001\jetty-002\lib to classpath: C:\Users\jenkins\workspace\Lucene-Solr-master-Windows\solr\build\solr-core\test\J0\temp\solr.cloud.CdcrVersionReplicationTest_BF365ADBD2B9C69B-001\jetty-002\lib
[junit4] 2> 1896513 INFO (TEST-CdcrVersionReplicationTest.testCdcrDocVersions-seed#[BF365ADBD2B9C69B]) [ ] o.a.s.h.c.HttpShardHandlerFactory created with socketTimeout : 90000,urlScheme : ,connTimeout : 15000,maxConnectionsPerHost : 20,maxConnections : 10000,corePoolSize : 0,maximumPoolSize : 2147483647,maxThreadIdleTime : 5,sizeOfQueue : -1,fairnessPolicy : false,
[junit4] 2> 1896519 INFO (TEST-CdcrVersionReplicationTest.testCdcrDocVersions-seed#[BF365ADBD2B9C69B]) [ ] o.a.s.u.UpdateShardHandler Creating UpdateShardHandler HTTP client with params:
[junit4] 2> 1896533 INFO (TEST-CdcrVersionReplicationTest.testCdcrDocVersions-seed#[BF365ADBD2B9C69B]) [ ] o.a.s.l.LogWatcher SLF4J impl is org.slf4j.impl.Log4jLoggerFactory
[junit4] 2> 1896533 INFO (TEST-CdcrVersionReplicationTest.testCdcrDocVersions-seed#[BF365ADBD2B9C69B]) [ ] o.a.s.l.LogWatcher Registering Log Listener [Log4j (org.slf4j.impl.Log4jLoggerFactory)]
[junit4] 2> 1896533 INFO (TEST-CdcrVersionReplicationTest.testCdcrDocVersions-seed#[BF365ADBD2B9C69B]) [ ] o.a.s.c.ZkContainer Zookeeper client=127.0.0.1:62492/solr
[junit4] 2> 1896533 INFO (TEST-CdcrVersionReplicationTest.testCdcrDocVersions-seed#[BF365ADBD2B9C69B]) [ ] o.a.s.c.ZkController zkHost includes chroot
[junit4] 2> 1896534 INFO (TEST-CdcrVersionReplicationTest.testCdcrDocVersions-seed#[BF365ADBD2B9C69B]) [ ] o.a.s.c.c.SolrZkClient Using default ZkCredentialsProvider
[junit4] 2> 1896536 INFO (TEST-CdcrVersionReplicationTest.testCdcrDocVersions-seed#[BF365ADBD2B9C69B]) [ ] o.a.s.c.c.ConnectionManager Waiting for client to connect to ZooKeeper
[junit4] 2> 1896539 INFO (zkCallback-8582-thread-1) [ ] o.a.s.c.c.ConnectionManager Watcher org.apache.solr.common.cloud.ConnectionManager@1cf968f name:ZooKeeperConnection Watcher:127.0.0.1:62492 got event WatchedEvent state:SyncConnected type:None path:null path:null type:None
[junit4] 2> 1896539 INFO (TEST-CdcrVersionReplicationTest.testCdcrDocVersions-seed#[BF365ADBD2B9C69B]) [ ] o.a.s.c.c.ConnectionManager Client is connected to ZooKeeper
[junit4] 2> 1896540 INFO (TEST-CdcrVersionReplicationTest.testCdcrDocVersions-seed#[BF365ADBD2B9C69B]) [ ] o.a.s.c.c.SolrZkClient Using default ZkACLProvider
[junit4] 2> 1896542 WARN (NIOServerCxn.Factory:0.0.0.0/0.0.0.0:0) [ ] o.a.z.s.NIOServerCnxn caught end of stream exception
[junit4] 2> EndOfStreamException: Unable to read additional data from client sessionid 0x1559f727f650006, likely client has closed socket
[junit4] 2> at org.apache.zookeeper.server.NIOServerCnxn.doIO(NIOServerCnxn.java:228)
[junit4] 2> at org.apache.zookeeper.server.NIOServerCnxnFactory.run(NIOServerCnxnFactory.java:208)
[junit4] 2> at java.lang.Thread.run(Thread.java:745)
[junit4] 2> 1896544 INFO (TEST-CdcrVersionReplicationTest.testCdcrDocVersions-seed#[BF365ADBD2B9C69B]) [n:127.0.0.1:62523_ ] o.a.s.c.ZkController Added new OnReconnect listener org.apache.solr.cloud.ZkController$$Lambda$51/32228217@1d80677
[junit4] 2> 1896557 INFO (TEST-CdcrVersionReplicationTest.testCdcrDocVersions-seed#[BF365ADBD2B9C69B]) [n:127.0.0.1:62523_ ] o.a.s.c.c.ConnectionManager Waiting for client to connect to ZooKeeper
[junit4] 2> 1896576 INFO (zkCallback-8583-thread-1-processing-n:127.0.0.1:62523_) [n:127.0.0.1:62523_ ] o.a.s.c.c.ConnectionManager Watcher org.apache.solr.common.cloud.ConnectionManager@12468b8 name:ZooKeeperConnection Watcher:127.0.0.1:62492/solr got event WatchedEvent state:SyncConnected type:None path:null path:null type:None
[junit4] 2> 1896576 INFO (TEST-CdcrVersionReplicationTest.testCdcrDocVersions-seed#[BF365ADBD2B9C69B]) [n:127.0.0.1:62523_ ] o.a.s.c.c.ConnectionManager Client is connected to ZooKeeper
[junit4] 2> 1896605 INFO (TEST-CdcrVersionReplicationTest.testCdcrDocVersions-seed#[BF365ADBD2B9C69B]) [n:127.0.0.1:62523_ ] o.a.s.c.c.ZkStateReader Updating cluster state from ZooKeeper...
[junit4] 2> 1896607 INFO (TEST-CdcrVersionReplicationTest.testCdcrDocVersions-seed#[BF365ADBD2B9C69B]) [n:127.0.0.1:62523_ ] o.a.s.c.c.ZkStateReader Loaded empty cluster properties
[junit4] 2> 1896608 INFO (TEST-CdcrVersionReplicationTest.testCdcrDocVersions-seed#[BF365ADBD2B9C69B]) [n:127.0.0.1:62523_ ] o.a.s.c.c.ZkStateReader Updated live nodes from ZooKeeper... (0) -> (1)
[junit4] 2> 1896613 INFO (TEST-CdcrVersionReplicationTest.testCdcrDocVersions-seed#[BF365ADBD2B9C69B]) [n:127.0.0.1:62523_ ] o.a.s.c.Overseer Overseer (id=null) closing
[junit4] 2> 1896615 INFO (TEST-CdcrVersionReplicationTest.testCdcrDocVersions-seed#[BF365ADBD2B9C69B]) [n:127.0.0.1:62523_ ] o.a.s.c.LeaderElector Joined leadership election with path: /overseer_elect/election/96158281170747399-127.0.0.1:62523_-n_0000000001
[junit4] 2> 1896617 INFO (TEST-CdcrVersionReplicationTest.testCdcrDocVersions-seed#[BF365ADBD2B9C69B]) [n:127.0.0.1:62523_ ] o.a.s.c.LeaderElector Watching path /overseer_elect/election/96158281170747396-127.0.0.1:62511_-n_0000000000 to know if I could be the leader
[junit4] 2> 1896618 INFO (TEST-CdcrVersionReplicationTest.testCdcrDocVersions-seed#[BF365ADBD2B9C69B]) [n:127.0.0.1:62523_ ] o.a.s.c.ZkController Publish node=127.0.0.1:62523_ as DOWN
[junit4] 2> 1896625 INFO (OverseerStateUpdate-96158281170747396-127.0.0.1:62511_-n_0000000000) [n:127.0.0.1:62511_ ] o.a.s.c.Overseer processMessage: queueSize: 1, message = {
[junit4] 2> "operation":"downnode",
[junit4] 2> "node_name":"127.0.0.1:62523_"} current state version: 4
[junit4] 2> 1896625 INFO (OverseerStateUpdate-96158281170747396-127.0.0.1:62511_-n_0000000000) [n:127.0.0.1:62511_ ] o.a.s.c.o.NodeMutator DownNode state invoked for node: 127.0.0.1:62523_
[junit4] 2> 1896736 INFO (zkCallback-8583-thread-1-processing-n:127.0.0.1:62523_) [n:127.0.0.1:62523_ ] o.a.s.c.c.ZkStateReader A cluster state change: [WatchedEvent state:SyncConnected type:NodeDataChanged path:/clusterstate.json], has occurred - updating... (live nodes size: [1])
[junit4] 2> 1896736 INFO (zkCallback-8577-thread-2-processing-n:127.0.0.1:62511_) [n:127.0.0.1:62511_ ] o.a.s.c.c.ZkStateReader A cluster state change: [WatchedEvent state:SyncConnected type:NodeDataChanged path:/clusterstate.json], has occurred - updating... (live nodes size: [1])
[junit4] 2> 1897627 INFO (TEST-CdcrVersionReplicationTest.testCdcrDocVersions-seed#[BF365ADBD2B9C69B]) [n:127.0.0.1:62523_ ] o.a.s.c.ZkController Register node as live in ZooKeeper:/live_nodes/127.0.0.1:62523_
[junit4] 2> 1897627 INFO (TEST-CdcrVersionReplicationTest.testCdcrDocVersions-seed#[BF365ADBD2B9C69B]) [n:127.0.0.1:62523_ ] o.a.s.c.c.SolrZkClient makePath: /live_nodes/127.0.0.1:62523_
[junit4] 2> 1897630 INFO (zkCallback-8583-thread-1-processing-n:127.0.0.1:62523_) [n:127.0.0.1:62523_ ] o.a.s.c.c.ZkStateReader A live node change: [WatchedEvent state:SyncConnected type:NodeChildrenChanged path:/live_nodes], has occurred - updating... (live nodes size: [1])
[junit4] 2> 1897630 INFO (zkCallback-8577-thread-2-processing-n:127.0.0.1:62511_) [n:127.0.0.1:62511_ ] o.a.s.c.c.ZkStateReader A live node change: [WatchedEvent state:SyncConnected type:NodeChildrenChanged path:/live_nodes], has occurred - updating... (live nodes size: [1])
[junit4] 2> 1897632 INFO (zkCallback-8583-thread-1-processing-n:127.0.0.1:62523_) [n:127.0.0.1:62523_ ] o.a.s.c.c.ZkStateReader Updated live nodes from ZooKeeper... (1) -> (2)
[junit4] 2> 1897632 INFO (zkCallback-8577-thread-2-processing-n:127.0.0.1:62511_) [n:127.0.0.1:62511_ ] o.a.s.c.c.ZkStateReader Updated live nodes from ZooKeeper... (1) -> (2)
[junit4] 2> 1897690 INFO (TEST-CdcrVersionReplicationTest.testCdcrDocVersions-seed#[BF365ADBD2B9C69B]) [n:127.0.0.1:62523_ ] o.a.s.c.CoreContainer Security conf doesn't exist. Skipping setup for authorization module.
[junit4] 2> 1897690 INFO (TEST-CdcrVersionReplicationTest.testCdcrDocVersions-seed#[BF365ADBD2B9C69B]) [n:127.0.0.1:62523_ ] o.a.s.c.CoreContainer No authentication plugin used.
[junit4] 2> 1897692 INFO (TEST-CdcrVersionReplicationTest.testCdcrDocVersions-seed#[BF365ADBD2B9C69B]) [n:127.0.0.1:62523_ ] o.a.s.c.CorePropertiesLocator Looking for core definitions underneath C:\Users\jenkins\workspace\Lucene-Solr-master-Windows\solr\build\solr-core\test\J0\temp\solr.cloud.CdcrVersionReplicationTest_BF365ADBD2B9C69B-001\jetty-002\cores
[junit4] 2> 1897694 INFO (TEST-CdcrVersionReplicationTest.testCdcrDocVersions-seed#[BF365ADBD2B9C69B]) [n:127.0.0.1:62523_ ] o.a.s.c.CoreDescriptor Created CoreDescriptor: {name=collection1, config=solrconfig.xml, transient=false, schema=schema.xml, loadOnStartup=true, configSetProperties=configsetprops.json, collection=tmp_collection, coreNodeName=, dataDir=data\, shard=}
[junit4] 2> 1897694 INFO (TEST-CdcrVersionReplicationTest.testCdcrDocVersions-seed#[BF365ADBD2B9C69B]) [n:127.0.0.1:62523_ ] o.a.s.c.CorePropertiesLocator Found core collection1 in C:\Users\jenkins\workspace\Lucene-Solr-master-Windows\solr\build\solr-core\test\J0\temp\solr.cloud.CdcrVersionReplicationTest_BF365ADBD2B9C69B-001\jetty-002\cores\collection1
[junit4] 2> 1897695 INFO (TEST-CdcrVersionReplicationTest.testCdcrDocVersions-seed#[BF365ADBD2B9C69B]) [n:127.0.0.1:62523_ ] o.a.s.c.CorePropertiesLocator Found 1 core definitions
[junit4] 2> 1897696 INFO (coreLoadExecutor-7668-thread-1-processing-n:127.0.0.1:62523_) [n:127.0.0.1:62523_ c:tmp_collection x:collection1] o.a.s.c.ZkController publishing state=down
[junit4] 2> 1897696 INFO (coreLoadExecutor-7668-thread-1-processing-n:127.0.0.1:62523_) [n:127.0.0.1:62523_ c:tmp_collection x:collection1] o.a.s.c.ZkController numShards not found on descriptor - reading it from system property
[junit4] 2> 1897697 INFO (TEST-CdcrVersionReplicationTest.testCdcrDocVersions-seed#[BF365ADBD2B9C69B]) [n:127.0.0.1:62523_ ] o.a.s.s.SolrDispatchFilter user.dir=C:\Users\jenkins\workspace\Lucene-Solr-master-Windows\solr\build\solr-core\test\J0
[junit4] 2> 1897697 INFO (TEST-CdcrVersionReplicationTest.testCdcrDocVersions-seed#[BF365ADBD2B9C69B]) [n:127.0.0.1:62523_ ] o.a.s.s.SolrDispatchFilter SolrDispatchFilter.init() done
[junit4] 2> 1897698 INFO (coreLoadExecutor-7668-thread-1-processing-n:127.0.0.1:62523_) [n:127.0.0.1:62523_ c:tmp_collection x:collection1] o.a.s.c.ZkController Registering watch for collection tmp_collection
[junit4] 2> 1897700 INFO (OverseerStateUpdate-96158281170747396-127.0.0.1:62511_-n_0000000000) [n:127.0.0.1:62511_ ] o.a.s.c.Overseer processMessage: queueSize: 1, message = {
[junit4] 2> "core":"collection1",
[junit4] 2> "roles":null,
[junit4] 2> "base_url":"http://127.0.0.1:62523",
[junit4] 2> "node_name":"127.0.0.1:62523_",
[junit4] 2> "numShards":"2",
[junit4] 2> "state":"down",
[junit4] 2> "shard":null,
[junit4] 2> "collection":"tmp_collection",
[junit4] 2> "operation":"state"} current state version: 5
[junit4] 2> 1897700 INFO (OverseerStateUpdate-96158281170747396-127.0.0.1:62511_-n_0000000000) [n:127.0.0.1:62511_ ] o.a.s.c.o.ReplicaMutator Update state numShards=2 message={
[junit4] 2> "core":"collection1",
[junit4] 2> "roles":null,
[junit4] 2> "base_url":"http://127.0.0.1:62523",
[junit4] 2> "node_name":"127.0.0.1:62523_",
[junit4] 2> "numShards":"2",
[junit4] 2> "state":"down",
[junit4] 2> "shard":null,
[junit4] 2> "collection":"tmp_collection",
[junit4] 2> "operation":"state"}
[junit4] 2> 1897700 INFO (OverseerStateUpdate-96158281170747396-127.0.0.1:62511_-n_0000000000) [n:127.0.0.1:62511_ ] o.a.s.c.o.ReplicaMutator Collection already exists with numShards=2
[junit4] 2> 1897700 INFO (OverseerStateUpdate-96158281170747396-127.0.0.1:62511_-n_0000000000) [n:127.0.0.1:62511_ ] o.a.s.c.o.ReplicaMutator Assigning new node to shard shard=shard1
[junit4] 2> 1897703 INFO (coreLoadExecutor-7668-thread-1-processing-n:127.0.0.1:62523_) [n:127.0.0.1:62523_ c:tmp_collection x:collection1] o.a.s.c.c.ZkStateReader Deleting data for [tmp_collection]
[junit4] 2> 1897706 INFO (coreLoadExecutor-7668-thread-1-processing-n:127.0.0.1:62523_) [n:127.0.0.1:62523_ c:tmp_collection x:collection1] o.a.s.c.ZkController look for our core node name
[junit4] 2> 1897808 INFO (zkCallback-8583-thread-1-processing-n:127.0.0.1:62523_) [n:127.0.0.1:62523_ ] o.a.s.c.c.ZkStateReader A cluster state change: [WatchedEvent state:SyncConnected type:NodeDataChanged path:/clusterstate.json], has occurred - updating... (live nodes size: [2])
[junit4] 2> 1897808 INFO (zkCallback-8577-thread-1-processing-n:127.0.0.1:62511_) [n:127.0.0.1:62511_ ] o.a.s.c.c.ZkStateReader A cluster state change: [WatchedEvent state:SyncConnected type:NodeDataChanged path:/clusterstate.json], has occurred - updating... (live nodes size: [2])
[junit4] 2> 1898706 INFO (coreLoadExecutor-7668-thread-1-processing-n:127.0.0.1:62523_) [n:127.0.0.1:62523_ c:tmp_collection x:collection1] o.a.s.c.ZkController waiting to find shard id in clusterstate for collection1
[junit4] 2> 1898706 INFO (coreLoadExecutor-7668-thread-1-processing-n:127.0.0.1:62523_) [n:127.0.0.1:62523_ c:tmp_collection x:collection1] o.a.s.c.ZkController Check for collection zkNode:tmp_collection
[junit4] 2> 1898707 INFO (coreLoadExecutor-7668-thread-1-processing-n:127.0.0.1:62523_) [n:127.0.0.1:62523_ c:tmp_collection x:collection1] o.a.s.c.ZkController Collection zkNode exists
[junit4] 2> 1898707 INFO (coreLoadExecutor-7668-thread-1-processing-n:127.0.0.1:62523_) [n:127.0.0.1:62523_ c:tmp_collection x:collection1] o.a.s.c.c.ZkStateReader Load collection config from: [/collections/tmp_collection]
[junit4] 2> 1898709 INFO (coreLoadExecutor-7668-thread-1-processing-n:127.0.0.1:62523_) [n:127.0.0.1:62523_ c:tmp_collection x:collection1] o.a.s.c.c.ZkStateReader path=[/collections/tmp_collection] [configName]=[conf1] specified config exists in ZooKeeper
[junit4] 2> 1898710 INFO (coreLoadExecutor-7668-thread-1-processing-n:127.0.0.1:62523_) [n:127.0.0.1:62523_ c:tmp_collection x:collection1] o.a.s.c.SolrResourceLoader new SolrResourceLoader for directory: 'C:\Users\jenkins\workspace\Lucene-Solr-master-Windows\solr\build\solr-core\test\J0\temp\solr.cloud.CdcrVersionReplicationTest_BF365ADBD2B9C69B-001\jetty-002\cores\collection1'
[junit4] 2> 1898710 INFO (coreLoadExecutor-7668-thread-1-processing-n:127.0.0.1:62523_) [n:127.0.0.1:62523_ c:tmp_collection x:collection1] o.a.s.c.SolrResourceLoader JNDI not configured for solr (NoInitialContextEx)
[junit4] 2> 1898710 INFO (coreLoadExecutor-7668-thread-1-processing-n:127.0.0.1:62523_) [n:127.0.0.1:62523_ c:tmp_collection x:collection1] o.a.s.c.SolrResourceLoader solr home defaulted to 'solr/' (could not find system property or JNDI)
[junit4] 2> 1898713 INFO (coreLoadExecutor-7668-thread-1-processing-n:127.0.0.1:62523_) [n:127.0.0.1:62523_ c:tmp_collection x:collection1] o.a.s.c.Config loaded config solrconfig.xml with version 0
[junit4] 2> 1898729 INFO (coreLoadExecutor-7668-thread-1-processing-n:127.0.0.1:62523_) [n:127.0.0.1:62523_ c:tmp_collection x:collection1] o.a.s.c.SolrConfig current version of requestparams : -1
[junit4] 2> 1898731 WARN (coreLoadExecutor-7668-thread-1-processing-n:127.0.0.1:62523_) [n:127.0.0.1:62523_ c:tmp_collection x:collection1] o.a.s.c.Config Beginning with Solr 5.5, <mergePolicy> is deprecated, use <mergePolicyFactory> instead.
[junit4] 2> 1898731 INFO (coreLoadExecutor-7668-thread-1-processing-n:127.0.0.1:62523_) [n:127.0.0.1:62523_ c:tmp_collection x:collection1] o.a.s.c.SolrConfig Using Lucene MatchVersion: 7.0.0
[junit4] 2> 1898742 INFO (coreLoadExecutor-7668-thread-1-processing-n:127.0.0.1:62523_) [n:127.0.0.1:62523_ c:tmp_collection x:collection1] o.a.s.c.SolrConfig Loaded SolrConfig: solrconfig.xml
[junit4] 2> 1898757 INFO (coreLoadExecutor-7668-thread-1-processing-n:127.0.0.1:62523_) [n:127.0.0.1:62523_ c:tmp_collection x:collection1] o.a.s.s.IndexSchema [collection1] Schema name=test
[junit4] 2> 1898905 INFO (coreLoadExecutor-7668-thread-1-processing-n:127.0.0.1:62523_) [n:127.0.0.1:62523_ c:tmp_collection x:collection1] o.a.s.s.IndexSchema default search field in schema is text
[junit4] 2> 1898907 INFO (coreLoadExecutor-7668-thread-1-processing-n:127.0.0.1:62523_) [n:127.0.0.1:62523_ c:tmp_collection x:collection1] o.a.s.s.IndexSchema unique key field: id
[junit4] 2> 1898907 INFO (coreLoadExecutor-7668-thread-1-processing-n:127.0.0.1:62523_) [n:127.0.0.1:62523_ c:tmp_collection x:collection1] o.a.s.s.FileExchangeRateProvider Reloading exchange rates from file currency.xml
[junit4] 2> 1898915 INFO (coreLoadExecutor-7668-thread-1-proces
[...truncated too long message...]
[junit4] 2> org.apache.solr.common.SolrException: Unable to reload core [collection1]
[junit4] 2> at org.apache.solr.core.CoreContainer.reload(CoreContainer.java:952)
[junit4] 2> at org.apache.solr.core.SolrCore.lambda$getConfListener$6(SolrCore.java:2509)
[junit4] 2> at org.apache.solr.cloud.ZkController$4.run(ZkController.java:2443)
[junit4] 2> Caused by: org.apache.solr.common.SolrException: Could not load conf for core collection1: Error loading schema resource schema.xml
[junit4] 2> at org.apache.solr.core.ConfigSetService.getConfig(ConfigSetService.java:85)
[junit4] 2> at org.apache.solr.core.CoreContainer.reload(CoreContainer.java:944)
[junit4] 2> ... 2 more
[junit4] 2> Caused by: org.apache.solr.common.SolrException: Error loading schema resource schema.xml
[junit4] 2> at org.apache.solr.schema.IndexSchemaFactory.create(IndexSchemaFactory.java:52)
[junit4] 2> at org.apache.solr.schema.IndexSchemaFactory.buildIndexSchema(IndexSchemaFactory.java:75)
[junit4] 2> at org.apache.solr.core.ConfigSetService.createIndexSchema(ConfigSetService.java:107)
[junit4] 2> at org.apache.solr.core.ConfigSetService.getConfig(ConfigSetService.java:78)
[junit4] 2> ... 3 more
[junit4] 2> Caused by: java.io.IOException: We re-tried 10 times but was still unable to fetch resource=schema.xml from ZK
[junit4] 2> at org.apache.solr.cloud.ZkSolrResourceLoader.openResource(ZkSolrResourceLoader.java:116)
[junit4] 2> at org.apache.solr.core.SolrResourceLoader.openSchema(SolrResourceLoader.java:333)
[junit4] 2> at org.apache.solr.schema.IndexSchemaFactory.create(IndexSchemaFactory.java:48)
[junit4] 2> ... 6 more
[junit4] 2> Caused by: org.apache.zookeeper.KeeperException$SessionExpiredException: KeeperErrorCode = Session expired for /configs/conf1/schema.xml
[junit4] 2> at org.apache.zookeeper.KeeperException.create(KeeperException.java:127)
[junit4] 2> at org.apache.zookeeper.KeeperException.create(KeeperException.java:51)
[junit4] 2> at org.apache.zookeeper.ZooKeeper.exists(ZooKeeper.java:1045)
[junit4] 2> at org.apache.solr.common.cloud.SolrZkClient$5.execute(SolrZkClient.java:313)
[junit4] 2> at org.apache.solr.common.cloud.SolrZkClient$5.execute(SolrZkClient.java:310)
[junit4] 2> at org.apache.solr.common.cloud.ZkCmdExecutor.retryOperation(ZkCmdExecutor.java:60)
[junit4] 2> at org.apache.solr.common.cloud.SolrZkClient.exists(SolrZkClient.java:310)
[junit4] 2> at org.apache.solr.cloud.ZkController.pathExists(ZkController.java:831)
[junit4] 2> at org.apache.solr.cloud.ZkSolrResourceLoader.openResource(ZkSolrResourceLoader.java:89)
[junit4] 2> ... 8 more
[junit4] 2> NOTE: test params are: codec=Asserting(Lucene62): {}, docValues:{}, maxPointsInLeafNode=1980, maxMBSortInHeap=5.4993814512002555, sim=ClassicSimilarity, locale=ar-KW, timezone=America/Santa_Isabel
[junit4] 2> NOTE: Windows 10 10.0 x86/Oracle Corporation 1.8.0_92 (32-bit)/cpus=3,threads=1,free=132443632,total=476315648
[junit4] 2> NOTE: All tests run in this JVM: [BlockCacheTest, PreAnalyzedFieldTest, HighlighterTest, DistanceUnitsTest, TestTrackingShardHandlerFactory, TestCryptoKeys, PreAnalyzedUpdateProcessorTest, SolrXmlInZkTest, TestHashPartitioner, TriLevelCompositeIdRoutingTest, ConcurrentDeleteAndCreateCollectionTest, TestFieldCacheSanityChecker, CurrencyFieldXmlFileTest, DistributedQueryComponentCustomSortTest, TestMaxScoreQueryParser, TestXmlQParser, TestQueryWrapperFilter, ClusterStateUpdateTest, BufferStoreTest, TestScoreJoinQPNoScore, PolyFieldTest, TestChildDocTransformer, TestFastLRUCache, TestFunctionQuery, TestJmxIntegration, AnalyticsMergeStrategyTest, TestRestManager, DistributedExpandComponentTest, ExternalFileFieldSortTest, TestSolrQueryParserDefaultOperatorResource, AsyncMigrateRouteKeyTest, TestReplicaProperties, SoftAutoCommitTest, DisMaxRequestHandlerTest, TestMiniSolrCloudClusterBase, LeaderElectionTest, IgnoreCommitOptimizeUpdateProcessorFactoryTest, TestUninvertingReader, TestLeaderElectionZkExpiry, RulesTest, AssignTest, TestBlobHandler, TestLazyCores, DocumentAnalysisRequestHandlerTest, PeerSyncTest, TestDynamicFieldResource, ChaosMonkeyNothingIsSafeTest, TestLRUCache, TestExtendedDismaxParser, UpdateParamsTest, TestCursorMarkWithoutUniqueKey, SchemaVersionSpecificBehaviorTest, TestFieldCacheSortRandom, HdfsChaosMonkeyNothingIsSafeTest, TestFieldCacheWithThreads, ScriptEngineTest, SpatialFilterTest, TestFreeTextSuggestions, AnalysisErrorHandlingTest, TestCodecSupport, TestLockTree, TestLMDirichletSimilarityFactory, TestInitParams, ZkStateReaderTest, TestExactSharedStatsCache, SpatialHeatmapFacetsTest, TestStressLiveNodes, LeaderInitiatedRecoveryOnCommitTest, MigrateRouteKeyTest, TestDownShardTolerantSearch, XsltUpdateRequestHandlerTest, TestDocumentBuilder, TestSubQueryTransformerCrossCore, HdfsThreadLeakTest, QueryEqualityTest, TestPartialUpdateDeduplication, BlockJoinFacetSimpleTest, TestDefaultSearchFieldResource, TestRandomRequestDistribution, XmlUpdateRequestHandlerTest, TestManagedSchemaAPI, TestSearchPerf, CursorMarkTest, PrimUtilsTest, HdfsCollectionsAPIDistributedZkTest, HdfsUnloadDistributedZkTest, HdfsRecoverLeaseTest, TestPhraseSuggestions, TestDistributedSearch, CdcrRequestHandlerTest, TestFieldResource, TestNoOpRegenerator, CloneFieldUpdateProcessorFactoryTest, SolrTestCaseJ4Test, StandardRequestHandlerTest, TestDFISimilarityFactory, TestHdfsBackupRestoreCore, TestHashQParserPlugin, TestStressVersions, TestCustomSort, TestTolerantUpdateProcessorRandomCloud, TestSolrFieldCacheMBean, JsonLoaderTest, TestFieldCache, DateRangeFieldTest, TestFilteredDocIdSet, SharedFSAutoReplicaFailoverTest, OverseerTest, InfoHandlerTest, TimeZoneUtilsTest, BooleanFieldTest, DirectoryFactoryTest, TestMergePolicyConfig, TestSchemaResource, CollectionsAPIAsyncDistributedZkTest, TestExceedMaxTermLength, BasicDistributedZkTest, CoreAdminRequestStatusTest, DistributedQueryElevationComponentTest, TestLFUCache, DistributedSpellCheckComponentTest, SegmentsInfoRequestHandlerTest, SuggestComponentTest, TestBackupRepositoryFactory, TestJsonRequest, TestManagedResource, ConjunctionSolrSpellCheckerTest, ReturnFieldsTest, FastVectorHighlighterTest, HLLSerializationTest, CircularListTest, TestShortCircuitedRequests, TestSweetSpotSimilarityFactory, RequiredFieldsTest, WrapperMergePolicyFactoryTest, TestSort, TestAnalyzedSuggestions, HdfsRestartWhileUpdatingTest, TestReqParamsAPI, DeleteShardTest, HdfsBasicDistributedZk2Test, TestDFRSimilarityFactory, DirectUpdateHandlerTest, TestSurroundQueryParser, MBeansHandlerTest, PKIAuthenticationIntegrationTest, CollectionsAPIDistributedZkTest, RecoveryZkTest, TestRandomFaceting, ZkSolrClientTest, TestRandomDVFaceting, ZkCLITest, TestDistributedGrouping, TestJoin, TestCoreContainer, SimpleFacetsTest, SolrCoreTest, SpellCheckComponentTest, TestGroupingSearch, SolrCmdDistributorTest, QueryElevationComponentTest, BasicFunctionalityTest, AnalysisAfterCoreReloadTest, SpellCheckCollatorTest, SolrRequestParserTest, DocValuesTest, IndexBasedSpellCheckerTest, TestReversedWildcardFilterFactory, TermsComponentTest, DocumentBuilderTest, TestIndexingPerformance, FieldAnalysisRequestHandlerTest, TestArbitraryIndexDir, RegexBoostProcessorTest, IndexSchemaTest, UpdateRequestProcessorFactoryTest, BinaryUpdateRequestHandlerTest, PingRequestHandlerTest, EchoParamsTest, TestJmxMonitoredMap, OpenExchangeRatesOrgProviderTest, DateMathParserTest, DateFieldTest, ClusterStateTest, ZkNodePropsTest, SystemInfoHandlerTest, UUIDFieldTest, CursorPagingTest, TestSimpleTrackingShardHandler, CdcrReplicationDistributedZkTest, CdcrReplicationHandlerTest, CdcrVersionReplicationTest, CloudExitableDirectoryReaderTest, CollectionsAPISolrJTest, DeleteInactiveReplicaTest, DeleteLastCustomShardedReplicaTest, DeleteReplicaTest, DistribDocExpirationUpdateProcessorTest, HttpPartitionTest, OverseerTaskQueueTest, RemoteQueryErrorTest, SSLMigrationTest, SaslZkACLProviderTest, ShardSplitTest, TestCloudBackupRestore, TestCollectionAPI, TestRebalanceLeaders, TestSolrCloudWithKerberosAlt, TestTolerantUpdateProcessorCloud, HdfsBasicDistributedZkTest, StressHdfsTest, ZkStateWriterTest, HdfsDirectoryFactoryTest, QueryResultKeyTest, TestConfigSetImmutable, TestImplicitCoreProperties, TestInfoStreamLogging, TestReloadAndDeleteDocs, TestShardHandlerFactory, TestSolrConfigHandler, TestSolrXml, RequestLoggingTest, TestConfigReload, TestSQLHandler, TestSolrConfigHandlerConcurrent]
[junit4] Completed [517/616 (2!)] on J0 in 31.58s, 1 test, 1 error <<< FAILURES!
[...truncated 309 lines...]
BUILD FAILED
C:\Users\jenkins\workspace\Lucene-Solr-master-Windows\build.xml:740: The following error occurred while executing this line:
C:\Users\jenkins\workspace\Lucene-Solr-master-Windows\build.xml:684: The following error occurred while executing this line:
C:\Users\jenkins\workspace\Lucene-Solr-master-Windows\build.xml:59: The following error occurred while executing this line:
C:\Users\jenkins\workspace\Lucene-Solr-master-Windows\solr\build.xml:233: The following error occurred while executing this line:
C:\Users\jenkins\workspace\Lucene-Solr-master-Windows\solr\common-build.xml:530: The following error occurred while executing this line:
C:\Users\jenkins\workspace\Lucene-Solr-master-Windows\lucene\common-build.xml:1427: The following error occurred while executing this line:
C:\Users\jenkins\workspace\Lucene-Solr-master-Windows\lucene\common-build.xml:984: There were test failures: 616 suites (10 ignored), 2590 tests, 1 suite-level error, 1 error, 127 ignored (82 assumptions) [seed: BF365ADBD2B9C69B]
Total time: 97 minutes 12 seconds
Build step 'Invoke Ant' marked build as failure
Archiving artifacts
[WARNINGS] Skipping publisher since build result is FAILURE
Recording test results
Email was triggered for: Failure - Any
Sending email for trigger: Failure - Any
[JENKINS] Lucene-Solr-master-Windows (64bit/jdk1.8.0_92) - Build #
5946 - Still Failing!
Posted by Policeman Jenkins Server <je...@thetaphi.de>.
Build: http://jenkins.thetaphi.de/job/Lucene-Solr-master-Windows/5946/
Java: 64bit/jdk1.8.0_92 -XX:+UseCompressedOops -XX:+UseConcMarkSweepGC
1 tests failed.
FAILED: org.apache.solr.common.cloud.TestCollectionStateWatchers.testSimpleCollectionWatch
Error Message:
Stack Trace:
java.util.concurrent.TimeoutException
at __randomizedtesting.SeedInfo.seed([ACE149333A9DD931:F1DA86437D90460F]:0)
at org.apache.solr.common.cloud.ZkStateReader.waitForState(ZkStateReader.java:1206)
at org.apache.solr.client.solrj.impl.CloudSolrClient.waitForState(CloudSolrClient.java:593)
at org.apache.solr.common.cloud.TestCollectionStateWatchers.testSimpleCollectionWatch(TestCollectionStateWatchers.java:92)
at sun.reflect.NativeMethodAccessorImpl.invoke0(Native Method)
at sun.reflect.NativeMethodAccessorImpl.invoke(NativeMethodAccessorImpl.java:62)
at sun.reflect.DelegatingMethodAccessorImpl.invoke(DelegatingMethodAccessorImpl.java:43)
at java.lang.reflect.Method.invoke(Method.java:498)
at com.carrotsearch.randomizedtesting.RandomizedRunner.invoke(RandomizedRunner.java:1764)
at com.carrotsearch.randomizedtesting.RandomizedRunner$8.evaluate(RandomizedRunner.java:871)
at com.carrotsearch.randomizedtesting.RandomizedRunner$9.evaluate(RandomizedRunner.java:907)
at com.carrotsearch.randomizedtesting.RandomizedRunner$10.evaluate(RandomizedRunner.java:921)
at com.carrotsearch.randomizedtesting.rules.SystemPropertiesRestoreRule$1.evaluate(SystemPropertiesRestoreRule.java:57)
at org.apache.lucene.util.TestRuleSetupTeardownChained$1.evaluate(TestRuleSetupTeardownChained.java:49)
at org.apache.lucene.util.AbstractBeforeAfterRule$1.evaluate(AbstractBeforeAfterRule.java:45)
at org.apache.lucene.util.TestRuleThreadAndTestName$1.evaluate(TestRuleThreadAndTestName.java:48)
at org.apache.lucene.util.TestRuleIgnoreAfterMaxFailures$1.evaluate(TestRuleIgnoreAfterMaxFailures.java:64)
at org.apache.lucene.util.TestRuleMarkFailure$1.evaluate(TestRuleMarkFailure.java:47)
at com.carrotsearch.randomizedtesting.rules.StatementAdapter.evaluate(StatementAdapter.java:36)
at com.carrotsearch.randomizedtesting.ThreadLeakControl$StatementRunner.run(ThreadLeakControl.java:367)
at com.carrotsearch.randomizedtesting.ThreadLeakControl.forkTimeoutingTask(ThreadLeakControl.java:809)
at com.carrotsearch.randomizedtesting.ThreadLeakControl$3.evaluate(ThreadLeakControl.java:460)
at com.carrotsearch.randomizedtesting.RandomizedRunner.runSingleTest(RandomizedRunner.java:880)
at com.carrotsearch.randomizedtesting.RandomizedRunner$5.evaluate(RandomizedRunner.java:781)
at com.carrotsearch.randomizedtesting.RandomizedRunner$6.evaluate(RandomizedRunner.java:816)
at com.carrotsearch.randomizedtesting.RandomizedRunner$7.evaluate(RandomizedRunner.java:827)
at com.carrotsearch.randomizedtesting.rules.StatementAdapter.evaluate(StatementAdapter.java:36)
at com.carrotsearch.randomizedtesting.rules.SystemPropertiesRestoreRule$1.evaluate(SystemPropertiesRestoreRule.java:57)
at org.apache.lucene.util.AbstractBeforeAfterRule$1.evaluate(AbstractBeforeAfterRule.java:45)
at com.carrotsearch.randomizedtesting.rules.StatementAdapter.evaluate(StatementAdapter.java:36)
at org.apache.lucene.util.TestRuleStoreClassName$1.evaluate(TestRuleStoreClassName.java:41)
at com.carrotsearch.randomizedtesting.rules.NoShadowingOrOverridesOnMethodsRule$1.evaluate(NoShadowingOrOverridesOnMethodsRule.java:40)
at com.carrotsearch.randomizedtesting.rules.NoShadowingOrOverridesOnMethodsRule$1.evaluate(NoShadowingOrOverridesOnMethodsRule.java:40)
at com.carrotsearch.randomizedtesting.rules.StatementAdapter.evaluate(StatementAdapter.java:36)
at com.carrotsearch.randomizedtesting.rules.StatementAdapter.evaluate(StatementAdapter.java:36)
at com.carrotsearch.randomizedtesting.rules.StatementAdapter.evaluate(StatementAdapter.java:36)
at org.apache.lucene.util.TestRuleAssertionsRequired$1.evaluate(TestRuleAssertionsRequired.java:53)
at org.apache.lucene.util.TestRuleMarkFailure$1.evaluate(TestRuleMarkFailure.java:47)
at org.apache.lucene.util.TestRuleIgnoreAfterMaxFailures$1.evaluate(TestRuleIgnoreAfterMaxFailures.java:64)
at org.apache.lucene.util.TestRuleIgnoreTestSuites$1.evaluate(TestRuleIgnoreTestSuites.java:54)
at com.carrotsearch.randomizedtesting.rules.StatementAdapter.evaluate(StatementAdapter.java:36)
at com.carrotsearch.randomizedtesting.ThreadLeakControl$StatementRunner.run(ThreadLeakControl.java:367)
at java.lang.Thread.run(Thread.java:745)
Build Log:
[...truncated 13127 lines...]
[junit4] Suite: org.apache.solr.common.cloud.TestCollectionStateWatchers
[junit4] 2> Creating dataDir: C:\Users\jenkins\workspace\Lucene-Solr-master-Windows\solr\build\solr-solrj\test\J0\temp\solr.common.cloud.TestCollectionStateWatchers_ACE149333A9DD931-001\init-core-data-001
[junit4] 2> 150515 INFO (SUITE-TestCollectionStateWatchers-seed#[ACE149333A9DD931]-worker) [ ] o.a.s.SolrTestCaseJ4 Randomized ssl (false) and clientAuth (false) via: @org.apache.solr.util.RandomizeSSL(reason=, value=NaN, ssl=NaN, clientAuth=NaN)
[junit4] 2> 150517 INFO (SUITE-TestCollectionStateWatchers-seed#[ACE149333A9DD931]-worker) [ ] o.a.s.c.ZkTestServer STARTING ZK TEST SERVER
[junit4] 2> 150518 INFO (Thread-664) [ ] o.a.s.c.ZkTestServer client port:0.0.0.0/0.0.0.0:0
[junit4] 2> 150518 INFO (Thread-664) [ ] o.a.s.c.ZkTestServer Starting server
[junit4] 2> 150618 INFO (SUITE-TestCollectionStateWatchers-seed#[ACE149333A9DD931]-worker) [ ] o.a.s.c.ZkTestServer start zk server on port:52773
[junit4] 2> 150618 INFO (SUITE-TestCollectionStateWatchers-seed#[ACE149333A9DD931]-worker) [ ] o.a.s.c.c.SolrZkClient Using default ZkCredentialsProvider
[junit4] 2> 150619 INFO (SUITE-TestCollectionStateWatchers-seed#[ACE149333A9DD931]-worker) [ ] o.a.s.c.c.ConnectionManager Waiting for client to connect to ZooKeeper
[junit4] 2> 150627 INFO (zkCallback-242-thread-1) [ ] o.a.s.c.c.ConnectionManager Watcher org.apache.solr.common.cloud.ConnectionManager@67658b76 name:ZooKeeperConnection Watcher:127.0.0.1:52773 got event WatchedEvent state:SyncConnected type:None path:null path:null type:None
[junit4] 2> 150628 INFO (SUITE-TestCollectionStateWatchers-seed#[ACE149333A9DD931]-worker) [ ] o.a.s.c.c.ConnectionManager Client is connected to ZooKeeper
[junit4] 2> 150628 INFO (SUITE-TestCollectionStateWatchers-seed#[ACE149333A9DD931]-worker) [ ] o.a.s.c.c.SolrZkClient Using default ZkACLProvider
[junit4] 2> 150628 INFO (SUITE-TestCollectionStateWatchers-seed#[ACE149333A9DD931]-worker) [ ] o.a.s.c.c.SolrZkClient makePath: /solr/solr.xml
[junit4] 2> 150639 WARN (NIOServerCxn.Factory:0.0.0.0/0.0.0.0:0) [ ] o.a.z.s.NIOServerCnxn caught end of stream exception
[junit4] 2> EndOfStreamException: Unable to read additional data from client sessionid 0x155a1b4b4f50000, likely client has closed socket
[junit4] 2> at org.apache.zookeeper.server.NIOServerCnxn.doIO(NIOServerCnxn.java:228)
[junit4] 2> at org.apache.zookeeper.server.NIOServerCnxnFactory.run(NIOServerCnxnFactory.java:208)
[junit4] 2> at java.lang.Thread.run(Thread.java:745)
[junit4] 2> 150642 INFO (jetty-launcher-241-thread-2) [ ] o.e.j.s.Server jetty-9.3.8.v20160314
[junit4] 2> 150644 INFO (jetty-launcher-241-thread-3) [ ] o.e.j.s.Server jetty-9.3.8.v20160314
[junit4] 2> 150644 INFO (jetty-launcher-241-thread-2) [ ] o.e.j.s.h.ContextHandler Started o.e.j.s.ServletContextHandler@abe5a5d{/solr,null,AVAILABLE}
[junit4] 2> 150645 INFO (jetty-launcher-241-thread-3) [ ] o.e.j.s.h.ContextHandler Started o.e.j.s.ServletContextHandler@1974fc47{/solr,null,AVAILABLE}
[junit4] 2> 150646 INFO (jetty-launcher-241-thread-2) [ ] o.e.j.s.ServerConnector Started ServerConnector@61b9d031{HTTP/1.1,[http/1.1]}{127.0.0.1:52777}
[junit4] 2> 150646 INFO (jetty-launcher-241-thread-2) [ ] o.e.j.s.Server Started @158394ms
[junit4] 2> 150646 INFO (jetty-launcher-241-thread-2) [ ] o.a.s.c.s.e.JettySolrRunner Jetty properties: {hostContext=/solr, hostPort=52777}
[junit4] 2> 150647 INFO (jetty-launcher-241-thread-3) [ ] o.e.j.s.ServerConnector Started ServerConnector@5aadf7b6{HTTP/1.1,[http/1.1]}{127.0.0.1:52780}
[junit4] 2> 150647 INFO (jetty-launcher-241-thread-2) [ ] o.a.s.s.SolrDispatchFilter SolrDispatchFilter.init(): sun.misc.Launcher$AppClassLoader@73d16e93
[junit4] 2> 150647 INFO (jetty-launcher-241-thread-3) [ ] o.e.j.s.Server Started @158394ms
[junit4] 2> 150647 INFO (jetty-launcher-241-thread-2) [ ] o.a.s.c.SolrResourceLoader new SolrResourceLoader for directory: 'C:\Users\jenkins\workspace\Lucene-Solr-master-Windows\solr\build\solr-solrj\test\J0\temp\solr.common.cloud.TestCollectionStateWatchers_ACE149333A9DD931-001\tempDir-001\node2'
[junit4] 2> 150647 INFO (jetty-launcher-241-thread-3) [ ] o.a.s.c.s.e.JettySolrRunner Jetty properties: {hostContext=/solr, hostPort=52780}
[junit4] 2> 150647 INFO (jetty-launcher-241-thread-2) [ ] o.a.s.c.SolrResourceLoader JNDI not configured for solr (NoInitialContextEx)
[junit4] 2> 150647 INFO (jetty-launcher-241-thread-2) [ ] o.a.s.c.SolrResourceLoader solr home defaulted to 'solr/' (could not find system property or JNDI)
[junit4] 2> 150647 INFO (jetty-launcher-241-thread-3) [ ] o.a.s.s.SolrDispatchFilter SolrDispatchFilter.init(): sun.misc.Launcher$AppClassLoader@73d16e93
[junit4] 2> 150647 INFO (jetty-launcher-241-thread-3) [ ] o.a.s.c.SolrResourceLoader new SolrResourceLoader for directory: 'C:\Users\jenkins\workspace\Lucene-Solr-master-Windows\solr\build\solr-solrj\test\J0\temp\solr.common.cloud.TestCollectionStateWatchers_ACE149333A9DD931-001\tempDir-001\node3'
[junit4] 2> 150648 INFO (jetty-launcher-241-thread-2) [ ] o.a.s.c.c.SolrZkClient Using default ZkCredentialsProvider
[junit4] 2> 150649 INFO (jetty-launcher-241-thread-3) [ ] o.a.s.c.SolrResourceLoader JNDI not configured for solr (NoInitialContextEx)
[junit4] 2> 150649 INFO (jetty-launcher-241-thread-3) [ ] o.a.s.c.SolrResourceLoader solr home defaulted to 'solr/' (could not find system property or JNDI)
[junit4] 2> 150649 INFO (jetty-launcher-241-thread-2) [ ] o.a.s.c.c.ConnectionManager Waiting for client to connect to ZooKeeper
[junit4] 2> 150649 INFO (jetty-launcher-241-thread-3) [ ] o.a.s.c.c.SolrZkClient Using default ZkCredentialsProvider
[junit4] 2> 150649 INFO (jetty-launcher-241-thread-1) [ ] o.e.j.s.Server jetty-9.3.8.v20160314
[junit4] 2> 150650 INFO (jetty-launcher-241-thread-1) [ ] o.e.j.s.h.ContextHandler Started o.e.j.s.ServletContextHandler@1fbe8a0{/solr,null,AVAILABLE}
[junit4] 2> 150650 INFO (jetty-launcher-241-thread-3) [ ] o.a.s.c.c.ConnectionManager Waiting for client to connect to ZooKeeper
[junit4] 2> 150651 INFO (jetty-launcher-241-thread-1) [ ] o.e.j.s.ServerConnector Started ServerConnector@31fb1380{HTTP/1.1,[http/1.1]}{127.0.0.1:52787}
[junit4] 2> 150651 INFO (jetty-launcher-241-thread-1) [ ] o.e.j.s.Server Started @158398ms
[junit4] 2> 150651 INFO (jetty-launcher-241-thread-1) [ ] o.a.s.c.s.e.JettySolrRunner Jetty properties: {hostContext=/solr, hostPort=52787}
[junit4] 2> 150651 INFO (jetty-launcher-241-thread-1) [ ] o.a.s.s.SolrDispatchFilter SolrDispatchFilter.init(): sun.misc.Launcher$AppClassLoader@73d16e93
[junit4] 2> 150651 INFO (jetty-launcher-241-thread-1) [ ] o.a.s.c.SolrResourceLoader new SolrResourceLoader for directory: 'C:\Users\jenkins\workspace\Lucene-Solr-master-Windows\solr\build\solr-solrj\test\J0\temp\solr.common.cloud.TestCollectionStateWatchers_ACE149333A9DD931-001\tempDir-001\node1'
[junit4] 2> 150651 INFO (jetty-launcher-241-thread-1) [ ] o.a.s.c.SolrResourceLoader JNDI not configured for solr (NoInitialContextEx)
[junit4] 2> 150651 INFO (jetty-launcher-241-thread-1) [ ] o.a.s.c.SolrResourceLoader solr home defaulted to 'solr/' (could not find system property or JNDI)
[junit4] 2> 150652 INFO (jetty-launcher-241-thread-4) [ ] o.e.j.s.Server jetty-9.3.8.v20160314
[junit4] 2> 150653 INFO (jetty-launcher-241-thread-4) [ ] o.e.j.s.h.ContextHandler Started o.e.j.s.ServletContextHandler@647d55a9{/solr,null,AVAILABLE}
[junit4] 2> 150653 INFO (jetty-launcher-241-thread-1) [ ] o.a.s.c.c.SolrZkClient Using default ZkCredentialsProvider
[junit4] 2> 150654 INFO (jetty-launcher-241-thread-4) [ ] o.e.j.s.ServerConnector Started ServerConnector@3b4411cc{HTTP/1.1,[http/1.1]}{127.0.0.1:52790}
[junit4] 2> 150654 INFO (jetty-launcher-241-thread-1) [ ] o.a.s.c.c.ConnectionManager Waiting for client to connect to ZooKeeper
[junit4] 2> 150654 INFO (jetty-launcher-241-thread-4) [ ] o.e.j.s.Server Started @158401ms
[junit4] 2> 150654 INFO (jetty-launcher-241-thread-4) [ ] o.a.s.c.s.e.JettySolrRunner Jetty properties: {hostContext=/solr, hostPort=52790}
[junit4] 2> 150654 INFO (jetty-launcher-241-thread-4) [ ] o.a.s.s.SolrDispatchFilter SolrDispatchFilter.init(): sun.misc.Launcher$AppClassLoader@73d16e93
[junit4] 2> 150654 INFO (jetty-launcher-241-thread-4) [ ] o.a.s.c.SolrResourceLoader new SolrResourceLoader for directory: 'C:\Users\jenkins\workspace\Lucene-Solr-master-Windows\solr\build\solr-solrj\test\J0\temp\solr.common.cloud.TestCollectionStateWatchers_ACE149333A9DD931-001\tempDir-001\node4'
[junit4] 2> 150654 INFO (jetty-launcher-241-thread-4) [ ] o.a.s.c.SolrResourceLoader JNDI not configured for solr (NoInitialContextEx)
[junit4] 2> 150654 INFO (jetty-launcher-241-thread-4) [ ] o.a.s.c.SolrResourceLoader solr home defaulted to 'solr/' (could not find system property or JNDI)
[junit4] 2> 150655 INFO (jetty-launcher-241-thread-4) [ ] o.a.s.c.c.SolrZkClient Using default ZkCredentialsProvider
[junit4] 2> 150657 INFO (jetty-launcher-241-thread-4) [ ] o.a.s.c.c.ConnectionManager Waiting for client to connect to ZooKeeper
[junit4] 2> 150680 INFO (zkCallback-246-thread-1) [ ] o.a.s.c.c.ConnectionManager Watcher org.apache.solr.common.cloud.ConnectionManager@16b1d266 name:ZooKeeperConnection Watcher:127.0.0.1:52773/solr got event WatchedEvent state:SyncConnected type:None path:null path:null type:None
[junit4] 2> 150680 INFO (jetty-launcher-241-thread-4) [ ] o.a.s.c.c.ConnectionManager Client is connected to ZooKeeper
[junit4] 2> 150681 INFO (jetty-launcher-241-thread-4) [ ] o.a.s.c.c.SolrZkClient Using default ZkACLProvider
[junit4] 2> 150682 INFO (zkCallback-245-thread-1) [ ] o.a.s.c.c.ConnectionManager Watcher org.apache.solr.common.cloud.ConnectionManager@500550cf name:ZooKeeperConnection Watcher:127.0.0.1:52773/solr got event WatchedEvent state:SyncConnected type:None path:null path:null type:None
[junit4] 2> 150682 INFO (zkCallback-244-thread-1) [ ] o.a.s.c.c.ConnectionManager Watcher org.apache.solr.common.cloud.ConnectionManager@6ceb3e01 name:ZooKeeperConnection Watcher:127.0.0.1:52773/solr got event WatchedEvent state:SyncConnected type:None path:null path:null type:None
[junit4] 2> 150682 INFO (jetty-launcher-241-thread-1) [ ] o.a.s.c.c.ConnectionManager Client is connected to ZooKeeper
[junit4] 2> 150682 INFO (zkCallback-243-thread-1) [ ] o.a.s.c.c.ConnectionManager Watcher org.apache.solr.common.cloud.ConnectionManager@2eecaeac name:ZooKeeperConnection Watcher:127.0.0.1:52773/solr got event WatchedEvent state:SyncConnected type:None path:null path:null type:None
[junit4] 2> 150682 INFO (jetty-launcher-241-thread-3) [ ] o.a.s.c.c.ConnectionManager Client is connected to ZooKeeper
[junit4] 2> 150682 INFO (jetty-launcher-241-thread-1) [ ] o.a.s.c.c.SolrZkClient Using default ZkACLProvider
[junit4] 2> 150682 INFO (jetty-launcher-241-thread-2) [ ] o.a.s.c.c.ConnectionManager Client is connected to ZooKeeper
[junit4] 2> 150682 INFO (jetty-launcher-241-thread-3) [ ] o.a.s.c.c.SolrZkClient Using default ZkACLProvider
[junit4] 2> 150682 INFO (jetty-launcher-241-thread-2) [ ] o.a.s.c.c.SolrZkClient Using default ZkACLProvider
[junit4] 2> 150685 INFO (jetty-launcher-241-thread-4) [ ] o.a.s.s.SolrDispatchFilter solr.xml found in ZooKeeper. Loading...
[junit4] 2> 150685 INFO (jetty-launcher-241-thread-3) [ ] o.a.s.s.SolrDispatchFilter solr.xml found in ZooKeeper. Loading...
[junit4] 2> 150686 INFO (jetty-launcher-241-thread-1) [ ] o.a.s.s.SolrDispatchFilter solr.xml found in ZooKeeper. Loading...
[junit4] 2> 150686 INFO (jetty-launcher-241-thread-2) [ ] o.a.s.s.SolrDispatchFilter solr.xml found in ZooKeeper. Loading...
[junit4] 2> 150696 WARN (NIOServerCxn.Factory:0.0.0.0/0.0.0.0:0) [ ] o.a.z.s.NIOServerCnxn caught end of stream exception
[junit4] 2> EndOfStreamException: Unable to read additional data from client sessionid 0x155a1b4b4f50001, likely client has closed socket
[junit4] 2> at org.apache.zookeeper.server.NIOServerCnxn.doIO(NIOServerCnxn.java:228)
[junit4] 2> at org.apache.zookeeper.server.NIOServerCnxnFactory.run(NIOServerCnxnFactory.java:208)
[junit4] 2> at java.lang.Thread.run(Thread.java:745)
[junit4] 2> 150704 WARN (NIOServerCxn.Factory:0.0.0.0/0.0.0.0:0) [ ] o.a.z.s.NIOServerCnxn caught end of stream exception
[junit4] 2> EndOfStreamException: Unable to read additional data from client sessionid 0x155a1b4b4f50004, likely client has closed socket
[junit4] 2> at org.apache.zookeeper.server.NIOServerCnxn.doIO(NIOServerCnxn.java:228)
[junit4] 2> at org.apache.zookeeper.server.NIOServerCnxnFactory.run(NIOServerCnxnFactory.java:208)
[junit4] 2> at java.lang.Thread.run(Thread.java:745)
[junit4] 2> 150704 INFO (jetty-launcher-241-thread-4) [ ] o.a.s.c.CorePropertiesLocator Config-defined core root directory: C:\Users\jenkins\workspace\Lucene-Solr-master-Windows\solr\build\solr-solrj\test\J0\temp\solr.common.cloud.TestCollectionStateWatchers_ACE149333A9DD931-001\tempDir-001\node4\.
[junit4] 2> 150704 INFO (jetty-launcher-241-thread-4) [ ] o.a.s.c.CoreContainer New CoreContainer 1565550666
[junit4] 2> 150705 INFO (jetty-launcher-241-thread-4) [ ] o.a.s.c.CoreContainer Loading cores into CoreContainer [instanceDir=C:\Users\jenkins\workspace\Lucene-Solr-master-Windows\solr\build\solr-solrj\test\J0\temp\solr.common.cloud.TestCollectionStateWatchers_ACE149333A9DD931-001\tempDir-001\node4]
[junit4] 2> 150705 WARN (jetty-launcher-241-thread-4) [ ] o.a.s.c.CoreContainer Couldn't add files from C:\Users\jenkins\workspace\Lucene-Solr-master-Windows\solr\build\solr-solrj\test\J0\temp\solr.common.cloud.TestCollectionStateWatchers_ACE149333A9DD931-001\tempDir-001\node4\lib to classpath: C:\Users\jenkins\workspace\Lucene-Solr-master-Windows\solr\build\solr-solrj\test\J0\temp\solr.common.cloud.TestCollectionStateWatchers_ACE149333A9DD931-001\tempDir-001\node4\lib
[junit4] 2> 150705 INFO (jetty-launcher-241-thread-2) [ ] o.a.s.c.CorePropertiesLocator Config-defined core root directory: C:\Users\jenkins\workspace\Lucene-Solr-master-Windows\solr\build\solr-solrj\test\J0\temp\solr.common.cloud.TestCollectionStateWatchers_ACE149333A9DD931-001\tempDir-001\node2\.
[junit4] 2> 150705 INFO (jetty-launcher-241-thread-2) [ ] o.a.s.c.CoreContainer New CoreContainer 1009520326
[junit4] 2> 150705 INFO (jetty-launcher-241-thread-2) [ ] o.a.s.c.CoreContainer Loading cores into CoreContainer [instanceDir=C:\Users\jenkins\workspace\Lucene-Solr-master-Windows\solr\build\solr-solrj\test\J0\temp\solr.common.cloud.TestCollectionStateWatchers_ACE149333A9DD931-001\tempDir-001\node2]
[junit4] 2> 150705 WARN (jetty-launcher-241-thread-2) [ ] o.a.s.c.CoreContainer Couldn't add files from C:\Users\jenkins\workspace\Lucene-Solr-master-Windows\solr\build\solr-solrj\test\J0\temp\solr.common.cloud.TestCollectionStateWatchers_ACE149333A9DD931-001\tempDir-001\node2\lib to classpath: C:\Users\jenkins\workspace\Lucene-Solr-master-Windows\solr\build\solr-solrj\test\J0\temp\solr.common.cloud.TestCollectionStateWatchers_ACE149333A9DD931-001\tempDir-001\node2\lib
[junit4] 2> 150705 INFO (jetty-launcher-241-thread-2) [ ] o.a.s.h.c.HttpShardHandlerFactory created with socketTimeout : 90000,urlScheme : ,connTimeout : 15000,maxConnectionsPerHost : 20,maxConnections : 10000,corePoolSize : 0,maximumPoolSize : 2147483647,maxThreadIdleTime : 5,sizeOfQueue : -1,fairnessPolicy : false,
[junit4] 2> 150704 INFO (jetty-launcher-241-thread-1) [ ] o.a.s.c.CorePropertiesLocator Config-defined core root directory: C:\Users\jenkins\workspace\Lucene-Solr-master-Windows\solr\build\solr-solrj\test\J0\temp\solr.common.cloud.TestCollectionStateWatchers_ACE149333A9DD931-001\tempDir-001\node1\.
[junit4] 2> 150708 INFO (jetty-launcher-241-thread-1) [ ] o.a.s.c.CoreContainer New CoreContainer 1320227241
[junit4] 2> 150708 INFO (jetty-launcher-241-thread-1) [ ] o.a.s.c.CoreContainer Loading cores into CoreContainer [instanceDir=C:\Users\jenkins\workspace\Lucene-Solr-master-Windows\solr\build\solr-solrj\test\J0\temp\solr.common.cloud.TestCollectionStateWatchers_ACE149333A9DD931-001\tempDir-001\node1]
[junit4] 2> 150708 WARN (jetty-launcher-241-thread-1) [ ] o.a.s.c.CoreContainer Couldn't add files from C:\Users\jenkins\workspace\Lucene-Solr-master-Windows\solr\build\solr-solrj\test\J0\temp\solr.common.cloud.TestCollectionStateWatchers_ACE149333A9DD931-001\tempDir-001\node1\lib to classpath: C:\Users\jenkins\workspace\Lucene-Solr-master-Windows\solr\build\solr-solrj\test\J0\temp\solr.common.cloud.TestCollectionStateWatchers_ACE149333A9DD931-001\tempDir-001\node1\lib
[junit4] 2> 150708 INFO (jetty-launcher-241-thread-1) [ ] o.a.s.h.c.HttpShardHandlerFactory created with socketTimeout : 90000,urlScheme : ,connTimeout : 15000,maxConnectionsPerHost : 20,maxConnections : 10000,corePoolSize : 0,maximumPoolSize : 2147483647,maxThreadIdleTime : 5,sizeOfQueue : -1,fairnessPolicy : false,
[junit4] 2> 150708 INFO (jetty-launcher-241-thread-2) [ ] o.a.s.u.UpdateShardHandler Creating UpdateShardHandler HTTP client with params:
[junit4] 2> 150709 INFO (jetty-launcher-241-thread-1) [ ] o.a.s.u.UpdateShardHandler Creating UpdateShardHandler HTTP client with params:
[junit4] 2> 150709 INFO (jetty-launcher-241-thread-2) [ ] o.a.s.l.LogWatcher SLF4J impl is org.slf4j.impl.Log4jLoggerFactory
[junit4] 2> 150709 INFO (jetty-launcher-241-thread-2) [ ] o.a.s.l.LogWatcher Registering Log Listener [Log4j (org.slf4j.impl.Log4jLoggerFactory)]
[junit4] 2> 150709 INFO (jetty-launcher-241-thread-2) [ ] o.a.s.c.ZkContainer Zookeeper client=127.0.0.1:52773/solr
[junit4] 2> 150709 INFO (jetty-launcher-241-thread-2) [ ] o.a.s.c.ZkController zkHost includes chroot
[junit4] 2> 150709 INFO (jetty-launcher-241-thread-2) [ ] o.a.s.c.c.SolrZkClient Using default ZkCredentialsProvider
[junit4] 2> 150709 INFO (jetty-launcher-241-thread-1) [ ] o.a.s.l.LogWatcher SLF4J impl is org.slf4j.impl.Log4jLoggerFactory
[junit4] 2> 150709 INFO (jetty-launcher-241-thread-1) [ ] o.a.s.l.LogWatcher Registering Log Listener [Log4j (org.slf4j.impl.Log4jLoggerFactory)]
[junit4] 2> 150709 INFO (jetty-launcher-241-thread-1) [ ] o.a.s.c.ZkContainer Zookeeper client=127.0.0.1:52773/solr
[junit4] 2> 150709 INFO (jetty-launcher-241-thread-1) [ ] o.a.s.c.ZkController zkHost includes chroot
[junit4] 2> 150709 INFO (jetty-launcher-241-thread-1) [ ] o.a.s.c.c.SolrZkClient Using default ZkCredentialsProvider
[junit4] 2> 150710 INFO (jetty-launcher-241-thread-2) [ ] o.a.s.c.c.ConnectionManager Waiting for client to connect to ZooKeeper
[junit4] 2> 150710 INFO (jetty-launcher-241-thread-4) [ ] o.a.s.h.c.HttpShardHandlerFactory created with socketTimeout : 90000,urlScheme : ,connTimeout : 15000,maxConnectionsPerHost : 20,maxConnections : 10000,corePoolSize : 0,maximumPoolSize : 2147483647,maxThreadIdleTime : 5,sizeOfQueue : -1,fairnessPolicy : false,
[junit4] 2> 150710 INFO (jetty-launcher-241-thread-1) [ ] o.a.s.c.c.ConnectionManager Waiting for client to connect to ZooKeeper
[junit4] 2> 150713 INFO (jetty-launcher-241-thread-4) [ ] o.a.s.u.UpdateShardHandler Creating UpdateShardHandler HTTP client with params:
[junit4] 2> 150713 INFO (jetty-launcher-241-thread-4) [ ] o.a.s.l.LogWatcher SLF4J impl is org.slf4j.impl.Log4jLoggerFactory
[junit4] 2> 150713 INFO (jetty-launcher-241-thread-4) [ ] o.a.s.l.LogWatcher Registering Log Listener [Log4j (org.slf4j.impl.Log4jLoggerFactory)]
[junit4] 2> 150713 INFO (jetty-launcher-241-thread-4) [ ] o.a.s.c.ZkContainer Zookeeper client=127.0.0.1:52773/solr
[junit4] 2> 150713 INFO (jetty-launcher-241-thread-4) [ ] o.a.s.c.ZkController zkHost includes chroot
[junit4] 2> 150713 INFO (jetty-launcher-241-thread-4) [ ] o.a.s.c.c.SolrZkClient Using default ZkCredentialsProvider
[junit4] 2> 150718 INFO (jetty-launcher-241-thread-3) [ ] o.a.s.c.CorePropertiesLocator Config-defined core root directory: C:\Users\jenkins\workspace\Lucene-Solr-master-Windows\solr\build\solr-solrj\test\J0\temp\solr.common.cloud.TestCollectionStateWatchers_ACE149333A9DD931-001\tempDir-001\node3\.
[junit4] 2> 150718 INFO (jetty-launcher-241-thread-3) [ ] o.a.s.c.CoreContainer New CoreContainer 1810677098
[junit4] 2> 150718 INFO (jetty-launcher-241-thread-3) [ ] o.a.s.c.CoreContainer Loading cores into CoreContainer [instanceDir=C:\Users\jenkins\workspace\Lucene-Solr-master-Windows\solr\build\solr-solrj\test\J0\temp\solr.common.cloud.TestCollectionStateWatchers_ACE149333A9DD931-001\tempDir-001\node3]
[junit4] 2> 150718 INFO (jetty-launcher-241-thread-4) [ ] o.a.s.c.c.ConnectionManager Waiting for client to connect to ZooKeeper
[junit4] 2> 150718 WARN (jetty-launcher-241-thread-3) [ ] o.a.s.c.CoreContainer Couldn't add files from C:\Users\jenkins\workspace\Lucene-Solr-master-Windows\solr\build\solr-solrj\test\J0\temp\solr.common.cloud.TestCollectionStateWatchers_ACE149333A9DD931-001\tempDir-001\node3\lib to classpath: C:\Users\jenkins\workspace\Lucene-Solr-master-Windows\solr\build\solr-solrj\test\J0\temp\solr.common.cloud.TestCollectionStateWatchers_ACE149333A9DD931-001\tempDir-001\node3\lib
[junit4] 2> 150718 INFO (jetty-launcher-241-thread-3) [ ] o.a.s.h.c.HttpShardHandlerFactory created with socketTimeout : 90000,urlScheme : ,connTimeout : 15000,maxConnectionsPerHost : 20,maxConnections : 10000,corePoolSize : 0,maximumPoolSize : 2147483647,maxThreadIdleTime : 5,sizeOfQueue : -1,fairnessPolicy : false,
[junit4] 2> 150719 INFO (jetty-launcher-241-thread-3) [ ] o.a.s.u.UpdateShardHandler Creating UpdateShardHandler HTTP client with params:
[junit4] 2> 150720 INFO (jetty-launcher-241-thread-3) [ ] o.a.s.l.LogWatcher SLF4J impl is org.slf4j.impl.Log4jLoggerFactory
[junit4] 2> 150720 INFO (jetty-launcher-241-thread-3) [ ] o.a.s.l.LogWatcher Registering Log Listener [Log4j (org.slf4j.impl.Log4jLoggerFactory)]
[junit4] 2> 150720 INFO (jetty-launcher-241-thread-3) [ ] o.a.s.c.ZkContainer Zookeeper client=127.0.0.1:52773/solr
[junit4] 2> 150720 INFO (jetty-launcher-241-thread-3) [ ] o.a.s.c.ZkController zkHost includes chroot
[junit4] 2> 150720 INFO (jetty-launcher-241-thread-3) [ ] o.a.s.c.c.SolrZkClient Using default ZkCredentialsProvider
[junit4] 2> 150721 INFO (jetty-launcher-241-thread-3) [ ] o.a.s.c.c.ConnectionManager Waiting for client to connect to ZooKeeper
[junit4] 2> 150723 INFO (zkCallback-252-thread-1) [ ] o.a.s.c.c.ConnectionManager Watcher org.apache.solr.common.cloud.ConnectionManager@4d59d44d name:ZooKeeperConnection Watcher:127.0.0.1:52773 got event WatchedEvent state:SyncConnected type:None path:null path:null type:None
[junit4] 2> 150723 INFO (zkCallback-251-thread-1) [ ] o.a.s.c.c.ConnectionManager Watcher org.apache.solr.common.cloud.ConnectionManager@3094d231 name:ZooKeeperConnection Watcher:127.0.0.1:52773 got event WatchedEvent state:SyncConnected type:None path:null path:null type:None
[junit4] 2> 150724 INFO (jetty-launcher-241-thread-1) [ ] o.a.s.c.c.ConnectionManager Client is connected to ZooKeeper
[junit4] 2> 150724 INFO (jetty-launcher-241-thread-1) [ ] o.a.s.c.c.SolrZkClient Using default ZkACLProvider
[junit4] 2> 150724 INFO (jetty-launcher-241-thread-2) [ ] o.a.s.c.c.ConnectionManager Client is connected to ZooKeeper
[junit4] 2> 150724 INFO (jetty-launcher-241-thread-2) [ ] o.a.s.c.c.SolrZkClient Using default ZkACLProvider
[junit4] 2> 150729 INFO (zkCallback-258-thread-1) [ ] o.a.s.c.c.ConnectionManager Watcher org.apache.solr.common.cloud.ConnectionManager@5b28cfbf name:ZooKeeperConnection Watcher:127.0.0.1:52773 got event WatchedEvent state:SyncConnected type:None path:null path:null type:None
[junit4] 2> 150729 INFO (jetty-launcher-241-thread-3) [ ] o.a.s.c.c.ConnectionManager Client is connected to ZooKeeper
[junit4] 2> 150730 INFO (jetty-launcher-241-thread-3) [ ] o.a.s.c.c.SolrZkClient Using default ZkACLProvider
[junit4] 2> 150731 WARN (NIOServerCxn.Factory:0.0.0.0/0.0.0.0:0) [ ] o.a.z.s.NIOServerCnxn caught end of stream exception
[junit4] 2> EndOfStreamException: Unable to read additional data from client sessionid 0x155a1b4b4f50005, likely client has closed socket
[junit4] 2> at org.apache.zookeeper.server.NIOServerCnxn.doIO(NIOServerCnxn.java:228)
[junit4] 2> at org.apache.zookeeper.server.NIOServerCnxnFactory.run(NIOServerCnxnFactory.java:208)
[junit4] 2> at java.lang.Thread.run(Thread.java:745)
[junit4] 2> 150732 INFO (zkCallback-255-thread-1) [ ] o.a.s.c.c.ConnectionManager Watcher org.apache.solr.common.cloud.ConnectionManager@cbf5cbb name:ZooKeeperConnection Watcher:127.0.0.1:52773 got event WatchedEvent state:SyncConnected type:None path:null path:null type:None
[junit4] 2> 150733 INFO (jetty-launcher-241-thread-4) [ ] o.a.s.c.c.ConnectionManager Client is connected to ZooKeeper
[junit4] 2> 150733 INFO (jetty-launcher-241-thread-4) [ ] o.a.s.c.c.SolrZkClient Using default ZkACLProvider
[junit4] 2> 150736 INFO (jetty-launcher-241-thread-2) [n:127.0.0.1:52777_solr ] o.a.s.c.ZkController Added new OnReconnect listener org.apache.solr.cloud.ZkController$$Lambda$54/1171479364@6d3f15f6
[junit4] 2> 150737 INFO (jetty-launcher-241-thread-2) [n:127.0.0.1:52777_solr ] o.a.s.c.c.ConnectionManager Waiting for client to connect to ZooKeeper
[junit4] 2> 150744 INFO (jetty-launcher-241-thread-1) [n:127.0.0.1:52787_solr ] o.a.s.c.ZkController Added new OnReconnect listener org.apache.solr.cloud.ZkController$$Lambda$54/1171479364@1f2e5748
[junit4] 2> 150745 INFO (jetty-launcher-241-thread-3) [n:127.0.0.1:52780_solr ] o.a.s.c.ZkController Added new OnReconnect listener org.apache.solr.cloud.ZkController$$Lambda$54/1171479364@6dfb37a4
[junit4] 2> 150746 INFO (jetty-launcher-241-thread-4) [n:127.0.0.1:52790_solr ] o.a.s.c.ZkController Added new OnReconnect listener org.apache.solr.cloud.ZkController$$Lambda$54/1171479364@259b6a95
[junit4] 2> 150747 INFO (jetty-launcher-241-thread-4) [n:127.0.0.1:52790_solr ] o.a.s.c.c.ConnectionManager Waiting for client to connect to ZooKeeper
[junit4] 2> 150748 INFO (jetty-launcher-241-thread-3) [n:127.0.0.1:52780_solr ] o.a.s.c.c.ConnectionManager Waiting for client to connect to ZooKeeper
[junit4] 2> 150750 INFO (jetty-launcher-241-thread-1) [n:127.0.0.1:52787_solr ] o.a.s.c.c.ConnectionManager Waiting for client to connect to ZooKeeper
[junit4] 2> 150750 INFO (zkCallback-259-thread-1-processing-n:127.0.0.1:52777_solr) [n:127.0.0.1:52777_solr ] o.a.s.c.c.ConnectionManager Watcher org.apache.solr.common.cloud.ConnectionManager@65e47426 name:ZooKeeperConnection Watcher:127.0.0.1:52773/solr got event WatchedEvent state:SyncConnected type:None path:null path:null type:None
[junit4] 2> 150751 INFO (jetty-launcher-241-thread-2) [n:127.0.0.1:52777_solr ] o.a.s.c.c.ConnectionManager Client is connected to ZooKeeper
[junit4] 2> 150754 INFO (zkCallback-260-thread-1-processing-n:127.0.0.1:52787_solr) [n:127.0.0.1:52787_solr ] o.a.s.c.c.ConnectionManager Watcher org.apache.solr.common.cloud.ConnectionManager@5bff4dea name:ZooKeeperConnection Watcher:127.0.0.1:52773/solr got event WatchedEvent state:SyncConnected type:None path:null path:null type:None
[junit4] 2> 150754 INFO (jetty-launcher-241-thread-2) [n:127.0.0.1:52777_solr ] o.a.s.c.c.SolrZkClient makePath: /overseer/queue
[junit4] 2> 150754 INFO (jetty-launcher-241-thread-1) [n:127.0.0.1:52787_solr ] o.a.s.c.c.ConnectionManager Client is connected to ZooKeeper
[junit4] 2> 150756 INFO (zkCallback-262-thread-1-processing-n:127.0.0.1:52790_solr) [n:127.0.0.1:52790_solr ] o.a.s.c.c.ConnectionManager Watcher org.apache.solr.common.cloud.ConnectionManager@3ca24140 name:ZooKeeperConnection Watcher:127.0.0.1:52773/solr got event WatchedEvent state:SyncConnected type:None path:null path:null type:None
[junit4] 2> 150756 INFO (jetty-launcher-241-thread-4) [n:127.0.0.1:52790_solr ] o.a.s.c.c.ConnectionManager Client is connected to ZooKeeper
[junit4] 2> 150756 INFO (zkCallback-261-thread-1-processing-n:127.0.0.1:52780_solr) [n:127.0.0.1:52780_solr ] o.a.s.c.c.ConnectionManager Watcher org.apache.solr.common.cloud.ConnectionManager@7b27e64d name:ZooKeeperConnection Watcher:127.0.0.1:52773/solr got event WatchedEvent state:SyncConnected type:None path:null path:null type:None
[junit4] 2> 150758 INFO (jetty-launcher-241-thread-3) [n:127.0.0.1:52780_solr ] o.a.s.c.c.ConnectionManager Client is connected to ZooKeeper
[junit4] 2> 150760 INFO (jetty-launcher-241-thread-1) [n:127.0.0.1:52787_solr ] o.a.s.c.c.SolrZkClient makePath: /overseer/queue
[junit4] 2> 150760 INFO (jetty-launcher-241-thread-4) [n:127.0.0.1:52790_solr ] o.a.s.c.c.SolrZkClient makePath: /overseer/queue
[junit4] 2> 150761 INFO (jetty-launcher-241-thread-3) [n:127.0.0.1:52780_solr ] o.a.s.c.c.SolrZkClient makePath: /overseer/queue
[junit4] 2> 150768 INFO (jetty-launcher-241-thread-2) [n:127.0.0.1:52777_solr ] o.a.s.c.c.SolrZkClient makePath: /overseer/collection-queue-work
[junit4] 2> 150769 INFO (jetty-launcher-241-thread-1) [n:127.0.0.1:52787_solr ] o.a.s.c.c.SolrZkClient makePath: /overseer/collection-queue-work
[junit4] 2> 150769 INFO (jetty-launcher-241-thread-4) [n:127.0.0.1:52790_solr ] o.a.s.c.c.SolrZkClient makePath: /overseer/collection-queue-work
[junit4] 2> 150770 INFO (jetty-launcher-241-thread-3) [n:127.0.0.1:52780_solr ] o.a.s.c.c.SolrZkClient makePath: /overseer/collection-queue-work
[junit4] 2> 150775 INFO (jetty-launcher-241-thread-2) [n:127.0.0.1:52777_solr ] o.a.s.c.c.SolrZkClient makePath: /overseer/collection-map-running
[junit4] 2> 150776 INFO (jetty-launcher-241-thread-4) [n:127.0.0.1:52790_solr ] o.a.s.c.c.SolrZkClient makePath: /overseer/collection-map-running
[junit4] 2> 150776 INFO (jetty-launcher-241-thread-3) [n:127.0.0.1:52780_solr ] o.a.s.c.c.SolrZkClient makePath: /overseer/collection-map-running
[junit4] 2> 150776 INFO (jetty-launcher-241-thread-1) [n:127.0.0.1:52787_solr ] o.a.s.c.c.SolrZkClient makePath: /overseer/collection-map-running
[junit4] 2> 150780 INFO (jetty-launcher-241-thread-2) [n:127.0.0.1:52777_solr ] o.a.s.c.c.SolrZkClient makePath: /overseer/collection-map-completed
[junit4] 2> 150780 INFO (jetty-launcher-241-thread-1) [n:127.0.0.1:52787_solr ] o.a.s.c.c.SolrZkClient makePath: /overseer/collection-map-completed
[junit4] 2> 150780 INFO (jetty-launcher-241-thread-3) [n:127.0.0.1:52780_solr ] o.a.s.c.c.SolrZkClient makePath: /overseer/collection-map-completed
[junit4] 2> 150780 INFO (jetty-launcher-241-thread-4) [n:127.0.0.1:52790_solr ] o.a.s.c.c.SolrZkClient makePath: /overseer/collection-map-completed
[junit4] 2> 150784 INFO (jetty-launcher-241-thread-1) [n:127.0.0.1:52787_solr ] o.a.s.c.c.SolrZkClient makePath: /overseer/collection-map-failure
[junit4] 2> 150784 INFO (jetty-launcher-241-thread-3) [n:127.0.0.1:52780_solr ] o.a.s.c.c.SolrZkClient makePath: /overseer/collection-map-failure
[junit4] 2> 150785 INFO (jetty-launcher-241-thread-4) [n:127.0.0.1:52790_solr ] o.a.s.c.c.SolrZkClient makePath: /overseer/collection-map-failure
[junit4] 2> 150785 INFO (jetty-launcher-241-thread-2) [n:127.0.0.1:52777_solr ] o.a.s.c.c.SolrZkClient makePath: /overseer/collection-map-failure
[junit4] 2> 150788 INFO (jetty-launcher-241-thread-3) [n:127.0.0.1:52780_solr ] o.a.s.c.c.SolrZkClient makePath: /live_nodes
[junit4] 2> 150788 INFO (jetty-launcher-241-thread-1) [n:127.0.0.1:52787_solr ] o.a.s.c.c.SolrZkClient makePath: /live_nodes
[junit4] 2> 150788 INFO (jetty-launcher-241-thread-4) [n:127.0.0.1:52790_solr ] o.a.s.c.c.SolrZkClient makePath: /live_nodes
[junit4] 2> 150788 INFO (jetty-launcher-241-thread-2) [n:127.0.0.1:52777_solr ] o.a.s.c.c.SolrZkClient makePath: /live_nodes
[junit4] 2> 150791 INFO (jetty-launcher-241-thread-1) [n:127.0.0.1:52787_solr ] o.a.s.c.c.SolrZkClient makePath: /collections
[junit4] 2> 150791 INFO (jetty-launcher-241-thread-4) [n:127.0.0.1:52790_solr ] o.a.s.c.c.SolrZkClient makePath: /collections
[junit4] 2> 150791 INFO (jetty-launcher-241-thread-3) [n:127.0.0.1:52780_solr ] o.a.s.c.c.SolrZkClient makePath: /collections
[junit4] 2> 150791 INFO (jetty-launcher-241-thread-2) [n:127.0.0.1:52777_solr ] o.a.s.c.c.SolrZkClient makePath: /collections
[junit4] 2> 150793 INFO (jetty-launcher-241-thread-4) [n:127.0.0.1:52790_solr ] o.a.s.c.c.SolrZkClient makePath: /aliases.json
[junit4] 2> 150794 INFO (jetty-launcher-241-thread-2) [n:127.0.0.1:52777_solr ] o.a.s.c.c.SolrZkClient makePath: /aliases.json
[junit4] 2> 150794 INFO (jetty-launcher-241-thread-3) [n:127.0.0.1:52780_solr ] o.a.s.c.c.SolrZkClient makePath: /aliases.json
[junit4] 2> 150794 INFO (jetty-launcher-241-thread-1) [n:127.0.0.1:52787_solr ] o.a.s.c.c.SolrZkClient makePath: /aliases.json
[junit4] 2> 150796 INFO (jetty-launcher-241-thread-2) [n:127.0.0.1:52777_solr ] o.a.s.c.c.SolrZkClient makePath: /clusterstate.json
[junit4] 2> 150796 INFO (jetty-launcher-241-thread-3) [n:127.0.0.1:52780_solr ] o.a.s.c.c.SolrZkClient makePath: /clusterstate.json
[junit4] 2> 150797 INFO (jetty-launcher-241-thread-4) [n:127.0.0.1:52790_solr ] o.a.s.c.c.SolrZkClient makePath: /clusterstate.json
[junit4] 2> 150797 INFO (jetty-launcher-241-thread-1) [n:127.0.0.1:52787_solr ] o.a.s.c.c.SolrZkClient makePath: /clusterstate.json
[junit4] 2> 150800 INFO (jetty-launcher-241-thread-3) [n:127.0.0.1:52780_solr ] o.a.s.c.c.SolrZkClient makePath: /security.json
[junit4] 2> 150800 INFO (jetty-launcher-241-thread-4) [n:127.0.0.1:52790_solr ] o.a.s.c.c.SolrZkClient makePath: /security.json
[junit4] 2> 150801 INFO (jetty-launcher-241-thread-2) [n:127.0.0.1:52777_solr ] o.a.s.c.c.SolrZkClient makePath: /security.json
[junit4] 2> 150801 INFO (jetty-launcher-241-thread-1) [n:127.0.0.1:52787_solr ] o.a.s.c.c.SolrZkClient makePath: /security.json
[junit4] 2> 150802 INFO (jetty-launcher-241-thread-4) [n:127.0.0.1:52790_solr ] o.a.s.c.c.ZkStateReader Updating cluster state from ZooKeeper...
[junit4] 2> 150802 INFO (jetty-launcher-241-thread-2) [n:127.0.0.1:52777_solr ] o.a.s.c.c.ZkStateReader Updating cluster state from ZooKeeper...
[junit4] 2> 150802 INFO (jetty-launcher-241-thread-1) [n:127.0.0.1:52787_solr ] o.a.s.c.c.ZkStateReader Updating cluster state from ZooKeeper...
[junit4] 2> 150803 INFO (jetty-launcher-241-thread-3) [n:127.0.0.1:52780_solr ] o.a.s.c.c.ZkStateReader Updating cluster state from ZooKeeper...
[junit4] 2> 150804 INFO (jetty-launcher-241-thread-4) [n:127.0.0.1:52790_solr ] o.a.s.c.c.ZkStateReader Loaded empty cluster properties
[junit4] 2> 150804 INFO (jetty-launcher-241-thread-1) [n:127.0.0.1:52787_solr ] o.a.s.c.c.ZkStateReader Loaded empty cluster properties
[junit4] 2> 150805 INFO (jetty-launcher-241-thread-2) [n:127.0.0.1:52777_solr ] o.a.s.c.c.ZkStateReader Loaded empty cluster properties
[junit4] 2> 150805 INFO (jetty-launcher-241-thread-3) [n:127.0.0.1:52780_solr ] o.a.s.c.c.ZkStateReader Loaded empty cluster properties
[junit4] 2> 150806 INFO (jetty-launcher-241-thread-4) [n:127.0.0.1:52790_solr ] o.a.s.c.c.ZkStateReader Updated live nodes from ZooKeeper... (0) -> (0)
[junit4] 2> 150806 INFO (jetty-launcher-241-thread-2) [n:127.0.0.1:52777_solr ] o.a.s.c.c.ZkStateReader Updated live nodes from ZooKeeper... (0) -> (0)
[junit4] 2> 150806 INFO (jetty-launcher-241-thread-1) [n:127.0.0.1:52787_solr ] o.a.s.c.c.ZkStateReader Updated live nodes from ZooKeeper... (0) -> (0)
[junit4] 2> 150806 INFO (jetty-launcher-241-thread-3) [n:127.0.0.1:52780_solr ] o.a.s.c.c.ZkStateReader Updated live nodes from ZooKeeper... (0) -> (0)
[junit4] 2> 150811 INFO (jetty-launcher-241-thread-1) [n:127.0.0.1:52787_solr ] o.a.s.c.c.SolrZkClient makePath: /overseer_elect
[junit4] 2> 150812 INFO (jetty-launcher-241-thread-4) [n:127.0.0.1:52790_solr ] o.a.s.c.c.SolrZkClient makePath: /overseer_elect
[junit4] 2> 150812 INFO (jetty-launcher-241-thread-2) [n:127.0.0.1:52777_solr ] o.a.s.c.c.SolrZkClient makePath: /overseer_elect
[junit4] 2> 150812 INFO (jetty-launcher-241-thread-3) [n:127.0.0.1:52780_solr ] o.a.s.c.c.SolrZkClient makePath: /overseer_elect
[junit4] 2> 150816 INFO (jetty-launcher-241-thread-4) [n:127.0.0.1:52790_solr ] o.a.s.c.c.SolrZkClient makePath: /overseer_elect/election
[junit4] 2> 150816 INFO (jetty-launcher-241-thread-2) [n:127.0.0.1:52777_solr ] o.a.s.c.c.SolrZkClient makePath: /overseer_elect/election
[junit4] 2> 150816 INFO (jetty-launcher-241-thread-3) [n:127.0.0.1:52780_solr ] o.a.s.c.c.SolrZkClient makePath: /overseer_elect/election
[junit4] 2> 150816 INFO (jetty-launcher-241-thread-1) [n:127.0.0.1:52787_solr ] o.a.s.c.c.SolrZkClient makePath: /overseer_elect/election
[junit4] 2> 150818 INFO (jetty-launcher-241-thread-4) [n:127.0.0.1:52790_solr ] o.a.s.c.Overseer Overseer (id=null) closing
[junit4] 2> 150819 INFO (jetty-launcher-241-thread-3) [n:127.0.0.1:52780_solr ] o.a.s.c.Overseer Overseer (id=null) closing
[junit4] 2> 150819 INFO (jetty-launcher-241-thread-1) [n:127.0.0.1:52787_solr ] o.a.s.c.Overseer Overseer (id=null) closing
[junit4] 2> 150819 INFO (jetty-launcher-241-thread-2) [n:127.0.0.1:52777_solr ] o.a.s.c.Overseer Overseer (id=null) closing
[junit4] 2> 150819 INFO (jetty-launcher-241-thread-4) [n:127.0.0.1:52790_solr ] o.a.s.c.LeaderElector Joined leadership election with path: /overseer_elect/election/96160764560474124-127.0.0.1:52790_solr-n_0000000000
[junit4] 2> 150819 INFO (jetty-launcher-241-thread-3) [n:127.0.0.1:52780_solr ] o.a.s.c.LeaderElector Joined leadership election with path: /overseer_elect/election/96160764560474123-127.0.0.1:52780_solr-n_0000000001
[junit4] 2> 150820 INFO (jetty-launcher-241-thread-1) [n:127.0.0.1:52787_solr ] o.a.s.c.LeaderElector Joined leadership election with path: /overseer_elect/election/96160764560474122-127.0.0.1:52787_solr-n_0000000002
[junit4] 2> 150820 INFO (jetty-launcher-241-thread-2) [n:127.0.0.1:52777_solr ] o.a.s.c.LeaderElector Joined leadership election with path: /overseer_elect/election/96160764560474121-127.0.0.1:52777_solr-n_0000000003
[junit4] 2> 150820 INFO (jetty-launcher-241-thread-4) [n:127.0.0.1:52790_solr ] o.a.s.c.OverseerElectionContext I am going to be the leader 127.0.0.1:52790_solr
[junit4] 2> 150820 INFO (jetty-launcher-241-thread-4) [n:127.0.0.1:52790_solr ] o.a.s.c.c.SolrZkClient makePath: /overseer_elect/leader
[junit4] 2> 150821 INFO (jetty-launcher-241-thread-3) [n:127.0.0.1:52780_solr ] o.a.s.c.LeaderElector Watching path /overseer_elect/election/96160764560474124-127.0.0.1:52790_solr-n_0000000000 to know if I could be the leader
[junit4] 2> 150821 INFO (jetty-launcher-241-thread-1) [n:127.0.0.1:52787_solr ] o.a.s.c.LeaderElector Watching path /overseer_elect/election/96160764560474123-127.0.0.1:52780_solr-n_0000000001 to know if I could be the leader
[junit4] 2> 150821 INFO (jetty-launcher-241-thread-2) [n:127.0.0.1:52777_solr ] o.a.s.c.LeaderElector Watching path /overseer_elect/election/96160764560474122-127.0.0.1:52787_solr-n_0000000002 to know if I could be the leader
[junit4] 2> 150821 INFO (jetty-launcher-241-thread-3) [n:127.0.0.1:52780_solr ] o.a.s.c.ZkController Register node as live in ZooKeeper:/live_nodes/127.0.0.1:52780_solr
[junit4] 2> 150821 INFO (jetty-launcher-241-thread-3) [n:127.0.0.1:52780_solr ] o.a.s.c.c.SolrZkClient makePath: /live_nodes/127.0.0.1:52780_solr
[junit4] 2> 150822 INFO (jetty-launcher-241-thread-1) [n:127.0.0.1:52787_solr ] o.a.s.c.ZkController Register node as live in ZooKeeper:/live_nodes/127.0.0.1:52787_solr
[junit4] 2> 150822 INFO (jetty-launcher-241-thread-1) [n:127.0.0.1:52787_solr ] o.a.s.c.c.SolrZkClient makePath: /live_nodes/127.0.0.1:52787_solr
[junit4] 2> 150822 INFO (jetty-launcher-241-thread-2) [n:127.0.0.1:52777_solr ] o.a.s.c.ZkController Register node as live in ZooKeeper:/live_nodes/127.0.0.1:52777_solr
[junit4] 2> 150822 INFO (jetty-launcher-241-thread-2) [n:127.0.0.1:52777_solr ] o.a.s.c.c.SolrZkClient makePath: /live_nodes/127.0.0.1:52777_solr
[junit4] 2> 150822 INFO (jetty-launcher-241-thread-4) [n:127.0.0.1:52790_solr ] o.a.s.c.Overseer Overseer (id=96160764560474124-127.0.0.1:52790_solr-n_0000000000) starting
[junit4] 2> 150826 INFO (zkCallback-259-thread-1-processing-n:127.0.0.1:52777_solr) [n:127.0.0.1:52777_solr ] o.a.s.c.c.ZkStateReader A live node change: [WatchedEvent state:SyncConnected type:NodeChildrenChanged path:/live_nodes], has occurred - updating... (live nodes size: [0])
[junit4] 2> 150826 INFO (zkCallback-260-thread-1-processing-n:127.0.0.1:52787_solr) [n:127.0.0.1:52787_solr ] o.a.s.c.c.ZkStateReader A live node change: [WatchedEvent state:SyncConnected type:NodeChildrenChanged path:/live_nodes], has occurred - updating... (live nodes size: [0])
[junit4] 2> 150826 INFO (zkCallback-262-thread-1-processing-n:127.0.0.1:52790_solr) [n:127.0.0.1:52790_solr ] o.a.s.c.c.ZkStateReader A live node change: [WatchedEvent state:SyncConnected type:NodeChildrenChanged path:/live_nodes], has occurred - updating... (live nodes size: [0])
[junit4] 2> 150826 INFO (zkCallback-261-thread-1-processing-n:127.0.0.1:52780_solr) [n:127.0.0.1:52780_solr ] o.a.s.c.c.ZkStateReader A live node change: [WatchedEvent state:SyncConnected type:NodeChildrenChanged path:/live_nodes], has occurred - updating... (live nodes size: [0])
[junit4] 2> 150838 INFO (jetty-launcher-241-thread-1) [n:127.0.0.1:52787_solr ] o.a.s.c.CoreContainer Security conf doesn't exist. Skipping setup for authorization module.
[junit4] 2> 150838 INFO (jetty-launcher-241-thread-1) [n:127.0.0.1:52787_solr ] o.a.s.c.CoreContainer No authentication plugin used.
[junit4] 2> 150838 INFO (jetty-launcher-241-thread-1) [n:127.0.0.1:52787_solr ] o.a.s.c.CorePropertiesLocator Looking for core definitions underneath C:\Users\jenkins\workspace\Lucene-Solr-master-Windows\solr\build\solr-solrj\test\J0\temp\solr.common.cloud.TestCollectionStateWatchers_ACE149333A9DD931-001\tempDir-001\node1\.
[junit4] 2> 150839 INFO (jetty-launcher-241-thread-1) [n:127.0.0.1:52787_solr ] o.a.s.c.CorePropertiesLocator Found 0 core definitions
[junit4] 2> 150840 INFO (zkCallback-259-thread-1-processing-n:127.0.0.1:52777_solr) [n:127.0.0.1:52777_solr ] o.a.s.c.c.ZkStateReader Updated live nodes from ZooKeeper... (0) -> (3)
[junit4] 2> 150843 INFO (zkCallback-260-thread-1-processing-n:127.0.0.1:52787_solr) [n:127.0.0.1:52787_solr ] o.a.s.c.c.ZkStateReader Updated live nodes from ZooKeeper... (0) -> (3)
[junit4] 2> 150845 INFO (jetty-launcher-241-thread-3) [n:127.0.0.1:52780_solr ] o.a.s.c.CoreContainer Security conf doesn't exist. Skipping setup for authorization module.
[junit4] 2> 150845 INFO (jetty-launcher-241-thread-3) [n:127.0.0.1:52780_solr ] o.a.s.c.CoreContainer No authentication plugin used.
[junit4] 2> 150846 INFO (jetty-launcher-241-thread-3) [n:127.0.0.1:52780_solr ] o.a.s.c.CorePropertiesLocator Looking for core definitions underneath C:\Users\jenkins\workspace\Lucene-Solr-master-Windows\solr\build\solr-solrj\test\J0\temp\solr.common.cloud.TestCollectionStateWatchers_ACE149333A9DD931-001\tempDir-001\node3\.
[junit4] 2> 150847 INFO (jetty-launcher-241-thread-3) [n:127.0.0.1:52780_solr ] o.a.s.c.CorePropertiesLocator Found 0 core definitions
[junit4] 2> 150849 INFO (jetty-launcher-241-thread-1) [n:127.0.0.1:52787_solr ] o.a.s.s.SolrDispatchFilter user.dir=C:\Users\jenkins\workspace\Lucene-Solr-master-Windows\solr\build\solr-solrj\test\J0
[junit4] 2> 150849 INFO (jetty-launcher-241-thread-1) [n:127.0.0.1:52787_solr ] o.a.s.s.SolrDispatchFilter SolrDispatchFilter.init() done
[junit4] 2> 150850 INFO (jetty-launcher-241-thread-3) [n:127.0.0.1:52780_solr ] o.a.s.s.SolrDispatchFilter user.dir=C:\Users\jenkins\workspace\Lucene-Solr-master-Windows\solr\build\solr-solrj\test\J0
[junit4] 2> 150850 INFO (jetty-launcher-241-thread-3) [n:127.0.0.1:52780_solr ] o.a.s.s.SolrDispatchFilter SolrDispatchFilter.init() done
[junit4] 2> 150851 INFO (zkCallback-262-thread-1-processing-n:127.0.0.1:52790_solr) [n:127.0.0.1:52790_solr ] o.a.s.c.c.ZkStateReader Updated live nodes from ZooKeeper... (0) -> (3)
[junit4] 2> 150851 INFO (jetty-launcher-241-thread-4) [n:127.0.0.1:52790_solr ] o.a.s.c.c.SolrZkClient makePath: /overseer/queue-work
[junit4] 2> 150851 INFO (zkCallback-261-thread-1-processing-n:127.0.0.1:52780_solr) [n:127.0.0.1:52780_solr ] o.a.s.c.c.ZkStateReader Updated live nodes from ZooKeeper... (0) -> (3)
[junit4] 2> 150851 INFO (jetty-launcher-241-thread-2) [n:127.0.0.1:52777_solr ] o.a.s.c.CoreContainer Security conf doesn't exist. Skipping setup for authorization module.
[junit4] 2> 150851 INFO (jetty-launcher-241-thread-2) [n:127.0.0.1:52777_solr ] o.a.s.c.CoreContainer No authentication plugin used.
[junit4] 2> 150853 INFO (jetty-launcher-241-thread-2) [n:127.0.0.1:52777_solr ] o.a.s.c.CorePropertiesLocator Looking for core definitions underneath C:\Users\jenkins\workspace\Lucene-Solr-master-Windows\solr\build\solr-solrj\test\J0\temp\solr.common.cloud.TestCollectionStateWatchers_ACE149333A9DD931-001\tempDir-001\node2\.
[junit4] 2> 150853 INFO (jetty-launcher-241-thread-2) [n:127.0.0.1:52777_solr ] o.a.s.c.CorePropertiesLocator Found 0 core definitions
[junit4] 2> 150854 INFO (jetty-launcher-241-thread-2) [n:127.0.0.1:52777_solr ] o.a.s.s.SolrDispatchFilter user.dir=C:\Users\jenkins\workspace\Lucene-Solr-master-Windows\solr\build\solr-solrj\test\J0
[junit4] 2> 150854 INFO (jetty-launcher-241-thread-2) [n:127.0.0.1:52777_solr ] o.a.s.s.SolrDispatchFilter SolrDispatchFilter.init() done
[junit4] 2> 150861 INFO (jetty-launcher-241-thread-4) [n:127.0.0.1:52790_solr ] o.a.s.c.OverseerAutoReplicaFailoverThread Starting OverseerAutoReplicaFailoverThread autoReplicaFailoverWorkLoopDelay=10000 autoReplicaFailoverWaitAfterExpiration=30000 autoReplicaFailoverBadNodeExpiration=60000
[junit4] 2> 150862 INFO (jetty-launcher-241-thread-4) [n:127.0.0.1:52790_solr ] o.a.s.c.ZkController Publish node=127.0.0.1:52790_solr as DOWN
[junit4] 2> 150862 INFO (OverseerStateUpdate-96160764560474124-127.0.0.1:52790_solr-n_0000000000) [n:127.0.0.1:52790_solr ] o.a.s.c.Overseer Starting to work on the main queue
[junit4] 2> 150862 INFO (OverseerCollectionConfigSetProcessor-96160764560474124-127.0.0.1:52790_solr-n_0000000000) [n:127.0.0.1:52790_solr ] o.a.s.c.OverseerTaskProcessor Process current queue of overseer operations
[junit4] 2> 150865 INFO (jetty-launcher-241-thread-4) [n:127.0.0.1:52790_solr ] o.a.s.c.ZkController Register node as live in ZooKeeper:/live_nodes/127.0.0.1:52790_solr
[junit4] 2> 150865 INFO (jetty-launcher-241-thread-4) [n:127.0.0.1:52790_solr ] o.a.s.c.c.SolrZkClient makePath: /live_nodes/127.0.0.1:52790_solr
[junit4] 2> 150865 INFO (OverseerStateUpdate-96160764560474124-127.0.0.1:52790_solr-n_0000000000) [n:127.0.0.1:52790_solr ] o.a.s.c.c.ZkStateReader Updated live nodes from ZooKeeper... (3) -> (3)
[junit4] 2> 150867 INFO (zkCallback-260-thread-1-processing-n:127.0.0.1:52787_solr) [n:127.0.0.1:52787_solr ] o.a.s.c.c.ZkStateReader A live node change: [WatchedEvent state:SyncConnected type:NodeChildrenChanged path:/live_nodes], has occurred - updating... (live nodes size: [3])
[junit4] 2> 150867 INFO (zkCallback-261-thread-1-processing-n:127.0.0.1:52780_solr) [n:127.0.0.1:52780_solr ] o.a.s.c.c.ZkStateReader A live node change: [WatchedEvent state:SyncConnected type:NodeChildrenChanged path:/live_nodes], has occurred - updating... (live nodes size: [3])
[junit4] 2> 150867 INFO (zkCallback-259-thread-1-processing-n:127.0.0.1:52777_solr) [n:127.0.0.1:52777_solr ] o.a.s.c.c.ZkStateReader A live node change: [WatchedEvent state:SyncConnected type:NodeChildrenChanged path:/live_nodes], has occurred - updating... (live nodes size: [3])
[junit4] 2> 150867 INFO (zkCallback-262-thread-1-processing-n:127.0.0.1:52790_solr) [n:127.0.0.1:52790_solr ] o.a.s.c.c.ZkStateReader A live node change: [WatchedEvent state:SyncConnected type:NodeChildrenChanged path:/live_nodes], has occurred - updating... (live nodes size: [3])
[junit4] 2> 150869 INFO (zkCallback-260-thread-1-processing-n:127.0.0.1:52787_solr) [n:127.0.0.1:52787_solr ] o.a.s.c.c.ZkStateReader Updated live nodes from ZooKeeper... (3) -> (4)
[junit4] 2> 150869 INFO (zkCallback-259-thread-1-processing-n:127.0.0.1:52777_solr) [n:127.0.0.1:52777_solr ] o.a.s.c.c.ZkStateReader Updated live nodes from ZooKeeper... (3) -> (4)
[junit4] 2> 150869 INFO (zkCallback-262-thread-1-processing-n:127.0.0.1:52790_solr) [n:127.0.0.1:52790_solr ] o.a.s.c.c.ZkStateReader Updated live nodes from ZooKeeper... (3) -> (4)
[junit4] 2> 150869 INFO (OverseerStateUpdate-96160764560474124-127.0.0.1:52790_solr-n_0000000000) [n:127.0.0.1:52790_solr ] o.a.s.c.Overseer processMessage: queueSize: 1, message = {
[junit4] 2> "operation":"downnode",
[junit4] 2> "node_name":"127.0.0.1:52790_solr"} current state version: 0
[junit4] 2> 150869 INFO (OverseerStateUpdate-96160764560474124-127.0.0.1:52790_solr-n_0000000000) [n:127.0.0.1:52790_solr ] o.a.s.c.o.NodeMutator DownNode state invoked for node: 127.0.0.1:52790_solr
[junit4] 2> 150869 INFO (zkCallback-261-thread-1-processing-n:127.0.0.1:52780_solr) [n:127.0.0.1:52780_solr ] o.a.s.c.c.ZkStateReader Updated live nodes from ZooKeeper... (3) -> (4)
[junit4] 2> 150875 INFO (jetty-launcher-241-thread-4) [n:127.0.0.1:52790_solr ] o.a.s.c.CoreContainer Security conf doesn't exist. Skipping setup for authorization module.
[junit4] 2> 150875 INFO (jetty-launcher-241-thread-4) [n:127.0.0.1:52790_solr ] o.a.s.c.CoreContainer No authentication plugin used.
[junit4] 2> 150876 INFO (jetty-launcher-241-thread-4) [n:127.0.0.1:52790_solr ] o.a.s.c.CorePropertiesLocator Looking for core definitions underneath C:\Users\jenkins\workspace\Lucene-Solr-master-Windows\solr\build\solr-solrj\test\J0\temp\solr.common.cloud.TestCollectionStateWatchers_ACE149333A9DD931-001\tempDir-001\node4\.
[junit4] 2> 150877 INFO (jetty-launcher-241-thread-4) [n:127.0.0.1:52790_solr ] o.a.s.c.CorePropertiesLocator Found 0 core definitions
[junit4] 2> 150878 INFO (jetty-launcher-241-thread-4) [n:127.0.0.1:52790_solr ] o.a.s.s.SolrDispatchFilter user.dir=C:\Users\jenkins\workspace\Lucene-Solr-master-Windows\solr\build\solr-solrj\test\J0
[junit4] 2> 150878 INFO (jetty-launcher-241-thread-4) [n:127.0.0.1:52790_solr ] o.a.s.s.SolrDispatchFilter SolrDispatchFilter.init() done
[junit4] 2> 150878 INFO (SUITE-TestCollectionStateWatchers-seed#[ACE149333A9DD931]-worker) [ ] o.a.s.c.c.SolrZkClient Using default ZkCredentialsProvider
[junit4] 2> 150879 INFO (SUITE-TestCollectionStateWatchers-seed#[ACE149333A9DD931]-worker) [ ] o.a.s.c.c.ConnectionManager Waiting for client to connect to ZooKeeper
[junit4] 2> 150882 INFO (zkCallback-267-thread-1) [ ] o.a.s.c.c.ConnectionManager Watcher org.apache.solr.common.cloud.ConnectionManager@1e494550 name:ZooKeeperConnection Watcher:127.0.0.1:52773 got event WatchedEvent state:SyncConnected type:None path:null path:null type:None
[junit4] 2> 150882 INFO (SUITE-TestCollectionStateWatchers-seed#[ACE149333A9DD931]-worker) [ ] o.a.s.c.c.ConnectionManager Client is connected to ZooKeeper
[junit4] 2> 150882 INFO (SUITE-TestCollectionStateWatchers-seed#[ACE149333A9DD931]-worker) [ ] o.a.s.c.c.SolrZkClient Using default ZkACLProvider
[junit4] 2> 150884 WARN (NIOServerCxn.Factory:0.0.0.0/0.0.0.0:0) [ ] o.a.z.s.NIOServerCnxn caught end of stream exception
[junit4] 2> EndOfStreamException: Unable to read additional data from client sessionid 0x155a1b4b4f5000d, likely client has closed socket
[junit4] 2> at org.apache.zookeeper.server.NIOServerCnxn.doIO(NIOServerCnxn.java:228)
[junit4] 2> at org.apache.zookeeper.server.NIOServerCnxnFactory.run(NIOServerCnxnFactory.java:208)
[junit4] 2> at java.lang.Thread.run(Thread.java:745)
[junit4] 2> 150886 INFO (SUITE-TestCollectionStateWatchers-seed#[ACE149333A9DD931]-worker) [ ] o.a.s.c.s.i.CloudSolrClient Final constructed zkHost string: 127.0.0.1:52773/solr
[junit4] 2> 150887 INFO (SUITE-TestCollectionStateWatchers-seed#[ACE149333A9DD931]-worker) [ ] o.a.s.c.c.SolrZkClient Using default ZkCredentialsProvider
[junit4] 2> 150888 INFO (SUITE-TestCollectionStateWatchers-seed#[ACE149333A9DD931]-worker) [ ] o.a.s.c.c.ConnectionManager Waiting for client to connect to ZooKeeper
[junit4] 2> 150892 INFO (zkCallback-270-thread-1) [ ] o.a.s.c.c.ConnectionManager Watcher org.apache.solr.common.cloud.ConnectionManager@12092cb7 name:ZooKeeperConnection Watcher:127.0.0.1:52773/solr got event WatchedEvent state:SyncConnected type:None path:null path:null type:None
[junit4] 2> 150892 INFO (SUITE-TestCollectionStateWatchers-seed#[ACE149333A9DD931]-worker) [ ] o.a.s.c.c.ConnectionManager Client is connected to ZooKeeper
[junit4] 2> 150892 INFO (SUITE-TestCollectionStateWatchers-seed#[ACE149333A9DD931]-worker) [ ] o.a.s.c.c.SolrZkClient Using default ZkACLProvider
[junit4] 2> 150892 INFO (SUITE-TestCollectionStateWatchers-seed#[ACE149333A9DD931]-worker) [ ] o.a.s.c.c.ZkStateReader Updating cluster state from ZooKeeper...
[junit4] 2> 150894 INFO (SUITE-TestCollectionStateWatchers-seed#[ACE149333A9DD931]-worker) [ ] o.a.s.c.c.ZkStateReader Loaded empty cluster properties
[junit4] 2> 150895 INFO (SUITE-TestCollectionStateWatchers-seed#[ACE149333A9DD931]-worker) [ ] o.a.s.c.c.ZkStateReader Updated live nodes from ZooKeeper... (0) -> (4)
[junit4] 2> 150898 INFO (SUITE-TestCollectionStateWatchers-seed#[ACE149333A9DD931]-worker) [ ] o.a.s.c.c.SolrZkClient makePath: /configs/config/schema-replication1.xml
[junit4] 2> 150902 INFO (SUITE-TestCollectionStateWatchers-seed#[ACE149333A9DD931]-worker) [ ] o.a.s.c.c.SolrZkClient makePath: /configs/config/schema-sql.xml
[junit4] 2> 150907 INFO (SUITE-TestCollectionStateWatchers-seed#[ACE149333A9DD931]-worker) [ ] o.a.s.c.c.SolrZkClient makePath: /configs/config/schema.xml
[junit4] 2> 150910 INFO (SUITE-TestCollectionStateWatchers-seed#[ACE149333A9DD931]-worker) [ ] o.a.s.c.c.SolrZkClient makePath: /configs/config/solrconfig-managed-schema.xml
[junit4] 2> 150913 INFO (SUITE-TestCollectionStateWatchers-seed#[ACE149333A9DD931]-worker) [ ] o.a.s.c.c.SolrZkClient makePath: /configs/config/solrconfig-slave1.xml
[junit4] 2> 150918 INFO (SUITE-TestCollectionStateWatchers-seed#[ACE149333A9DD931]-worker) [ ] o.a.s.c.c.SolrZkClient makePath: /configs/config/solrconfig-sql.xml
[junit4] 2> 150920 INFO (SUITE-TestCollectionStateWatchers-seed#[ACE149333A9DD931]-worker) [ ] o.a.s.c.c.SolrZkClient makePath: /configs/config/solrconfig.xml
[junit4] 2> 150977 INFO (TEST-TestCollectionStateWatchers.testWatcherIsRemovedAfterTimeout-seed#[ACE149333A9DD931]) [ ] o.a.s.SolrTestCaseJ4 ###Starting testWatcherIsRemovedAfterTimeout
[junit4] 2> 150978 INFO (TEST-TestCollectionStateWatchers.testWatcherIsRemovedAfterTimeout-seed#[ACE149333A9DD931]) [ ] o.a.s.c.c.SolrZkClient Using default ZkCredentialsProvider
[junit4] 2> 150979 INFO (TEST-TestCollectionStateWatchers.testWatcherIsRemovedAfterTimeout-seed#[ACE149333A9DD931]) [ ] o.a.s.c.c.ConnectionManager Waiting for client to connect to ZooKeeper
[junit4] 2> 150981 INFO (zkCallback-271-thread-1) [ ] o.a.s.c.c.ConnectionManager Watcher org.apache.solr.common.cloud.ConnectionManager@722dfa5e name:ZooKeeperConnection Watcher:127.0.0.1:52773 got event WatchedEvent state:SyncConnected type:None path:null path:null type:None
[junit4] 2> 150982 INFO (TEST-TestCollectionStateWatchers.testWatcherIsRemovedAfterTimeout-seed#[ACE149333A9DD931]) [ ] o.a.s.c.c.ConnectionManager Client is connected to ZooKeeper
[junit4] 2> 150982 INFO (TEST-TestCollectionStateWatchers.testWatcherIsRemovedAfterTimeout-seed#[ACE149333A9DD931]) [ ] o.a.s.c.c.SolrZkClient Using default ZkACLProvider
[junit4] 2> 150993 INFO (TEST-TestCollectionStateWatchers.testWatcherIsRemovedAfterTimeout-seed#[ACE149333A9DD931]) [ ] o.a.s.c.c.ZkStateReader Deleting data for [no-such-collection]
[junit4] 2> 151005 INFO (TEST-TestCollectionStateWatchers.testWatcherIsRemovedAfterTimeout-seed#[ACE149333A9DD931]) [ ] o.a.s.SolrTestCaseJ4 ###Ending testWatcherIsRemovedAfterTimeout
[junit4] 2> 151027 INFO (TEST-TestCollectionStateWatchers.testWaitForStateWatcherIsRetainedOnPredicateFailure-seed#[ACE149333A9DD931]) [ ] o.a.s.SolrTestCaseJ4 ###Starting testWaitForStateWatcherIsRetainedOnPredicateFailure
[junit4] 2> 151027 INFO (TEST-TestCollectionStateWatchers.testWaitForStateWatcherIsRetainedOnPredicateFailure-seed#[ACE149333A9DD931]) [ ] o.a.s.c.c.SolrZkClient Using default ZkCredentialsProvider
[junit4] 2> 151028 INFO (TEST-TestCollectionStateWatchers.testWaitForStateWatcherIsRetainedOnPredicateFailure-seed#[ACE149333A9DD931]) [ ] o.a.s.c.c.ConnectionManager Waiting for client to connect to ZooKeeper
[junit4] 2> 151031 INFO (zkCallback-272-thread-1) [ ] o.a.s.c.c.ConnectionManager Watcher org.apache.solr.common.cloud.ConnectionManager@6cfee1df name:ZooKeeperConnection Watcher:127.0.0.1:52773 got event WatchedEvent state:SyncConnected type:None path:null path:null type:None
[junit4] 2> 151031 INFO (TEST-TestCollectionStateWatchers.testWaitForStateWatcherIsRetainedOnPredicateFailure-seed#[ACE149333A9DD931]) [ ] o.a.s.c.c.ConnectionManager Client is connected to ZooKeeper
[junit4] 2> 151031 INFO (TEST-TestCollectionStateWatchers.testWaitForStateWatcherIsRetainedOnPredicateFailure-seed#[ACE149333A9DD931]) [ ] o.a.s.c.c.SolrZkClient Using default ZkACLProvider
[junit4] 2> 151033 WARN (NIOServerCxn.Factory:0.0.0.0/0.0.0.0:0) [ ] o.a.z.s.NIOServerCnxn caught end of stream exception
[junit4] 2> EndOfStreamException: Unable to read additional data from client sessionid 0x155a1b4b4f50010, likely client has closed socket
[junit4] 2> at org.apache.zookeeper.server.NIOServerCnxn.doIO(NIOServerCnxn.java:228)
[junit4] 2> at org.apache.zookeeper.server.NIOServerCnxnFactory.run(NIOServerCnxnFactory.java:208)
[junit4] 2> at java.lang.Thread.run(Thread.java:745)
[junit4] 2> 151037 INFO (qtp1335814378-1571) [n:127.0.0.1:52777_solr ] o.a.s.h.a.CollectionsHandler Invoked Collection Action :create with params async=6a5f12ea-50d4-4b77-971a-55de33351e9f&replicationFactor=1&collection.configName=config&name=falsepredicate&action=CREATE&numShards=4&wt=javabin&version=2 and sendToOCPQueue=true
[junit4] 2> 151040 INFO (qtp1335814378-1571) [n:127.0.0.1:52777_solr ] o.a.s.s.HttpSolrCall [admin] webapp=null path=/admin/collections params={async=6a5f12ea-50d4-4b77-971a-55de33351e9f&replicationFactor=1&collection.configName=config&name=falsepredicate&action=CREATE&numShards=4&wt=javabin&version=2} status=0 QTime=2
[junit4] 2> 151041 INFO (OverseerCollectionConfigSetProcessor-96160764560474124-127.0.0.1:52790_solr-n_0000000000) [n:127.0.0.1:52790_solr ] o.a.s.c.c.SolrZkClient makePath: /overseer/collection-map-running/mn-6a5f12ea-50d4-4b77-971a-55de33351e9f
[junit4] 2> 151043 INFO (qtp1335814378-1572) [n:127.0.0.1:52777_solr ] o.a.s.h.a.CollectionsHandler Invoked Collection Action :requeststatus with params requestid=6a5f12ea-50d4-4b77-971a-55de33351e9f&action=REQUESTSTATUS&wt=javabin&version=2 and sendToOCPQueue=true
[junit4] 2> 151045 INFO (OverseerCollectionConfigSetProcessor-96160764560474124-127.0.0.1:52790_solr-n_0000000000) [n:127.0.0.1:52790_solr ] o.a.s.c.OverseerTaskProcessor Overseer Collection Message Handler: Get the message id:/overseer/collection-queue-work/qn-0000000000 message:{
[junit4] 2> "name":"falsepredicate",
[junit4] 2> "fromApi":"true",
[junit4] 2> "replicationFactor":"1",
[junit4] 2> "collection.configName":"config",
[junit4] 2> "numShards":"4",
[junit4] 2> "stateFormat":"2",
[junit4] 2> "async":"6a5f12ea-50d4-4b77-971a-55de33351e9f",
[junit4] 2> "operation":"create"}
[junit4] 2> 151046 INFO (OverseerThreadFactory-700-thread-1-processing-n:127.0.0.1:52790_solr) [n:127.0.0.1:52790_solr ] o.a.s.c.OverseerCollectionMessageHandler OverseerCollectionMessageHandler.processMessage : create , {
[junit4] 2> "name":"falsepredicate",
[junit4] 2> "fromApi":"true",
[junit4] 2> "replicationFactor":"1",
[junit4] 2> "collection.configName":"config",
[junit4] 2> "numShards":"4",
[junit4] 2> "stateFormat":"2",
[junit4] 2> "async":"6a5f12ea-50d4-4b77-971a-55de33351e9f",
[junit4] 2> "operation":"create"}
[junit4] 2> 151046 INFO (OverseerThreadFactory-700-thread-1-processing-n:127.0.0.1:52790_solr) [n:127.0.0.1:52790_solr ] o.a.s.c.OverseerCollectionMessageHandler Create collection falsepredicate
[junit4] 2> 151046 INFO (qtp1335814378-1572) [n:127.0.0.1:52777_solr ] o.a.s.s.HttpSolrCall [admin] webapp=null path=/admin/collections params={requestid=6a5f12ea-50d4-4b77-971a-55de33351e9f&action=REQUESTSTATUS&wt=javabin&version=2} status=0 QTime=1
[junit4] 2> 151047 INFO (OverseerThreadFactory-700-thread-1-processing-n:127.0.0.1:52790_solr) [n:127.0.0.1:52790_solr ] o.a.s.c.OverseerCollectionMessageHandler creating collections conf node /collections/falsepredicate
[junit4] 2> 151047 INFO (OverseerThreadFactory-700-thread-1-processing-n:127.0.0.1:52790_solr) [n:127.0.0.1:52790_solr ] o.a.s.c.c.SolrZkClient makePath: /collections/falsepredicate
[junit4] 2> 151049 INFO (zkCallback-260-thread-1-processing-n:127.0.0.1:52787_solr) [n:127.0.0.1:52787_solr ] o.a.s.c.c.ZkStateReader A collections change: [WatchedEvent state:SyncConnected type:NodeChildrenChanged path:/collections], has occurred - updating...
[junit4] 2> 151050 INFO (zkCallback-261-thread-1-processing-n:127.0.0.1:52780_solr) [n:127.0.0.1:52780_solr ] o.a.s.c.c.ZkStateReader A collections change: [WatchedEvent state:SyncConnected type:NodeChildrenChanged path:/collections], has occurred - updating...
[junit4] 2> 151050 INFO (zkCallback-262-thread-1-processing-n:127.0.0.1:52790_solr) [n:127.0.0.1:52790_solr ] o.a.s.c.c.ZkStateReader A collections change: [WatchedEvent state:SyncConnected type:NodeChildrenChanged path:/collections], has occurred - updating...
[junit4] 2> 151050 INFO (zkCallback-259-thread-1-processing-n:127.0.0.1:52777_solr) [n:127.0.0.1:52777_solr ] o.a.s.c.c.ZkStateReader A collections change: [WatchedEvent state:SyncConnected type:NodeChildrenChanged path:/collections], has occurred - updating...
[junit4] 2> 151050 INFO (zkCallback-270-thread-1) [ ] o.a.s.c.c.ZkStateReader A collections change: [WatchedEvent state:SyncConnected type:NodeChildrenChanged path:/collections], has occurred - updating...
[junit4] 2> 151056 INFO (OverseerStateUpdate-96160764560474124-127.0.0.1:52790_solr-n_0000000000) [n:127.0.0.1:52790_solr ] o.a.s.c.Overseer processMessage: queueSize: 1, message = {
[junit4] 2> "name":"falsepredicate",
[junit4] 2> "fromApi":"true",
[junit4] 2> "replicationFactor":"1",
[junit4] 2> "collection.configName":"config",
[junit4] 2> "numShards":"4",
[junit4] 2> "stateFormat":"2",
[junit4] 2> "async":"6a5f12ea-50d4-4b77-971a-55de33351e9f",
[junit4] 2> "operation":"create"} current state version: 0
[junit4] 2> 151056 INFO (OverseerStateUpdate-96160764560474124-127.0.0.1:52790_solr-n_0000000000) [n:127.0.0.1:52790_solr ] o.a.s.c.o.ClusterStateMutator building a new cName: falsepredicate
[junit4] 2> 151058 INFO (OverseerStateUpdate-96160764560474124-127.0.0.1:52790_solr-n_0000000000) [n:127.0.0.1:52790_solr ] o.a.s.c.o.ZkStateWriter going to create_collection /collections/falsepredicate/state.json
[junit4] 2> 151156 INFO (OverseerThreadFactory-700-thread-1-processing-n:127.0.0.1:52790_solr) [n:127.0.0.1:52790_solr ] o.a.s.c.OverseerCollectionMessageHandler Creating SolrCores for new collection falsepredicate, shardNames [shard1, shard2, shard3, shard4] , replicationFactor : 1
[junit4] 2> 151156 INFO (OverseerThreadFactory-700-thread-1-processing-n:127.0.0.1:52790_solr) [n:127.0.0.1:52790_solr ] o.a.s.c.OverseerCollectionMessageHandler Creating core falsepredicate_shard2_replica1 as part of shard shard2 of collection falsepredicate on 127.0.0.1:52777_solr
[junit4] 2> 151158 INFO (OverseerThreadFactory-700-thread-1-processing-n:127.0.0.1:52790_solr) [n:127.0.0.1:52790_solr ] o.a.s.c.OverseerCollectionMessageHandler Creating core falsepredicate_shard1_replica1 as part of shard shard1 of collection falsepredicate on 127.0.0.1:52787_solr
[junit4] 2> 151159 INFO (OverseerThreadFactory-700-thread-1-processing-n:127.0.0.1:52790_solr) [n:127.0.0.1:52790_solr ] o.a.s.c.OverseerCollectionMessageHandler Creating core falsepredicate_shard4_replica1 as part of shard shard4 of collection falsepredicate on 127.0.0.1:52780_solr
[junit4] 2> 151159 INFO (OverseerThreadFactory-700-thread-1-processing-n:127.0.0.1:52790_solr) [n:127.0.0.1:52790_solr ] o.a.s.c.OverseerCollectionMessageHandler Creating core falsepredicate_shard3_replica1 as part of shard shard3 of collection falsepredicate on 127.0.0.1:52790_solr
[junit4] 2> 151165 INFO (qtp1335814378-1573) [n:127.0.0.1:52777_solr ] o.a.s.s.HttpSolrCall [admin] webapp=null path=/admin/cores params={async=6a5f12ea-50d4-4b77-971a-55de33351e9f439472834586048&qt=/admin/cores&collection.configName=config&name=falsepredicate_shard2_replica1&action=CREATE&numShards=4&collection=falsepredicate&shard=shard2&wt=javabin&version=2} status=0 QTime=3
[junit4] 2> 151168 INFO (qtp1694069525-1588) [n:127.0.0.1:52787_solr ] o.a.s.s.HttpSolrCall [admin] webapp=null path=/admin/cores params={async=6a5f12ea-50d4-4b77-971a-55de33351e9f439472837245541&qt=/admin/cores&collection.configName=config&name=falsepredicate_shard1_replica1&action=CREATE&numShards=4&collection=falsepredicate&shard=shard1&wt=javabin&version=2} status=0 QTime=0
[junit4] 2> 151170 INFO (qtp646729506-1576) [n:127.0.0.1:52780_solr ] o.a.s.s.HttpSolrCall [admin] webapp=null path=/admin/cores params={async=6a5f12ea-50d4-4b77-971a-55de33351e9f439472837526184&qt=/admin/cores&collection.configName=config&name=falsepredicate_shard4_replica1&action=CREATE&numShards=4&collection=falsepredicate&shard=shard4&wt=javabin&version=2} status=0 QTime=0
[junit4] 2> 151173 INFO (qtp734565127-1599) [n:127.0.0.1:52790_solr ] o.a.s.s.HttpSolrCall [admin] webapp=null path=/admin/cores params={async=6a5f12ea-50d4-4b77-971a-55de33351e9f439472837762831&qt=/admin/cores&collection.configName=config&name=falsepredicate_shard3_replica1&action=CREATE&numShards=4&collection=falsepredicate&shard=shard3&wt=javabin&version=2} status=0 QTime=0
[junit4] 2> 151174 INFO (qtp1694069525-1588) [n:127.0.0.1:52787_solr ] o.a.s.h.a.CoreAdminOperation Checking request status for : 6a5f12ea-50d4-4b77-971a-55de33351e9f439472837245541
[junit4] 2> 151174 INFO (qtp1694069525-1588) [n:127.0.0.1:52787_solr ] o.a.s.s.HttpSolrCall [admin] webapp=null path=/admin/cores params={qt=/admin/cores&requestid=6a5f12ea-50d4-4b77-971a-55de33351e9f439472837245541&action=REQUESTSTATUS&wt=javabin&version=2} status=0 QTime=0
[junit4] 2> 151182 INFO (parallelCoreAdminExecutor-698-thread-1-processing-n:127.0.0.1:52777_solr 6a5f12ea-50d4-4b77-971a-55de33351e9f439472834586048 CREATE) [n:127.0.0.1:52777_solr ] o.a.s.h.a.CoreAdminOperation core create command async=6a5f12ea-50d4-4b77-971a-55de33351e9f439472834586048&qt=/admin/cores&collection.configName=config&name=falsepredicate_shard2_replica1&action=CREATE&numShards=4&collection=falsepredicate&shard=shard2&wt=javabin&version=2
[junit4] 2> 151187 INFO (parallelCoreAdminExecutor-698-thread-1-processing-n:127.0.0.1:52777_solr 6a5f12ea-50d4-4b77-971a-55de33351e9f439472834586048 CREATE) [n:127.0.0.1:52777_solr ] o.a.s.c.CoreDescriptor Created CoreDescriptor: {name=falsepredicate_shard2_replica1, collection.configName=config, config=solrconfig.xml, transient=false, schema=schema.xml, loadOnStartup=true, configSetProperties=configsetprops.json, collection=falsepredicate, numShards=4, dataDir=data\, shard=shard2}
[junit4] 2> 151188 INFO (parallelCoreAdminExecutor-698-thread-1-processing-n:127.0.0.1:52777_solr 6a5f12ea-50d4-4b77-971a-55de33351e9f439472834586048 CREATE) [n:127.0.0.1:52777_solr c:falsepredicate s:shard2 x:falsepredicate_shard2_replica1] o.a.s.c.ZkController publishing state=down
[junit4] 2> 151190 INFO (parallelCoreAdminExecutor-698-thread-1-processing-n:127.0.0.1:52777_solr 6a5f12ea-50d4-4b77-971a-55de33351e9f439472834586048 CREATE) [n:127.0.0.1:52777_solr c:falsepredicate s:shard2 x:falsepredicate_shard2_replica1] o.a.s.c.ZkController Registering watch for collection falsepredicate
[junit4] 2> 151190 INFO (parallelCoreAdminExecutor-694-thread-1-processing-n:127.0.0.1:52787_solr 6a5f12ea-50d4-4b77-971a-55de33351e9f439472837245541 CREATE) [n:127.0.0.1:52787_solr ] o.a.s.h.a.CoreAdminOperation core create command async=6a5f12ea-50d4-4b77-971a-55de33351e9f439472837245541&qt=/admin/cores&collection.configName=config&name=falsepredicate_shard1_replica1&action=CREATE&numShards=4&collection=falsepredicate&shard=shard1&wt=javabin&version=2
[junit4] 2> 151192 INFO (parallelCoreAdminExecutor-694-thread-1-processing-n:127.0.0.1:52787_solr 6a5f12ea-50d4-4b77-971a-55de33351e9f439472837245541 CREATE) [n:127.0.0.1:52787_solr ] o.a.s.c.CoreDescriptor Created CoreDescriptor: {name=falsepredicate_shard1_replica1, collection.configName=config, config=solrconfig.xml, transient=false, schema=schema.xml, loadOnStartup=true, configSetProperties=configsetprops.json, collection=falsepredicate, numShards=4, dataDir=data\, shard=shard1}
[junit4] 2> 151192 INFO (parallelCoreAdminExecutor-698-thread-1-processing-n:127.0.0.1:52777_solr 6a5f12ea-50d4-4b77-971a-55de33351e9f439472834586048 CREATE) [n:127.0.0.1:52777_solr c:falsepredicate s:shard2 x:falsepredicate_shard2_replica1] o.a.s.c.c.ZkStateReader Add data for [falsepredicate] ver [0]
[junit4] 2> 151192 INFO (parallelCoreAdminExecutor-698-thread-1-processing-n:127.0.0.1:52777_solr 6a5f12ea-50d4-4b77-971a-55de33351e9f439472834586048 CREATE) [n:127.0.0.1:52777_solr c:falsepredicate s:shard2 x:falsepredicate_shard2_replica1] o.a.s.c.ZkController look for our core node name
[junit4] 2> 151193 INFO (OverseerStateUpdate-96160764560474124-127.0.0.1:52790_solr-n_0000000000) [n:127.0.0.1:52790_solr ] o.a.s.c.Overseer processMessage: queueSize: 1, message = {
[junit4] 2> "core":"falsepredicate_shard2_replica1",
[junit4] 2> "roles":null,
[junit4] 2> "base_url":"http://127.0.0.1:52777/solr",
[junit4] 2> "node_name":"127.0.0.1:52777_solr",
[junit4] 2> "numShards":"4",
[junit4] 2> "state":"down",
[junit4] 2> "shard":"shard2",
[junit4] 2> "collection":"falsepredicate",
[junit4] 2> "operation":"state"} current state version: 0
[junit4] 2> 151193 INFO (OverseerStateUpdate-96160764560474124-127.0.0.1:52790_solr-n_0000000000) [n:127.0.0.1:52790_solr ] o.a.s.c.o.ReplicaMutator Update state numShards=4 message={
[junit4] 2> "core":"falsepredicate_shard2_replica1",
[junit4] 2> "roles":null,
[junit4] 2> "base_url":"http://127.0.0.1:52777/solr",
[junit4] 2> "node_name":"127.0.0.1:52777_solr",
[junit4] 2> "numShards":"4",
[junit4] 2> "state":"down",
[junit4] 2> "shard":"shard2",
[junit4] 2> "collection":"falsepredicate",
[junit4] 2> "operation":"state"}
[junit4] 2> 151193 INFO (parallelCoreAdminExecutor-694-thread-1-processing-n:127.0.0.1:52787_solr 6a5f12ea-50d4-4b77-971a-55de33351e9f439472837245541 CREATE) [n:127.0.0.1:52787_solr c:falsepredicate s:shard1 x:falsepredicate_shard1_replica1] o.a.s.c.ZkController publishing state=down
[junit4] 2> 151193 INFO (parallelCoreAdminExecutor-696-thread-1-processing-n:127.0.0.1:52780_solr 6a5f12ea-50d4-4b77-971a-55de33351e9f439472837526184 CREATE) [n:127.0.0.1:52780_solr ] o.a.s.h.a.CoreAdminOperation core create command async=6a5f12ea-50d4-4b77-971a-55de33351e9f439472837526184&qt=/admin/cores&collection.configName=config&name=falsepredicate_shard4_replica1&action=CREATE&numShards=4&collection=falsepredicate&shard=shard4&wt=javabin&version=2
[junit4] 2> 151194 INFO (parallelCoreAdminExecutor-696-thread-1-processing-n:127.0.0.1:52780_solr 6a5f12ea-50d4-4b77-971a-55de33351e9f439472837526184 CREATE) [n:127.0.0.1:52780_solr ] o.a.s.c.CoreDescriptor Created CoreDescriptor: {name=falsepredicate_shard4_replica1, collection.configName=config, config=solrconfig.xml, transient=false, schema=schema.xml, loadOnStartup=true, configSetProperties=configsetprops.json, collection=falsepredicate, numShards=4, dataDir=data\, shard=shard4}
[junit4] 2> 151196 INFO (parallelCoreAdminExecutor-696-thread-1-processing-n:127.0.0.1:52780_solr 6a5f12ea-50d4-4b77-971a-55de33351e9f439472837526184 CREATE) [n:127.0.0.1:52780_solr c:falsepredicate s:shard4 x:falsepredicate_shard4_replica1] o.a.s.c.ZkController publishing state=down
[junit4] 2> 151196 INFO (parallelCoreAdminExecutor-694-thread-1-processing-n:127.0.0.1:52787_solr 6a5f12ea-50d4-4b77-971a-55de33351e9f439472837245541 CREATE) [n:127.0.0.1:52787_solr c:falsepredicate s:shard1 x:falsepredicate_shard1_replica1] o.a.s.c.ZkController Registering watch for collection falsepredicate
[junit4] 2> 151198 INFO (parallelCoreAdminExecutor-694-thread-1-processing-n:127.0.0.1:52787_solr 6a5f12ea-50d4-4b77-971a-55de33351e9f439472837245541 CREATE) [n:127.0.0.1:52787_solr c:falsepredicate s:shard1 x:falsepredicate_shard1_replica1] o.a.s.c.c.ZkStateReader Add data for [falsepredicate] ver [0]
[junit4] 2> 151198 INFO (parallelCoreAdminExecutor-694-thread-1-processing-n:127.0.0.1:52787_solr 6a5f12ea-50d4-4b77-971a-55de33351e9f439472837245541 CREATE) [n:127.0.0.1:52787_solr c:falsepredicate s:shard1 x:falsepredicate_shard1_replica1] o.a.s.c.ZkController look for our core node name
[junit4] 2> 151198 INFO (parallelCoreAdminExecutor-696-thread-1-processing-n:127.0.0.1:52780_solr 6a5f12ea-50d4-4b77-971a-55de33351e9f439472837526184 CREATE) [n:127.0.0.1:52780_solr c:falsepredicate s:shard4 x:falsepredicate_shard4_replica1] o.a.s.c.ZkController Registering watch for collection falsepredicate
[junit4] 2> 151199 INFO (parallelCoreAdminExecutor-696-thread-1-processing-n:127.0.0.1:52780_solr 6a5f12ea-50d4-4b77-971a-55de33351e9f439472837526184 CREATE) [n:127.0.0.1:52780_solr c:falsepredicate s:shard4 x:falsepredicate_shard4_replica1] o.a.s.c.c.ZkStateReader Add data for [falsepredicate] ver [0]
[junit4] 2> 151200 INFO (parallelCoreAdminExecutor-696-thread-1-processing-n:127.0.0.1:52780_solr 6a5f12ea-50d4-4b77-971a-55de33351e9f439472837526184 CREATE) [n:127.0.0.1:52780_solr c:falsepredicate s:shard4 x:falsepredicate_shard4_replica1] o.a.s.c.ZkController look for our core node name
[junit4] 2> 151200 INFO (OverseerStateUpdate-96160764560474124-127.0.0.1:52790_solr-n_0000000000) [n:127.0.0.1:52790_solr ] o.a.s.c.Overseer processMessage: queueSize: 2, message = {
[junit4] 2> "core":"falsepredicate_shard1_replica1",
[junit4] 2> "roles":null,
[junit4] 2> "base_url":"http://127.0.0.1:52787/solr",
[junit4] 2> "node_name":"127.0.0.1:52787_solr",
[junit4] 2> "numShards":"4",
[junit4] 2> "state":"down",
[junit4] 2> "shard":"shard1",
[junit4] 2> "collection":"falsepredicate",
[junit4] 2> "operation":"state"} current state version: 0
[junit4] 2> 151200 INFO (OverseerStateUpdate-96160764560474124-127.0.0.1:52790_solr-n_0000000000) [n:127.0.0.1:52790_solr ] o.a.s.c.o.ReplicaMutator Update state numShards=4 message={
[junit4] 2> "core":"falsepredicate_shard1_replica1",
[junit4] 2> "roles":null,
[junit4] 2> "base_url":"http://127.0.0.1:52787/solr",
[junit4] 2> "node_name":"127.0.0.1:52787_solr",
[junit4] 2> "numShards":"4",
[junit4] 2> "state":"down",
[junit4] 2> "shard":"shard1",
[junit4] 2> "collection":"falsepredicate",
[junit4] 2> "operation":"state"}
[junit4] 2> 151203 INFO (OverseerStateUpdate-96160764560474124-127.0.0.1:52790_solr-n_0000000000) [n:127.0.0.1:52790_solr ] o.a.s.c.Overseer processMessage: queueSize: 2, message = {
[junit4] 2> "core":"falsepredicate_shard4_replica1",
[junit4] 2> "roles":null,
[junit4] 2> "base_url":"http://127.0.0.1:52780/solr",
[junit4] 2> "node_name":"127.0.0.1:52780_solr",
[junit4] 2> "numShards":"4",
[junit4] 2> "state":"down",
[junit4] 2> "shard":"shard4",
[junit4] 2> "collection":"falsepredicate",
[junit4] 2> "operation":"state"} current state version: 0
[junit4] 2> 151205 INFO (OverseerStateUpdate-96160764560474124-127.0.0.1:52790_solr-n_0000000000) [n:127.0.0.1:52790_solr ] o.a.s.c.o.ReplicaMutator Update state numShards=4 message={
[junit4] 2> "core":"falsepredicate_shard4_replica1",
[junit4] 2> "roles":null,
[junit4] 2> "base_url":"http://127.0.0.1:52780/solr",
[junit4] 2> "node_name":"127.0.0.1:52780_solr",
[junit4] 2> "numShards":"4",
[junit4] 2> "state":"down",
[junit4] 2> "shard":"shard4",
[junit4] 2> "collection":"falsepredicate",
[junit4] 2> "operation":"state"}
[junit4] 2> 151209 INFO (parallelCoreAdminExecutor-701-thread-1-processing-n:127.0.0.1:52790_solr 6a5f12ea-50d4-4b77-971a-55de33351e9f439472837762831 CREATE) [n:127.0.0.1:52790_solr ] o.a.s.h.a.CoreAdminOperation core create command async=6a5f12ea-50d4-4b77-971a-55de33351e9f439472837762831&qt=/admin/cores&collection.configName=config&name=falsepredicate_shard3_replica1&action=CREATE&numShards=4&collection=falsepredicate&shard=shard3&wt=javabin&version=2
[junit4] 2> 151211 INFO (parallelCoreAdminExecutor-701-thread-1-processing-n:127.0.0.1:52790_solr 6a5f12ea-50d4-4b77-971a-55de33351e9f439472837762831 CREATE) [n:127.0.0.1:52790_solr ] o.a.s.c.CoreDescriptor Created CoreDescriptor: {name=falsepredicate_shard3_replica1, collection.configName=config, config=solrconfig.xml, transient=false, schema=schema.xml, loadOnStartup=true, configSetProperties=configsetprops.json, collection=falsepredicate, numShards=4, dataDir=data\, shard=shard3}
[junit4] 2> 151213 INFO (parallelCoreAdminExecutor-701-thread-1-processing-n:127.0.0.1:52790_solr 6a5f12ea-50d4-4b77-971a-55de33351e9f439472837762831 CREATE) [n:127.0.0.1:52790_solr c:falsepredicate s:shard3 x:falsepredicate_shard3_replica1] o.a.s.c.ZkController publishing state=down
[junit4] 2> 151214 INFO (OverseerStateUpdate-96160764560474124-127.0.0.1:52790_solr-n_0000000000) [n:127.0.0.1:52790_solr ] o.a.s.c.Overseer processMessage: queueSize: 1, message = {
[junit4] 2> "core":"falsepredicate_shard3_replica1",
[junit4] 2> "roles":null,
[junit4] 2> "base_url":"http://127.0.0.1:52790/solr",
[junit4] 2> "node_name":"127.0.0.1:52790_solr",
[junit4] 2> "numShards":"4",
[junit4] 2> "state":"down",
[junit4] 2> "shard":"shard3",
[junit4] 2> "collection":"falsepredicate",
[junit4] 2> "operation":"state"} current state version: 0
[junit4] 2> 151214 INFO (parallelCoreAdminExecutor-701-thread-1-processing-n:127.0.0.1:52790_solr 6a5f12ea-50d4-4b77-971a-55de33351e9f439472837762831 CREATE) [n:127.0.0.1:52790_solr c:falsepredicate s:shard3 x:falsepredicate_shard3_replica1] o.a.s.c.ZkController Registering watch for collection falsepredicate
[junit4] 2> 151214 INFO (OverseerStateUpdate-96160764560474124-127.0.0.1:52790_solr-n_0000000000) [n:127.0.0.1:52790_solr ] o.a.s.c.o.ReplicaMutator Update state numShards=4 message={
[junit4] 2> "core":"falsepredicate_shard3_replica1",
[junit4] 2> "roles":null,
[junit4] 2> "base_url":"http://127.0.0.1:52790/solr",
[junit4] 2> "node_name":"127.0.0.1:52790_solr",
[junit4] 2> "numShards":"4",
[junit4] 2> "state":"down",
[junit4] 2> "shard":"shard3",
[junit4] 2> "collection":"falsepredicate",
[junit4] 2> "operation":"state"}
[junit4] 2> 151216 INFO (parallelCoreAdminExecutor-701-thread-1-processing-n:127.0.0.1:52790_solr 6a5f12ea-50d4-4b77-971a-55de33351e9f439472837762831 CREATE) [n:127.0.0.1:52790_solr c:falsepredicate s:shard3 x:falsepredicate_shard3_replica1] o.a.s.c.c.ZkStateReader Add data for [falsepredicate] ver [0]
[junit4] 2> 151216 INFO (parallelCoreAdminExecutor-701-thread-1-processing-n:127.0.0.1:52790_solr 6a5f12ea-50d4-4b77-971a-55de33351e9f439472837762831 CREATE) [n:127.0.0.1:52790_solr c:falsepredicate s:shard3 x:falsepredicate_shard3_replica1] o.a.s.c.ZkController look for our core node name
[junit4] 2> 151319 INFO (OverseerStateUpdate-96160764560474124-127.0.0.1:52790_solr-n_0000000000) [n:127.0.0.1:52790_solr ] o.a.s.c.o.ZkStateWriter going to update_collection /collections/falsepredicate/state.json version: 0
[junit4] 2> 151322 INFO (zkCallback-261-thread-1-processing-n:127.0.0.1:52780_solr) [n:127.0.0.1:52780_solr ] o.a.s.c.c.ZkStateReader A cluster state change: [WatchedEvent state:SyncConnected type:NodeDataChanged path:/collections/falsepredicate/state.json] for collection [falsepredicate] has occurred - updating... (live nodes size: [4])
[junit4] 2> 151322 INFO (zkCallback-262-thread-1-processing-n:127.0.0.1:52790_solr) [n:127.0.0.1:52790_solr ] o.a.s.c.c.ZkStateReader A cluster state change: [WatchedEvent state:SyncConnected type:NodeDataChanged path:/collections/falsepredicate/state.json] for collection [falsepredicate] has occurred - updating... (live nodes size: [4])
[junit4] 2> 151322 INFO (zkCallback-259-thread-1-processing-n:127.0.0.1:52777_solr) [n:127.0.0.1:52777_solr ] o.a.s.c.c.ZkStateReader A cluster state change: [WatchedEvent state:SyncConnected type:NodeDataChanged path:/collections/falsepredicate/state.json] for collection [falsepredicate] has occurred - updating... (live nodes size: [4])
[junit4] 2> 151322 INFO (zkCallback-260-thread-1-processing-n:127.0.0.1:52787_solr) [n:127.0.0.1:52787_solr ] o.a.s.c.c.ZkStateReader A cluster state change: [WatchedEvent state:SyncConnected type:NodeDataChanged path:/collections/falsepredicate/state.json] for collection [falsepredicate] has occurred - updating... (live nodes size: [4])
[junit4] 2> 151323 INFO (zkCallback-261-thread-1-processing-n:127.0.0.1:52780_solr) [n:127.0.0.1:52780_solr ] o.a.s.c.c.ZkStateReader Updating data for [falsepredicate] from [0] to [1]
[junit4] 2> 151323 INFO (zkCallback-259-thread-1-processing-n:127.0.0.1:52777_solr) [n:127.0.0.1:52777_solr ] o.a.s.c.c.ZkStateReader Updating data for [falsepredicate] from [0] to [1]
[junit4] 2> 151323 INFO (zkCallback-262-thread-1-processing-n:127.
[...truncated too long message...]
[junit4] 2> 211507 WARN (NIOServerCxn.Factory:0.0.0.0/0.0.0.0:0) [ ] o.a.z.s.NIOServerCnxn caught end of stream exception
[junit4] 2> EndOfStreamException: Unable to read additional data from client sessionid 0x155a1b4b4f5000c, likely client has closed socket
[junit4] 2> at org.apache.zookeeper.server.NIOServerCnxn.doIO(NIOServerCnxn.java:228)
[junit4] 2> at org.apache.zookeeper.server.NIOServerCnxnFactory.run(NIOServerCnxnFactory.java:208)
[junit4] 2> at java.lang.Thread.run(Thread.java:745)
[junit4] 2> 212982 WARN (zkCallback-260-thread-1-processing-n:127.0.0.1:52787_solr) [n:127.0.0.1:52787_solr ] o.a.s.c.c.ZkStateReader ZooKeeper watch triggered, but Solr cannot talk to ZK: [KeeperErrorCode = Session expired for /live_nodes]
[junit4] 2> 212982 WARN (zkCallback-277-thread-1-processing-n:127.0.0.1:52777_solr) [n:127.0.0.1:52777_solr ] o.a.s.c.LeaderElector
[junit4] 2> org.apache.zookeeper.KeeperException$SessionExpiredException: KeeperErrorCode = Session expired for /overseer_elect/election
[junit4] 2> at org.apache.zookeeper.KeeperException.create(KeeperException.java:127)
[junit4] 2> at org.apache.zookeeper.KeeperException.create(KeeperException.java:51)
[junit4] 2> at org.apache.zookeeper.ZooKeeper.getChildren(ZooKeeper.java:1472)
[junit4] 2> at org.apache.solr.common.cloud.SolrZkClient$6.execute(SolrZkClient.java:330)
[junit4] 2> at org.apache.solr.common.cloud.SolrZkClient$6.execute(SolrZkClient.java:327)
[junit4] 2> at org.apache.solr.common.cloud.ZkCmdExecutor.retryOperation(ZkCmdExecutor.java:60)
[junit4] 2> at org.apache.solr.common.cloud.SolrZkClient.getChildren(SolrZkClient.java:327)
[junit4] 2> at org.apache.solr.cloud.LeaderElector.checkIfIamLeader(LeaderElector.java:105)
[junit4] 2> at org.apache.solr.cloud.LeaderElector.access$200(LeaderElector.java:56)
[junit4] 2> at org.apache.solr.cloud.LeaderElector$ElectionWatcher.process(LeaderElector.java:348)
[junit4] 2> at org.apache.solr.common.cloud.SolrZkClient$3.lambda$process$0(SolrZkClient.java:265)
[junit4] 2> at java.util.concurrent.Executors$RunnableAdapter.call(Executors.java:511)
[junit4] 2> at java.util.concurrent.FutureTask.run(FutureTask.java:266)
[junit4] 2> at org.apache.solr.common.util.ExecutorUtil$MDCAwareThreadPoolExecutor.lambda$execute$0(ExecutorUtil.java:229)
[junit4] 2> at java.util.concurrent.ThreadPoolExecutor.runWorker(ThreadPoolExecutor.java:1142)
[junit4] 2> at java.util.concurrent.ThreadPoolExecutor$Worker.run(ThreadPoolExecutor.java:617)
[junit4] 2> at java.lang.Thread.run(Thread.java:745)
[junit4] 2> 212982 INFO (jetty-launcher-241-thread-7) [ ] o.e.j.s.h.ContextHandler Stopped o.e.j.s.ServletContextHandler@47b4b214{/solr,null,UNAVAILABLE}
[junit4] 2> 212982 INFO (jetty-launcher-241-thread-5) [ ] o.e.j.s.h.ContextHandler Stopped o.e.j.s.ServletContextHandler@1fbe8a0{/solr,null,UNAVAILABLE}
[junit4] 2> 212998 WARN (zkCallback-283-thread-2-processing-n:127.0.0.1:52780_solr) [n:127.0.0.1:52780_solr ] o.a.s.c.LeaderElector
[junit4] 2> org.apache.zookeeper.KeeperException$SessionExpiredException: KeeperErrorCode = Session expired for /overseer_elect/election
[junit4] 2> at org.apache.zookeeper.KeeperException.create(KeeperException.java:127)
[junit4] 2> at org.apache.zookeeper.KeeperException.create(KeeperException.java:51)
[junit4] 2> at org.apache.zookeeper.ZooKeeper.getChildren(ZooKeeper.java:1472)
[junit4] 2> at org.apache.solr.common.cloud.SolrZkClient$6.execute(SolrZkClient.java:330)
[junit4] 2> at org.apache.solr.common.cloud.SolrZkClient$6.execute(SolrZkClient.java:327)
[junit4] 2> at org.apache.solr.common.cloud.ZkCmdExecutor.retryOperation(ZkCmdExecutor.java:60)
[junit4] 2> at org.apache.solr.common.cloud.SolrZkClient.getChildren(SolrZkClient.java:327)
[junit4] 2> at org.apache.solr.cloud.LeaderElector.checkIfIamLeader(LeaderElector.java:105)
[junit4] 2> at org.apache.solr.cloud.LeaderElector.access$200(LeaderElector.java:56)
[junit4] 2> at org.apache.solr.cloud.LeaderElector$ElectionWatcher.process(LeaderElector.java:348)
[junit4] 2> at org.apache.solr.common.cloud.SolrZkClient$3.lambda$process$0(SolrZkClient.java:265)
[junit4] 2> at java.util.concurrent.Executors$RunnableAdapter.call(Executors.java:511)
[junit4] 2> at java.util.concurrent.FutureTask.run(FutureTask.java:266)
[junit4] 2> at org.apache.solr.common.util.ExecutorUtil$MDCAwareThreadPoolExecutor.lambda$execute$0(ExecutorUtil.java:229)
[junit4] 2> at java.util.concurrent.ThreadPoolExecutor.runWorker(ThreadPoolExecutor.java:1142)
[junit4] 2> at java.util.concurrent.ThreadPoolExecutor$Worker.run(ThreadPoolExecutor.java:617)
[junit4] 2> at java.lang.Thread.run(Thread.java:745)
[junit4] 2> 213008 WARN (zkCallback-262-thread-26-processing-n:127.0.0.1:52790_solr) [n:127.0.0.1:52790_solr ] o.a.s.c.c.ZkStateReader ZooKeeper watch triggered, but Solr cannot talk to ZK: [KeeperErrorCode = Session expired for /live_nodes]
[junit4] 2> 213008 INFO (jetty-launcher-241-thread-6) [ ] o.e.j.s.h.ContextHandler Stopped o.e.j.s.ServletContextHandler@647d55a9{/solr,null,UNAVAILABLE}
[junit4] 2> 213015 INFO (jetty-launcher-241-thread-8) [ ] o.e.j.s.h.ContextHandler Stopped o.e.j.s.ServletContextHandler@4be2639d{/solr,null,UNAVAILABLE}
[junit4] 2> 213035 INFO (SUITE-TestCollectionStateWatchers-seed#[ACE149333A9DD931]-worker) [ ] o.a.s.c.ZkTestServer connecting to 127.0.0.1:52773 52773
[junit4] 2> 213047 INFO (Thread-664) [ ] o.a.s.c.ZkTestServer connecting to 127.0.0.1:52773 52773
[junit4] 2> 213053 WARN (Thread-664) [ ] o.a.s.c.ZkTestServer Watch limit violations:
[junit4] 2> Maximum concurrent create/delete watches above limit:
[junit4] 2>
[junit4] 2> 7 /solr/aliases.json
[junit4] 2> 7 /solr/clusterprops.json
[junit4] 2> 6 /solr/security.json
[junit4] 2> 6 /solr/configs/config
[junit4] 2> 3 /solr/collections/stateformat1/state.json
[junit4] 2>
[junit4] 2> Maximum concurrent data watches above limit:
[junit4] 2>
[junit4] 2> 12 /solr/collections/waitforstate/state.json
[junit4] 2> 11 /solr/collections/falsepredicate/state.json
[junit4] 2> 7 /solr/clusterstate.json
[junit4] 2> 3 /solr/collections/stateformat1/state.json
[junit4] 2> 3 /solr/collections/testcollection/state.json
[junit4] 2> 2 /solr/collections/currentstate/state.json
[junit4] 2> 2 /solr/overseer_elect/election/96160764560474124-127.0.0.1:52790_solr-n_0000000000
[junit4] 2> 2 /solr/collections/delayed/state.json
[junit4] 2> 2 /solr/collections/tobedeleted/state.json
[junit4] 2> 2 /solr/overseer_elect/election/96160764560474122-127.0.0.1:52787_solr-n_0000000002
[junit4] 2>
[junit4] 2> Maximum concurrent children watches above limit:
[junit4] 2>
[junit4] 2> 74 /solr/overseer/queue
[junit4] 2> 37 /solr/overseer/collection-queue-work
[junit4] 2> 16 /solr/overseer/queue-work
[junit4] 2> 7 /solr/collections
[junit4] 2> 5 /solr/live_nodes
[junit4] 2>
[junit4] 2> 213053 INFO (SUITE-TestCollectionStateWatchers-seed#[ACE149333A9DD931]-worker) [ ] o.a.s.SolrTestCaseJ4 ###deleteCore
[junit4] 2> NOTE: leaving temporary files on disk at: C:\Users\jenkins\workspace\Lucene-Solr-master-Windows\solr\build\solr-solrj\test\J0\temp\solr.common.cloud.TestCollectionStateWatchers_ACE149333A9DD931-001
[junit4] 2> Jun 30, 2016 2:28:05 PM com.carrotsearch.randomizedtesting.ThreadLeakControl checkThreadLeaks
[junit4] 2> WARNING: Will linger awaiting termination of 1 leaked thread(s).
[junit4] 2> NOTE: test params are: codec=Lucene62, sim=ClassicSimilarity, locale=bg, timezone=Australia/Victoria
[junit4] 2> NOTE: Windows 10 10.0 amd64/Oracle Corporation 1.8.0_92 (64-bit)/cpus=3,threads=1,free=140199696,total=305696768
[junit4] 2> NOTE: All tests run in this JVM: [SolrExampleXMLTest, GraphExpressionTest, LBHttpSolrClientBuilderTest, TestDocumentObjectBinder, CollectionAdminRequestRequiredParamsTest, SolrExampleEmbeddedTest, TestJavaBinCodec, SchemaTest, TestClusteringResponse, ConcurrentUpdateSolrClientTest, TestCoreAdmin, TestToleratedUpdateError, StreamExpressionToExpessionTest, TestSolrJErrorHandling, SolrExampleStreamingTest, TestSolrProperties, TestCollectionStateWatchers]
[junit4] Completed [64/83 (1!)] on J0 in 63.67s, 9 tests, 1 error <<< FAILURES!
[...truncated 67 lines...]
BUILD FAILED
C:\Users\jenkins\workspace\Lucene-Solr-master-Windows\build.xml:740: The following error occurred while executing this line:
C:\Users\jenkins\workspace\Lucene-Solr-master-Windows\build.xml:684: The following error occurred while executing this line:
C:\Users\jenkins\workspace\Lucene-Solr-master-Windows\build.xml:59: The following error occurred while executing this line:
C:\Users\jenkins\workspace\Lucene-Solr-master-Windows\solr\build.xml:246: The following error occurred while executing this line:
C:\Users\jenkins\workspace\Lucene-Solr-master-Windows\solr\common-build.xml:530: The following error occurred while executing this line:
C:\Users\jenkins\workspace\Lucene-Solr-master-Windows\lucene\common-build.xml:1427: The following error occurred while executing this line:
C:\Users\jenkins\workspace\Lucene-Solr-master-Windows\lucene\common-build.xml:984: There were test failures: 83 suites, 645 tests, 1 error, 2 ignored [seed: ACE149333A9DD931]
Total time: 78 minutes 12 seconds
Build step 'Invoke Ant' marked build as failure
Archiving artifacts
[WARNINGS] Skipping publisher since build result is FAILURE
Recording test results
Email was triggered for: Failure - Any
Sending email for trigger: Failure - Any