You are viewing a plain text version of this content. The canonical link for it is here.
Posted to dev@poi.apache.org by Apache Jenkins Server <je...@builds.apache.org> on 2018/06/07 08:57:55 UTC
Build failed in Jenkins: POI-DSL-API-Check #327
See <https://builds.apache.org/job/POI-DSL-API-Check/327/display/redirect?page=changes>
Changes:
[fanningpj] fix some javadoc
[fanningpj] fix some javadoc
[fanningpj] use try with resources
[fanningpj] use spaces as indents
------------------------------------------
[...truncated 372.82 KB...]
AU src/documentation/resources/images/calendar.jpg
AU src/documentation/resources/images/loancalc.jpg
AU src/documentation/resources/images/pb-poi.cdr
AU src/documentation/resources/images/logoRaPiGmbH10.png
AU src/documentation/resources/images/utilClasses.gif
AU src/documentation/resources/images/logoMichaelMosmann.png
AU src/documentation/resources/images/logoRaPiGmbH11.png
AU src/documentation/resources/images/logoRaPiGmbH12.png
AU src/documentation/resources/images/simple-xls-with-function.jpg
AU src/documentation/resources/images/pb-poi.png
AU src/documentation/resources/images/group-logo-old.gif
AU src/documentation/resources/images/asf_logo.png
AU src/documentation/resources/images/unknown.jpg
AU src/documentation/resources/images/logoAndrewClements.png
AU src/documentation/resources/images/logoKarmokar4s.png
AU src/documentation/resources/images/ss-features.png
AU src/documentation/resources/images/logoKarmokar1.png
AU src/documentation/resources/images/logoKarmokar2.png
AU src/documentation/resources/images/logoKarmokar3.png
AU src/documentation/resources/images/logoKarmokar4.png
AU src/documentation/resources/images/logoRandyStanard01.png
AU src/documentation/resources/images/logoKarmokar5.png
AU src/documentation/resources/images/logoRandyStanard02.png
AU src/documentation/resources/images/logoKarmokar6.png
AU src/documentation/resources/images/logoRandyStanard03.png
AU src/documentation/resources/images/ApacheConEu08.jpg
AU src/documentation/resources/images/logoRandyStanard04.png
AU src/documentation/resources/images/logoLoicLefevre.png
AU src/documentation/resources/images/logoRandyStanard05.png
AU src/documentation/resources/images/logoRandyStanard06.png
AU src/documentation/resources/images/logoRandyStanard07.png
AU src/documentation/resources/images/logoRandyStanard08.png
AU src/documentation/resources/images/group-logo.jpg
AU src/documentation/resources/images/BlockClassDiagram.gif
AU src/documentation/resources/images/PropertyTableClassDiagram.gif
AU src/documentation/resources/images/logoKarmokar1s.png
AU src/documentation/resources/images/PropertySet.jpg
AU src/documentation/resources/images/vba-example.jpg
AU src/documentation/resources/images/logoKarmokar5s.png
AU src/documentation/resources/images/POIFSPropertyTablePreWrite.gif
AU src/documentation/resources/images/project-logo.png
A src/documentation/resources/stylesheets
AU src/documentation/resources/stylesheets/changes2document.xsl
AU src/documentation/resources/stylesheets/changes2rss.xsl
AU src/documentation/README.txt
At revision 1833110
Fetching 'https://svn.apache.org/repos/asf/poi/site/forrest.properties' at -1 into '<https://builds.apache.org/job/POI-DSL-API-Check/ws/forrest.properties'>
A forrest.properties
At revision 1833110
At revision 1833110
No changes for https://svn.apache.org/repos/asf/poi/site/src/documentation since the previous build
No changes for https://svn.apache.org/repos/asf/poi/site/forrest.properties since the previous build
[POI-DSL-API-Check] $ /bin/bash -xe /tmp/jenkins8371400879375292909.sh
+ svn status
X forrest.properties
X src/documentation
Performing status on external item at 'src/documentation':
+ echo Java-Home: /home/jenkins/tools/java/latest1.8
Java-Home: /home/jenkins/tools/java/latest1.8
+ ls -al /home/jenkins/tools/java/latest1.8/
total 25964
drwxr-xr-x 8 root root 4096 Apr 24 05:42 .
drwxr-xr-x 31 root root 4096 Apr 24 05:45 ..
drwxr-xr-x 2 root root 4096 Apr 24 05:42 bin
-r--r--r-- 1 root root 3244 Sep 14 2017 COPYRIGHT
drwxr-xr-x 4 root root 4096 Apr 24 05:42 db
drwxr-xr-x 3 root root 4096 Apr 24 05:42 include
-rw-r--r-- 1 root root 5202883 Sep 14 2017 javafx-src.zip
drwxr-xr-x 5 root root 4096 Apr 24 05:42 jre
drwxr-xr-x 5 root root 4096 Apr 24 05:42 lib
-r--r--r-- 1 root root 40 Sep 14 2017 LICENSE
drwxr-xr-x 4 root root 4096 Apr 24 05:42 man
-r--r--r-- 1 root root 159 Sep 14 2017 README.html
-rw-r--r-- 1 root root 424 Sep 14 2017 release
-rw-r--r-- 1 root root 21117451 Sep 14 2017 src.zip
-rw-r--r-- 1 root root 63933 Sep 14 2017 THIRDPARTYLICENSEREADME-JAVAFX.txt
-r--r--r-- 1 root root 145180 Sep 14 2017 THIRDPARTYLICENSEREADME.txt
+ ls -al /home/jenkins/tools/java/latest1.8/bin
total 784
drwxr-xr-x 2 root root 4096 Apr 24 05:42 .
drwxr-xr-x 8 root root 4096 Apr 24 05:42 ..
-rwxr-xr-x 1 root root 7965 Sep 14 2017 appletviewer
lrwxrwxrwx 1 root root 8 Sep 14 2017 ControlPanel -> jcontrol
-rwxr-xr-x 1 root root 7941 Sep 14 2017 extcheck
-rwxr-xr-x 1 root root 7973 Sep 14 2017 idlj
-rwxr-xr-x 1 root root 7925 Sep 14 2017 jar
-rwxr-xr-x 1 root root 7957 Sep 14 2017 jarsigner
-rwxr-xr-x 1 root root 7734 Sep 14 2017 java
-rwxr-xr-x 1 root root 7941 Sep 14 2017 javac
-rwxr-xr-x 1 root root 7941 Sep 14 2017 javadoc
-rwxr-xr-x 1 root root 2293 Sep 14 2017 javafxpackager
-rwxr-xr-x 1 root root 7941 Sep 14 2017 javah
-rwxr-xr-x 1 root root 7941 Sep 14 2017 javap
-rwxr-xr-x 1 root root 2293 Sep 14 2017 javapackager
-rwxr-xr-x 1 root root 1809 Sep 14 2017 java-rmi.cgi
-rwxr-xr-x 1 root root 129139 Sep 14 2017 javaws
-rwxr-xr-x 1 root root 7925 Sep 14 2017 jcmd
-rwxr-xr-x 1 root root 8013 Sep 14 2017 jconsole
-rwxr-xr-x 1 root root 6264 Sep 14 2017 jcontrol
-rwxr-xr-x 1 root root 7981 Sep 14 2017 jdb
-rwxr-xr-x 1 root root 7941 Sep 14 2017 jdeps
-rwxr-xr-x 1 root root 7941 Sep 14 2017 jhat
-rwxr-xr-x 1 root root 8109 Sep 14 2017 jinfo
-rwxr-xr-x 1 root root 7941 Sep 14 2017 jjs
-rwxr-xr-x 1 root root 8109 Sep 14 2017 jmap
-rwxr-xr-x 1 root root 74675 Nov 25 2016 jmc
-rwxr-xr-x 1 root root 402 Nov 25 2016 jmc.ini
-rwxr-xr-x 1 root root 7925 Sep 14 2017 jps
-rwxr-xr-x 1 root root 7949 Sep 14 2017 jrunscript
-rwxr-xr-x 1 root root 7981 Sep 14 2017 jsadebugd
-rwxr-xr-x 1 root root 8109 Sep 14 2017 jstack
-rwxr-xr-x 1 root root 7941 Sep 14 2017 jstat
-rwxr-xr-x 1 root root 7941 Sep 14 2017 jstatd
-rwxr-xr-x 1 root root 5110 Jan 14 2017 jvisualvm
-rwxr-xr-x 1 root root 7941 Sep 14 2017 keytool
-rwxr-xr-x 1 root root 7949 Sep 14 2017 native2ascii
-rwxr-xr-x 1 root root 8149 Sep 14 2017 orbd
-rwxr-xr-x 1 root root 7957 Sep 14 2017 pack200
-rwxr-xr-x 1 root root 7997 Sep 14 2017 policytool
-rwxr-xr-x 1 root root 7925 Sep 14 2017 rmic
-rwxr-xr-x 1 root root 7941 Sep 14 2017 rmid
-rwxr-xr-x 1 root root 7949 Sep 14 2017 rmiregistry
-rwxr-xr-x 1 root root 7957 Sep 14 2017 schemagen
-rwxr-xr-x 1 root root 7941 Sep 14 2017 serialver
-rwxr-xr-x 1 root root 7965 Sep 14 2017 servertool
-rwxr-xr-x 1 root root 8181 Sep 14 2017 tnameserv
-rwxr-xr-x 1 root root 231482 Sep 14 2017 unpack200
-rwxr-xr-x 1 root root 7941 Sep 14 2017 wsgen
-rwxr-xr-x 1 root root 7957 Sep 14 2017 wsimport
-rwxr-xr-x 1 root root 7957 Sep 14 2017 xjc
+ /home/jenkins/tools/java/latest1.8/bin/java -version
java version "1.8.0_152"
Java(TM) SE Runtime Environment (build 1.8.0_152-b16)
Java HotSpot(TM) 64-Bit Server VM (build 25.152-b16, mixed mode)
+ echo which java
which java
+ which java
/home/jenkins/tools/java/latest1.8/bin/java
+ java -version
java version "1.8.0_152"
Java(TM) SE Runtime Environment (build 1.8.0_152-b16)
Java HotSpot(TM) 64-Bit Server VM (build 25.152-b16, mixed mode)
+ echo which javac
which javac
+ which javac
/home/jenkins/tools/java/latest1.8/bin/javac
+ javac -version
javac 1.8.0_152
+ echo '<project default="test"><target name="test"><echo>Java ${ant.java.version}/${java.version}</echo><exec executable="javac"><arg value="-version"/></exec></target></project>'
+ ant -f build.javacheck.xml -v
Apache Ant(TM) version 1.9.6 compiled on July 8 2015
Buildfile: <https://builds.apache.org/job/POI-DSL-API-Check/ws/build.javacheck.xml>
Detected Java version: 1.8 in: /usr/local/asfpackages/java/jdk1.8.0_152/jre
Detected OS: Linux
parsing buildfile <https://builds.apache.org/job/POI-DSL-API-Check/ws/build.javacheck.xml> with URI = <https://builds.apache.org/job/POI-DSL-API-Check/ws/build.javacheck.xml>
Project base dir set to: <https://builds.apache.org/job/POI-DSL-API-Check/ws/>
Build sequence for target(s) `test' is [test]
Complete build sequence is [test, ]
test:
parsing buildfile jar:file:/usr/share/ant/lib/ant.jar!/org/apache/tools/ant/antlib.xml with URI = jar:file:/usr/share/ant/lib/ant.jar!/org/apache/tools/ant/antlib.xml from a zip file
[echo] Java 1.8/1.8.0_152
[exec] Current OS is Linux
[exec] Executing 'javac' with arguments:
[exec] '-version'
[exec]
[exec] The ' characters around the executable and arguments are
[exec] not part of the command.
[exec] javac 1.8.0_152
BUILD SUCCESSFUL
Total time: 0 seconds
+ exit 0
[Gradle] - Launching build.
[POI-DSL-API-Check] $ gradle japicmp
:main:compileJavaNote: Some input files use or override a deprecated API.
Note: Recompile with -Xlint:deprecation for details.
Note: Some input files use unchecked or unsafe operations.
Note: Recompile with -Xlint:unchecked for details.
:main:processResources
:main:classes
:main:jar
:ooxml:ant-check-jars
:ooxml:ant-fetch-jars
:ooxml:ant-check-ooxml-jars
:ooxml:ant-fetch-ooxml-jars
:ooxml:ant-init
[ant:echo] Using Ant: Apache Ant(TM) version 1.9.6 compiled on June 29 2015 from ${ant.home}, Ant detected Java 1.8 (may be different than actual Java sometimes...)
[ant:echo] Using Java: 1.8.0_152/1.8.0_152-b16/25.152-b16/Java HotSpot(TM) 64-Bit Server VM from Oracle Corporation on Linux: 4.13.0-1012-gcp
:ooxml:ant-check-ooxml-xsds
:ooxml:ant-fetch-ooxml-xsds
:ooxml:ant-check-compiled-ooxml-xsds
:ooxml:ant-compile-ooxml-xsds
Time to build schema type system: 1.074 seconds
Time to generate code: 3.13 seconds
[ant:echo] Forking javac with max heap size 1536m
[ant:javac] Note: <https://builds.apache.org/job/POI-DSL-API-Check/ws/build/xmlbean-sources/org/apache/poi/ooxml/POIXMLTypeLoader.java> uses or overrides a deprecated API.
[ant:javac] Note: Recompile with -Xlint:deprecation for details.
Time to build schema type system: 0.502 seconds
Time to generate code: 0.193 seconds
[ant:echo] Forking javac with max heap size 1536m
[ant:javac] Note: <https://builds.apache.org/job/POI-DSL-API-Check/ws/build/xmlbean-sources/org/apache/poi/ooxml/POIXMLTypeLoader.java> uses or overrides a deprecated API.
[ant:javac] Note: Recompile with -Xlint:deprecation for details.
:scratchpad:compileJavaNote: Some input files use or override a deprecated API.
Note: Recompile with -Xlint:deprecation for details.
Note: <https://builds.apache.org/job/POI-DSL-API-Check/ws/src/scratchpad/src/org/apache/poi/extractor/ole2/OLE2ScratchpadExtractorFactory.java> uses unchecked or unsafe operations.
Note: Recompile with -Xlint:unchecked for details.
:scratchpad:processResources
:scratchpad:classes
:scratchpad:jar
:ooxml:compileJavaNote: Some input files use or override a deprecated API.
Note: Recompile with -Xlint:deprecation for details.
Note: <https://builds.apache.org/job/POI-DSL-API-Check/ws/src/ooxml/java/org/apache/poi/ooxml/extractor/ExtractorFactory.java> uses unchecked or unsafe operations.
Note: Recompile with -Xlint:unchecked for details.
:ooxml:processResources
:ooxml:classes
:ooxml:jar
:excelant:compileJava
:excelant:processResources
:excelant:classes
:excelant:jar
:excelant:japicmp
:main:japicmp
:ooxml:japicmp FAILED
FAILURE: Build failed with an exception.
* What went wrong:
Execution failed for task ':ooxml:japicmp'.
> Could not load 'org.apache.poi.POITextExtractor': org.apache.poi.POITextExtractor. Please make sure that all libraries have been added to the classpath (CLASSPATH=:<https://builds.apache.org/job/POI-DSL-API-Check/ws/ooxml-lib/ooxml-schemas-1.4.jar>:<https://builds.apache.org/job/POI-DSL-API-Check/ws/ooxml-lib/ooxml-security-1.1.jar>:/home/jenkins/.gradle/caches/modules-2/files-2.1/org.apache.xmlbeans/xmlbeans/2.6.0/29e80d2dd51f9dcdef8f9ffaee0d4dc1c9bbfc87/xmlbeans-2.6.0.jar:<https://builds.apache.org/job/POI-DSL-API-Check/ws/build/scratchpad/build/libs/scratchpad-4.0.0-SNAPSHOT.jar>:<https://builds.apache.org/job/POI-DSL-API-Check/ws/build/main/build/libs/main-4.0.0-SNAPSHOT.jar>:/home/jenkins/.gradle/caches/modules-2/files-2.1/org.apache.commons/commons-collections4/4.1/a4cf4688fe1c7e3a63aa636cc96d013af537768e/commons-collections4-4.1.jar:/home/jenkins/.gradle/caches/modules-2/files-2.1/org.apache.commons/commons-math3/3.6.1/e4ba98f1d4b3c80ec46392f25e094a6a2e58fcbf/commons-math3-3.6.1.jar:/home/jenkins/.gradle/caches/modules-2/files-2.1/org.apache.commons/commons-compress/1.17/474c20609032e7f815ef534cd8174d2e400d9a8d/commons-compress-1.17.jar:/home/jenkins/.gradle/caches/modules-2/files-2.1/org.apache.santuario/xmlsec/2.1.0/99964d24525fa5ffbfe00bfc02085fc2e3a0f98d/xmlsec-2.1.0.jar:/home/jenkins/.gradle/caches/modules-2/files-2.1/org.bouncycastle/bcpkix-jdk15on/1.59/9cef0aab8a4bb849a8476c058ce3ff302aba3fff/bcpkix-jdk15on-1.59.jar:/home/jenkins/.gradle/caches/modules-2/files-2.1/com.github.virtuald/curvesapi/1.05/d4f227b550a0ab2b48360dd0ef64c9de93e45424/curvesapi-1.05.jar:/home/jenkins/.gradle/caches/modules-2/files-2.1/junit/junit/4.12/2973d150c0dc1fefe998f834810d68f278ea58ec/junit-4.12.jar:/home/jenkins/.gradle/caches/modules-2/files-2.1/stax/stax-api/1.0.1/49c100caf72d658aca8e58bd74a4ba90fa2b0d70/stax-api-1.0.1.jar:/home/jenkins/.gradle/caches/modules-2/files-2.1/org.slf4j/slf4j-api/1.7.22/a1c83373863cec7ae8d89dc1c5722d8cb6ec0309/slf4j-api-1.7.22.jar:/home/jenkins/.gradle/caches/modules-2/files-2.1/org.codehaus.woodstox/woodstox-core-asl/4.4.1/84fee5eb1a4a1cefe65b6883c73b3fa83be3c1a1/woodstox-core-asl-4.4.1.jar:/home/jenkins/.gradle/caches/modules-2/files-2.1/commons-codec/commons-codec/1.11/3acb4705652e16236558f0f4f2192cc33c3bd189/commons-codec-1.11.jar:/home/jenkins/.gradle/caches/modules-2/files-2.1/org.bouncycastle/bcprov-jdk15on/1.59/2507204241ab450456bdb8e8c0a8f986e418bd99/bcprov-jdk15on-1.59.jar:/home/jenkins/.gradle/caches/modules-2/files-2.1/org.hamcrest/hamcrest-core/1.3/42a25dc3219429f0e5d060061f71acb49bf010a0/hamcrest-core-1.3.jar:/home/jenkins/.gradle/caches/modules-2/files-2.1/commons-logging/commons-logging/1.2/4bfc12adfe4842bf07b657f0369c4cb522955686/commons-logging-1.2.jar:/home/jenkins/.gradle/caches/modules-2/files-2.1/javax.xml.stream/stax-api/1.0-2/d6337b0de8b25e53e81b922352fbea9f9f57ba0b/stax-api-1.0-2.jar:/home/jenkins/.gradle/caches/modules-2/files-2.1/org.codehaus.woodstox/stax2-api/3.1.4/ac19014b1e6a7c08aad07fe114af792676b685b7/stax2-api-3.1.4.jar:) or try the option '--ignore-missing-classes'.
* Try:
Run with --stacktrace option to get the stack trace. Run with --info or --debug option to get more log output.
* Get more help at https://help.gradle.org
BUILD FAILED in 1m 32s
24 actionable tasks: 24 executed
Build step 'Invoke Gradle script' changed build result to FAILURE
Build step 'Invoke Gradle script' marked build as failure
Archiving artifacts
[Fast Archiver] Compressed 532.95 KB of artifacts by 60.0% relative to #324
---------------------------------------------------------------------
To unsubscribe, e-mail: dev-unsubscribe@poi.apache.org
For additional commands, e-mail: dev-help@poi.apache.org
Jenkins build is back to normal : POI-DSL-API-Check #331
Posted by Apache Jenkins Server <je...@builds.apache.org>.
See <https://builds.apache.org/job/POI-DSL-API-Check/331/display/redirect?page=changes>
---------------------------------------------------------------------
To unsubscribe, e-mail: dev-unsubscribe@poi.apache.org
For additional commands, e-mail: dev-help@poi.apache.org
Build failed in Jenkins: POI-DSL-API-Check #330
Posted by Apache Jenkins Server <je...@builds.apache.org>.
See <https://builds.apache.org/job/POI-DSL-API-Check/330/display/redirect?page=changes>
Changes:
[centic] Fix some IDE warnings, Javadoc, useless asserts, ...
[centic] Update Gradle wrapper to 4.6
[centic] Remove the older version of commons-compress and some possible remnants of xmlbeans-2.3.0
[fanningpj] remove unnecessary xmlbeans jar manipulation
[fanningpj] update property names in build.xml
------------------------------------------
[...truncated 372.10 KB...]
AU src/documentation/skins/common/xslt/html/pathutils.xsl
AU src/documentation/skins/common/xslt/html/tab2menu.xsl
AU src/documentation/skins/common/xslt/html/dotdots.xsl
AU src/documentation/skins/common/xslt/html/renderlogo.xsl
AU src/documentation/skins/common/xslt/html/book2menu.xsl
A src/documentation/skins/common/images
AU src/documentation/skins/common/images/spacer.gif
AU src/documentation/skins/common/images/pdfdoc.gif
AU src/documentation/skins/common/images/built-with-forrest-button.png
AU src/documentation/skins/common/images/printer.gif
AU src/documentation/skins/common/images/valid-html401.png
AU src/documentation/skins/common/images/xmldoc.gif
AU src/documentation/skins/common/images/README.txt
A src/documentation/skins/poi-site
A src/documentation/skins/poi-site/images
AU src/documentation/skins/poi-site/images/printer.gif
AU src/documentation/skins/poi-site/images/xmldoc.gif
AU src/documentation/skins/poi-site/images/nw_min.gif
AU src/documentation/skins/poi-site/images/favicon.ico
AU src/documentation/skins/poi-site/images/strich.gif
AU src/documentation/skins/poi-site/images/nw_maj_rond.gif
AU src/documentation/skins/poi-site/images/vcss.png
AU src/documentation/skins/poi-site/images/pdfdoc.gif
AU src/documentation/skins/poi-site/images/update.png
AU src/documentation/skins/poi-site/images/void.gif
AU src/documentation/skins/poi-site/images/built-with-forrest-button.png
AU src/documentation/skins/poi-site/images/fix.png
AU src/documentation/skins/poi-site/images/note.gif
AU src/documentation/skins/poi-site/images/valid-html401.png
AU src/documentation/skins/poi-site/images/add.png
AU src/documentation/skins/poi-site/images/remove.png
AU src/documentation/skins/poi-site/images/spacer.gif
A src/documentation/skins/poi-site/css
AU src/documentation/skins/poi-site/css/mysite.css
AU src/documentation/skins/poi-site/css/print.css
AU src/documentation/skins/poi-site/css/tigris.css
AU src/documentation/skins/poi-site/css/site.css
A src/documentation/skins/poi-site/xslt
A src/documentation/skins/poi-site/xslt/fo
AU src/documentation/skins/poi-site/xslt/fo/document2fo.xsl
A src/documentation/skins/poi-site/xslt/html
AU src/documentation/skins/poi-site/xslt/html/tab2menu.xsl
AU src/documentation/skins/poi-site/xslt/html/book2menu.xsl
AU src/documentation/skins/poi-site/xslt/html/site2xhtml.xsl
AU src/documentation/skins/poi-site/xslt/html/document2html.xsl
At revision 1833293
Fetching 'https://svn.apache.org/repos/asf/poi/site/forrest.properties' at -1 into '<https://builds.apache.org/job/POI-DSL-API-Check/ws/forrest.properties'>
A forrest.properties
At revision 1833293
At revision 1833293
No changes for https://svn.apache.org/repos/asf/poi/site/src/documentation since the previous build
No changes for https://svn.apache.org/repos/asf/poi/site/forrest.properties since the previous build
[POI-DSL-API-Check] $ /bin/bash -xe /tmp/jenkins3148673363066182781.sh
+ svn status
X forrest.properties
X src/documentation
Performing status on external item at 'src/documentation':
+ echo Java-Home: /home/jenkins/tools/java/latest1.8
Java-Home: /home/jenkins/tools/java/latest1.8
+ ls -al /home/jenkins/tools/java/latest1.8/
total 25964
drwxr-xr-x 8 root root 4096 Apr 24 05:42 .
drwxr-xr-x 31 root root 4096 Apr 24 05:45 ..
drwxr-xr-x 2 root root 4096 Apr 24 05:42 bin
-r--r--r-- 1 root root 3244 Sep 14 2017 COPYRIGHT
drwxr-xr-x 4 root root 4096 Apr 24 05:42 db
drwxr-xr-x 3 root root 4096 Apr 24 05:42 include
-rw-r--r-- 1 root root 5202883 Sep 14 2017 javafx-src.zip
drwxr-xr-x 5 root root 4096 Apr 24 05:42 jre
drwxr-xr-x 5 root root 4096 Apr 24 05:42 lib
-r--r--r-- 1 root root 40 Sep 14 2017 LICENSE
drwxr-xr-x 4 root root 4096 Apr 24 05:42 man
-r--r--r-- 1 root root 159 Sep 14 2017 README.html
-rw-r--r-- 1 root root 424 Sep 14 2017 release
-rw-r--r-- 1 root root 21117451 Sep 14 2017 src.zip
-rw-r--r-- 1 root root 63933 Sep 14 2017 THIRDPARTYLICENSEREADME-JAVAFX.txt
-r--r--r-- 1 root root 145180 Sep 14 2017 THIRDPARTYLICENSEREADME.txt
+ ls -al /home/jenkins/tools/java/latest1.8/bin
total 784
drwxr-xr-x 2 root root 4096 Apr 24 05:42 .
drwxr-xr-x 8 root root 4096 Apr 24 05:42 ..
-rwxr-xr-x 1 root root 7965 Sep 14 2017 appletviewer
lrwxrwxrwx 1 root root 8 Sep 14 2017 ControlPanel -> jcontrol
-rwxr-xr-x 1 root root 7941 Sep 14 2017 extcheck
-rwxr-xr-x 1 root root 7973 Sep 14 2017 idlj
-rwxr-xr-x 1 root root 7925 Sep 14 2017 jar
-rwxr-xr-x 1 root root 7957 Sep 14 2017 jarsigner
-rwxr-xr-x 1 root root 7734 Sep 14 2017 java
-rwxr-xr-x 1 root root 7941 Sep 14 2017 javac
-rwxr-xr-x 1 root root 7941 Sep 14 2017 javadoc
-rwxr-xr-x 1 root root 2293 Sep 14 2017 javafxpackager
-rwxr-xr-x 1 root root 7941 Sep 14 2017 javah
-rwxr-xr-x 1 root root 7941 Sep 14 2017 javap
-rwxr-xr-x 1 root root 2293 Sep 14 2017 javapackager
-rwxr-xr-x 1 root root 1809 Sep 14 2017 java-rmi.cgi
-rwxr-xr-x 1 root root 129139 Sep 14 2017 javaws
-rwxr-xr-x 1 root root 7925 Sep 14 2017 jcmd
-rwxr-xr-x 1 root root 8013 Sep 14 2017 jconsole
-rwxr-xr-x 1 root root 6264 Sep 14 2017 jcontrol
-rwxr-xr-x 1 root root 7981 Sep 14 2017 jdb
-rwxr-xr-x 1 root root 7941 Sep 14 2017 jdeps
-rwxr-xr-x 1 root root 7941 Sep 14 2017 jhat
-rwxr-xr-x 1 root root 8109 Sep 14 2017 jinfo
-rwxr-xr-x 1 root root 7941 Sep 14 2017 jjs
-rwxr-xr-x 1 root root 8109 Sep 14 2017 jmap
-rwxr-xr-x 1 root root 74675 Nov 25 2016 jmc
-rwxr-xr-x 1 root root 402 Nov 25 2016 jmc.ini
-rwxr-xr-x 1 root root 7925 Sep 14 2017 jps
-rwxr-xr-x 1 root root 7949 Sep 14 2017 jrunscript
-rwxr-xr-x 1 root root 7981 Sep 14 2017 jsadebugd
-rwxr-xr-x 1 root root 8109 Sep 14 2017 jstack
-rwxr-xr-x 1 root root 7941 Sep 14 2017 jstat
-rwxr-xr-x 1 root root 7941 Sep 14 2017 jstatd
-rwxr-xr-x 1 root root 5110 Jan 14 2017 jvisualvm
-rwxr-xr-x 1 root root 7941 Sep 14 2017 keytool
-rwxr-xr-x 1 root root 7949 Sep 14 2017 native2ascii
-rwxr-xr-x 1 root root 8149 Sep 14 2017 orbd
-rwxr-xr-x 1 root root 7957 Sep 14 2017 pack200
-rwxr-xr-x 1 root root 7997 Sep 14 2017 policytool
-rwxr-xr-x 1 root root 7925 Sep 14 2017 rmic
-rwxr-xr-x 1 root root 7941 Sep 14 2017 rmid
-rwxr-xr-x 1 root root 7949 Sep 14 2017 rmiregistry
-rwxr-xr-x 1 root root 7957 Sep 14 2017 schemagen
-rwxr-xr-x 1 root root 7941 Sep 14 2017 serialver
-rwxr-xr-x 1 root root 7965 Sep 14 2017 servertool
-rwxr-xr-x 1 root root 8181 Sep 14 2017 tnameserv
-rwxr-xr-x 1 root root 231482 Sep 14 2017 unpack200
-rwxr-xr-x 1 root root 7941 Sep 14 2017 wsgen
-rwxr-xr-x 1 root root 7957 Sep 14 2017 wsimport
-rwxr-xr-x 1 root root 7957 Sep 14 2017 xjc
+ /home/jenkins/tools/java/latest1.8/bin/java -version
java version "1.8.0_152"
Java(TM) SE Runtime Environment (build 1.8.0_152-b16)
Java HotSpot(TM) 64-Bit Server VM (build 25.152-b16, mixed mode)
+ echo which java
which java
+ which java
/home/jenkins/tools/java/latest1.8/bin/java
+ java -version
java version "1.8.0_152"
Java(TM) SE Runtime Environment (build 1.8.0_152-b16)
Java HotSpot(TM) 64-Bit Server VM (build 25.152-b16, mixed mode)
+ echo which javac
which javac
+ which javac
/home/jenkins/tools/java/latest1.8/bin/javac
+ javac -version
javac 1.8.0_152
+ echo '<project default="test"><target name="test"><echo>Java ${ant.java.version}/${java.version}</echo><exec executable="javac"><arg value="-version"/></exec></target></project>'
+ ant -f build.javacheck.xml -v
Apache Ant(TM) version 1.9.6 compiled on July 8 2015
Buildfile: <https://builds.apache.org/job/POI-DSL-API-Check/ws/build.javacheck.xml>
Detected Java version: 1.8 in: /usr/local/asfpackages/java/jdk1.8.0_152/jre
Detected OS: Linux
parsing buildfile <https://builds.apache.org/job/POI-DSL-API-Check/ws/build.javacheck.xml> with URI = <https://builds.apache.org/job/POI-DSL-API-Check/ws/build.javacheck.xml>
Project base dir set to: <https://builds.apache.org/job/POI-DSL-API-Check/ws/>
Build sequence for target(s) `test' is [test]
Complete build sequence is [test, ]
test:
parsing buildfile jar:file:/usr/share/ant/lib/ant.jar!/org/apache/tools/ant/antlib.xml with URI = jar:file:/usr/share/ant/lib/ant.jar!/org/apache/tools/ant/antlib.xml from a zip file
[echo] Java 1.8/1.8.0_152
[exec] Current OS is Linux
[exec] Executing 'javac' with arguments:
[exec] '-version'
[exec]
[exec] The ' characters around the executable and arguments are
[exec] not part of the command.
[exec] javac 1.8.0_152
BUILD SUCCESSFUL
Total time: 0 seconds
+ exit 0
[Gradle] - Launching build.
[POI-DSL-API-Check] $ gradle japicmp
:main:compileJavaNote: Some input files use or override a deprecated API.
Note: Recompile with -Xlint:deprecation for details.
Note: Some input files use unchecked or unsafe operations.
Note: Recompile with -Xlint:unchecked for details.
:main:processResources
:main:classes
:main:jar
:ooxml:ant-check-jars
:ooxml:ant-fetch-jars
:ooxml:ant-check-ooxml-jars
:ooxml:ant-fetch-ooxml-jars
:ooxml:ant-init
[ant:echo] Using Ant: Apache Ant(TM) version 1.9.6 compiled on June 29 2015 from ${ant.home}, Ant detected Java 1.8 (may be different than actual Java sometimes...)
[ant:echo] Using Java: 1.8.0_152/1.8.0_152-b16/25.152-b16/Java HotSpot(TM) 64-Bit Server VM from Oracle Corporation on Linux: 4.13.0-1012-gcp
:ooxml:ant-check-ooxml-xsds
:ooxml:ant-fetch-ooxml-xsds
:ooxml:ant-check-compiled-ooxml-xsds
:ooxml:ant-compile-ooxml-xsds
Time to build schema type system: 1.185 seconds
Time to generate code: 3.373 seconds
[ant:echo] Forking javac with max heap size 1536m
[ant:javac] Note: <https://builds.apache.org/job/POI-DSL-API-Check/ws/build/xmlbean-sources/org/apache/poi/ooxml/POIXMLTypeLoader.java> uses or overrides a deprecated API.
[ant:javac] Note: Recompile with -Xlint:deprecation for details.
Time to build schema type system: 0.536 seconds
Time to generate code: 0.201 seconds
[ant:echo] Forking javac with max heap size 1536m
[ant:javac] Note: <https://builds.apache.org/job/POI-DSL-API-Check/ws/build/xmlbean-sources/org/apache/poi/ooxml/POIXMLTypeLoader.java> uses or overrides a deprecated API.
[ant:javac] Note: Recompile with -Xlint:deprecation for details.
:scratchpad:compileJavaNote: Some input files use or override a deprecated API.
Note: Recompile with -Xlint:deprecation for details.
Note: <https://builds.apache.org/job/POI-DSL-API-Check/ws/src/scratchpad/src/org/apache/poi/extractor/ole2/OLE2ScratchpadExtractorFactory.java> uses unchecked or unsafe operations.
Note: Recompile with -Xlint:unchecked for details.
:scratchpad:processResources
:scratchpad:classes
:scratchpad:jar
:ooxml:compileJavaNote: Some input files use or override a deprecated API.
Note: Recompile with -Xlint:deprecation for details.
Note: <https://builds.apache.org/job/POI-DSL-API-Check/ws/src/ooxml/java/org/apache/poi/ooxml/extractor/ExtractorFactory.java> uses unchecked or unsafe operations.
Note: Recompile with -Xlint:unchecked for details.
:ooxml:processResources
:ooxml:classes
:ooxml:jar
:excelant:compileJava
:excelant:processResources
:excelant:classes
:excelant:jar
:excelant:japicmp
:main:japicmp
:ooxml:japicmp FAILED
FAILURE: Build failed with an exception.
* What went wrong:
Execution failed for task ':ooxml:japicmp'.
> Could not load 'org.apache.poi.POITextExtractor': org.apache.poi.POITextExtractor. Please make sure that all libraries have been added to the classpath (CLASSPATH=:<https://builds.apache.org/job/POI-DSL-API-Check/ws/ooxml-lib/ooxml-schemas-1.4.jar>:<https://builds.apache.org/job/POI-DSL-API-Check/ws/ooxml-lib/ooxml-security-1.1.jar>:/home/jenkins/.gradle/caches/modules-2/files-2.1/org.apache.xmlbeans/xmlbeans/2.6.0/29e80d2dd51f9dcdef8f9ffaee0d4dc1c9bbfc87/xmlbeans-2.6.0.jar:<https://builds.apache.org/job/POI-DSL-API-Check/ws/build/scratchpad/build/libs/scratchpad-4.0.0-SNAPSHOT.jar>:<https://builds.apache.org/job/POI-DSL-API-Check/ws/build/main/build/libs/main-4.0.0-SNAPSHOT.jar>:/home/jenkins/.gradle/caches/modules-2/files-2.1/org.apache.commons/commons-collections4/4.1/a4cf4688fe1c7e3a63aa636cc96d013af537768e/commons-collections4-4.1.jar:/home/jenkins/.gradle/caches/modules-2/files-2.1/org.apache.commons/commons-math3/3.6.1/e4ba98f1d4b3c80ec46392f25e094a6a2e58fcbf/commons-math3-3.6.1.jar:/home/jenkins/.gradle/caches/modules-2/files-2.1/org.apache.commons/commons-compress/1.17/474c20609032e7f815ef534cd8174d2e400d9a8d/commons-compress-1.17.jar:/home/jenkins/.gradle/caches/modules-2/files-2.1/org.apache.santuario/xmlsec/2.1.0/99964d24525fa5ffbfe00bfc02085fc2e3a0f98d/xmlsec-2.1.0.jar:/home/jenkins/.gradle/caches/modules-2/files-2.1/org.bouncycastle/bcpkix-jdk15on/1.59/9cef0aab8a4bb849a8476c058ce3ff302aba3fff/bcpkix-jdk15on-1.59.jar:/home/jenkins/.gradle/caches/modules-2/files-2.1/com.github.virtuald/curvesapi/1.05/d4f227b550a0ab2b48360dd0ef64c9de93e45424/curvesapi-1.05.jar:/home/jenkins/.gradle/caches/modules-2/files-2.1/junit/junit/4.12/2973d150c0dc1fefe998f834810d68f278ea58ec/junit-4.12.jar:/home/jenkins/.gradle/caches/modules-2/files-2.1/stax/stax-api/1.0.1/49c100caf72d658aca8e58bd74a4ba90fa2b0d70/stax-api-1.0.1.jar:/home/jenkins/.gradle/caches/modules-2/files-2.1/org.slf4j/slf4j-api/1.7.22/a1c83373863cec7ae8d89dc1c5722d8cb6ec0309/slf4j-api-1.7.22.jar:/home/jenkins/.gradle/caches/modules-2/files-2.1/org.codehaus.woodstox/woodstox-core-asl/4.4.1/84fee5eb1a4a1cefe65b6883c73b3fa83be3c1a1/woodstox-core-asl-4.4.1.jar:/home/jenkins/.gradle/caches/modules-2/files-2.1/commons-codec/commons-codec/1.11/3acb4705652e16236558f0f4f2192cc33c3bd189/commons-codec-1.11.jar:/home/jenkins/.gradle/caches/modules-2/files-2.1/org.bouncycastle/bcprov-jdk15on/1.59/2507204241ab450456bdb8e8c0a8f986e418bd99/bcprov-jdk15on-1.59.jar:/home/jenkins/.gradle/caches/modules-2/files-2.1/org.hamcrest/hamcrest-core/1.3/42a25dc3219429f0e5d060061f71acb49bf010a0/hamcrest-core-1.3.jar:/home/jenkins/.gradle/caches/modules-2/files-2.1/commons-logging/commons-logging/1.2/4bfc12adfe4842bf07b657f0369c4cb522955686/commons-logging-1.2.jar:/home/jenkins/.gradle/caches/modules-2/files-2.1/javax.xml.stream/stax-api/1.0-2/d6337b0de8b25e53e81b922352fbea9f9f57ba0b/stax-api-1.0-2.jar:/home/jenkins/.gradle/caches/modules-2/files-2.1/org.codehaus.woodstox/stax2-api/3.1.4/ac19014b1e6a7c08aad07fe114af792676b685b7/stax2-api-3.1.4.jar:) or try the option '--ignore-missing-classes'.
* Try:
Run with --stacktrace option to get the stack trace. Run with --info or --debug option to get more log output.
* Get more help at https://help.gradle.org
BUILD FAILED in 1m 35s
24 actionable tasks: 24 executed
Build step 'Invoke Gradle script' changed build result to FAILURE
Build step 'Invoke Gradle script' marked build as failure
Archiving artifacts
[Fast Archiver] Compressed 532.95 KB of artifacts by 60.0% relative to #324
---------------------------------------------------------------------
To unsubscribe, e-mail: dev-unsubscribe@poi.apache.org
For additional commands, e-mail: dev-help@poi.apache.org
Build failed in Jenkins: POI-DSL-API-Check #329
Posted by Apache Jenkins Server <je...@builds.apache.org>.
See <https://builds.apache.org/job/POI-DSL-API-Check/329/display/redirect?page=changes>
Changes:
[fanningpj] fix some deprecation warnings
[kiwiwings] remove obsolete dev classes
------------------------------------------
Started by an SCM change
[EnvInject] - Loading node environment variables.
[EnvInject] - Preparing an environment for the build.
[EnvInject] - Keeping Jenkins system variables.
[EnvInject] - Keeping Jenkins build variables.
[EnvInject] - Injecting as environment variables the properties content
LANG=en_US.UTF-8
[EnvInject] - Variables injected successfully.
[EnvInject] - Injecting contributions.
Building remotely on beam10 (beam) in workspace <https://builds.apache.org/job/POI-DSL-API-Check/ws/>
[WS-CLEANUP] Deleting project workspace...
[WS-CLEANUP] Done
Updating https://svn.apache.org/repos/asf/poi/trunk at revision '2018-06-08T23:43:57.781 +0000'
D src/java/org/apache/poi/dev
D src/ooxml/java/org/apache/poi/extractor
D src/ooxml/java/org/apache/poi/dev
D src/ooxml/java/org/apache/poi/xssf/dev
U src/ooxml/java/org/apache/poi/xssf/usermodel/helpers/ColumnHelper.java
U src/ooxml/java/org/apache/poi/xslf/usermodel/XSLFTable.java
U src/ooxml/java/org/apache/poi/xslf/usermodel/XSLFTableStyles.java
U src/ooxml/java/org/apache/poi/xslf/usermodel/XSLFTextParagraph.java
D src/ooxml/java/org/apache/poi/ooxml/dev
U src/ooxml/java/org/apache/poi/ooxml/POIXMLProperties.java
U src/ooxml/java/org/apache/poi/ooxml/extractor/POIXMLPropertiesTextExtractor.java
D src/ooxml/testcases/org/apache/poi/dev
D src/testcases/org/apache/poi/dev
Fetching 'https://svn.apache.org/repos/asf/poi/site/src/documentation' at -1 into '<https://builds.apache.org/job/POI-DSL-API-Check/ws/src/documentation'>
At revision 1833218
Fetching 'https://svn.apache.org/repos/asf/poi/site/forrest.properties' at -1 into '<https://builds.apache.org/job/POI-DSL-API-Check/ws/forrest.properties'>
At revision 1833218
At revision 1833218
No changes for https://svn.apache.org/repos/asf/poi/site/src/documentation since the previous build
No changes for https://svn.apache.org/repos/asf/poi/site/forrest.properties since the previous build
[POI-DSL-API-Check] $ /bin/bash -xe /tmp/jenkins2773631405573482473.sh
+ svn status
? build.javacheck.xml
X forrest.properties
X src/documentation
Performing status on external item at 'src/documentation':
+ echo Java-Home: /home/jenkins/tools/java/latest1.8
Java-Home: /home/jenkins/tools/java/latest1.8
+ ls -al /home/jenkins/tools/java/latest1.8/
total 25964
drwxr-xr-x 8 root root 4096 Apr 24 05:42 .
drwxr-xr-x 31 root root 4096 Apr 24 05:45 ..
drwxr-xr-x 2 root root 4096 Apr 24 05:42 bin
-r--r--r-- 1 root root 3244 Sep 14 2017 COPYRIGHT
drwxr-xr-x 4 root root 4096 Apr 24 05:42 db
drwxr-xr-x 3 root root 4096 Apr 24 05:42 include
-rw-r--r-- 1 root root 5202883 Sep 14 2017 javafx-src.zip
drwxr-xr-x 5 root root 4096 Apr 24 05:42 jre
drwxr-xr-x 5 root root 4096 Apr 24 05:42 lib
-r--r--r-- 1 root root 40 Sep 14 2017 LICENSE
drwxr-xr-x 4 root root 4096 Apr 24 05:42 man
-r--r--r-- 1 root root 159 Sep 14 2017 README.html
-rw-r--r-- 1 root root 424 Sep 14 2017 release
-rw-r--r-- 1 root root 21117451 Sep 14 2017 src.zip
-rw-r--r-- 1 root root 63933 Sep 14 2017 THIRDPARTYLICENSEREADME-JAVAFX.txt
-r--r--r-- 1 root root 145180 Sep 14 2017 THIRDPARTYLICENSEREADME.txt
+ ls -al /home/jenkins/tools/java/latest1.8/bin
total 784
drwxr-xr-x 2 root root 4096 Apr 24 05:42 .
drwxr-xr-x 8 root root 4096 Apr 24 05:42 ..
-rwxr-xr-x 1 root root 7965 Sep 14 2017 appletviewer
lrwxrwxrwx 1 root root 8 Sep 14 2017 ControlPanel -> jcontrol
-rwxr-xr-x 1 root root 7941 Sep 14 2017 extcheck
-rwxr-xr-x 1 root root 7973 Sep 14 2017 idlj
-rwxr-xr-x 1 root root 7925 Sep 14 2017 jar
-rwxr-xr-x 1 root root 7957 Sep 14 2017 jarsigner
-rwxr-xr-x 1 root root 7734 Sep 14 2017 java
-rwxr-xr-x 1 root root 7941 Sep 14 2017 javac
-rwxr-xr-x 1 root root 7941 Sep 14 2017 javadoc
-rwxr-xr-x 1 root root 2293 Sep 14 2017 javafxpackager
-rwxr-xr-x 1 root root 7941 Sep 14 2017 javah
-rwxr-xr-x 1 root root 7941 Sep 14 2017 javap
-rwxr-xr-x 1 root root 2293 Sep 14 2017 javapackager
-rwxr-xr-x 1 root root 1809 Sep 14 2017 java-rmi.cgi
-rwxr-xr-x 1 root root 129139 Sep 14 2017 javaws
-rwxr-xr-x 1 root root 7925 Sep 14 2017 jcmd
-rwxr-xr-x 1 root root 8013 Sep 14 2017 jconsole
-rwxr-xr-x 1 root root 6264 Sep 14 2017 jcontrol
-rwxr-xr-x 1 root root 7981 Sep 14 2017 jdb
-rwxr-xr-x 1 root root 7941 Sep 14 2017 jdeps
-rwxr-xr-x 1 root root 7941 Sep 14 2017 jhat
-rwxr-xr-x 1 root root 8109 Sep 14 2017 jinfo
-rwxr-xr-x 1 root root 7941 Sep 14 2017 jjs
-rwxr-xr-x 1 root root 8109 Sep 14 2017 jmap
-rwxr-xr-x 1 root root 74675 Nov 25 2016 jmc
-rwxr-xr-x 1 root root 402 Nov 25 2016 jmc.ini
-rwxr-xr-x 1 root root 7925 Sep 14 2017 jps
-rwxr-xr-x 1 root root 7949 Sep 14 2017 jrunscript
-rwxr-xr-x 1 root root 7981 Sep 14 2017 jsadebugd
-rwxr-xr-x 1 root root 8109 Sep 14 2017 jstack
-rwxr-xr-x 1 root root 7941 Sep 14 2017 jstat
-rwxr-xr-x 1 root root 7941 Sep 14 2017 jstatd
-rwxr-xr-x 1 root root 5110 Jan 14 2017 jvisualvm
-rwxr-xr-x 1 root root 7941 Sep 14 2017 keytool
-rwxr-xr-x 1 root root 7949 Sep 14 2017 native2ascii
-rwxr-xr-x 1 root root 8149 Sep 14 2017 orbd
-rwxr-xr-x 1 root root 7957 Sep 14 2017 pack200
-rwxr-xr-x 1 root root 7997 Sep 14 2017 policytool
-rwxr-xr-x 1 root root 7925 Sep 14 2017 rmic
-rwxr-xr-x 1 root root 7941 Sep 14 2017 rmid
-rwxr-xr-x 1 root root 7949 Sep 14 2017 rmiregistry
-rwxr-xr-x 1 root root 7957 Sep 14 2017 schemagen
-rwxr-xr-x 1 root root 7941 Sep 14 2017 serialver
-rwxr-xr-x 1 root root 7965 Sep 14 2017 servertool
-rwxr-xr-x 1 root root 8181 Sep 14 2017 tnameserv
-rwxr-xr-x 1 root root 231482 Sep 14 2017 unpack200
-rwxr-xr-x 1 root root 7941 Sep 14 2017 wsgen
-rwxr-xr-x 1 root root 7957 Sep 14 2017 wsimport
-rwxr-xr-x 1 root root 7957 Sep 14 2017 xjc
+ /home/jenkins/tools/java/latest1.8/bin/java -version
java version "1.8.0_152"
Java(TM) SE Runtime Environment (build 1.8.0_152-b16)
Java HotSpot(TM) 64-Bit Server VM (build 25.152-b16, mixed mode)
+ echo which java
which java
+ which java
/home/jenkins/tools/java/latest1.8/bin/java
+ java -version
java version "1.8.0_152"
Java(TM) SE Runtime Environment (build 1.8.0_152-b16)
Java HotSpot(TM) 64-Bit Server VM (build 25.152-b16, mixed mode)
+ echo which javac
which javac
+ which javac
/home/jenkins/tools/java/latest1.8/bin/javac
+ javac -version
javac 1.8.0_152
+ echo '<project default="test"><target name="test"><echo>Java ${ant.java.version}/${java.version}</echo><exec executable="javac"><arg value="-version"/></exec></target></project>'
+ ant -f build.javacheck.xml -v
Apache Ant(TM) version 1.9.6 compiled on July 8 2015
Buildfile: <https://builds.apache.org/job/POI-DSL-API-Check/ws/build.javacheck.xml>
Detected Java version: 1.8 in: /usr/local/asfpackages/java/jdk1.8.0_152/jre
Detected OS: Linux
parsing buildfile <https://builds.apache.org/job/POI-DSL-API-Check/ws/build.javacheck.xml> with URI = <https://builds.apache.org/job/POI-DSL-API-Check/ws/build.javacheck.xml>
Project base dir set to: <https://builds.apache.org/job/POI-DSL-API-Check/ws/>
Build sequence for target(s) `test' is [test]
Complete build sequence is [test, ]
test:
parsing buildfile jar:file:/usr/share/ant/lib/ant.jar!/org/apache/tools/ant/antlib.xml with URI = jar:file:/usr/share/ant/lib/ant.jar!/org/apache/tools/ant/antlib.xml from a zip file
[echo] Java 1.8/1.8.0_152
[exec] Current OS is Linux
[exec] Executing 'javac' with arguments:
[exec] '-version'
[exec]
[exec] The ' characters around the executable and arguments are
[exec] not part of the command.
[exec] javac 1.8.0_152
BUILD SUCCESSFUL
Total time: 0 seconds
+ exit 0
[Gradle] - Launching build.
[POI-DSL-API-Check] $ gradle japicmp
:main:compileJavaNote: Some input files use or override a deprecated API.
Note: Recompile with -Xlint:deprecation for details.
Note: Some input files use unchecked or unsafe operations.
Note: Recompile with -Xlint:unchecked for details.
:main:processResources UP-TO-DATE
:main:classes
:main:jar UP-TO-DATE
:ooxml:ant-check-jars
:ooxml:ant-fetch-jars
:ooxml:ant-check-ooxml-jars
:ooxml:ant-fetch-ooxml-jars
:ooxml:ant-init
[ant:echo] Using Ant: Apache Ant(TM) version 1.9.6 compiled on June 29 2015 from ${ant.home}, Ant detected Java 1.8 (may be different than actual Java sometimes...)
[ant:echo] Using Java: 1.8.0_152/1.8.0_152-b16/25.152-b16/Java HotSpot(TM) 64-Bit Server VM from Oracle Corporation on Linux: 4.13.0-1012-gcp
:ooxml:ant-check-ooxml-xsds
:ooxml:ant-fetch-ooxml-xsds
:ooxml:ant-check-compiled-ooxml-xsds
:ooxml:ant-compile-ooxml-xsds
Time to build schema type system: 1.549 seconds
Time to generate code: 3.917 seconds
[ant:echo] Forking javac with max heap size 1536m
[ant:javac] Note: <https://builds.apache.org/job/POI-DSL-API-Check/ws/build/xmlbean-sources/org/apache/poi/ooxml/POIXMLTypeLoader.java> uses or overrides a deprecated API.
[ant:javac] Note: Recompile with -Xlint:deprecation for details.
Time to build schema type system: 0.82 seconds
Time to generate code: 0.336 seconds
[ant:echo] Forking javac with max heap size 1536m
[ant:javac] Note: <https://builds.apache.org/job/POI-DSL-API-Check/ws/build/xmlbean-sources/org/apache/poi/ooxml/POIXMLTypeLoader.java> uses or overrides a deprecated API.
[ant:javac] Note: Recompile with -Xlint:deprecation for details.
:scratchpad:compileJava UP-TO-DATE
:scratchpad:processResources UP-TO-DATE
:scratchpad:classes UP-TO-DATE
:scratchpad:jar UP-TO-DATE
:ooxml:compileJavaNote: Some input files use or override a deprecated API.
Note: Recompile with -Xlint:deprecation for details.
Note: <https://builds.apache.org/job/POI-DSL-API-Check/ws/src/ooxml/java/org/apache/poi/ooxml/extractor/ExtractorFactory.java> uses unchecked or unsafe operations.
Note: Recompile with -Xlint:unchecked for details.
:ooxml:processResources UP-TO-DATE
:ooxml:classes
:ooxml:jar
:excelant:compileJava
:excelant:processResources UP-TO-DATE
:excelant:classes
:excelant:jar UP-TO-DATE
:excelant:japicmp UP-TO-DATE
:main:japicmp UP-TO-DATE
:ooxml:japicmp FAILED
FAILURE: Build failed with an exception.
* What went wrong:
Execution failed for task ':ooxml:japicmp'.
> Could not load 'org.apache.poi.POITextExtractor': org.apache.poi.POITextExtractor. Please make sure that all libraries have been added to the classpath (CLASSPATH=:<https://builds.apache.org/job/POI-DSL-API-Check/ws/ooxml-lib/ooxml-schemas-1.4.jar>:<https://builds.apache.org/job/POI-DSL-API-Check/ws/ooxml-lib/ooxml-security-1.1.jar>:/home/jenkins/.gradle/caches/modules-2/files-2.1/org.apache.xmlbeans/xmlbeans/2.6.0/29e80d2dd51f9dcdef8f9ffaee0d4dc1c9bbfc87/xmlbeans-2.6.0.jar:<https://builds.apache.org/job/POI-DSL-API-Check/ws/build/scratchpad/build/libs/scratchpad-4.0.0-SNAPSHOT.jar>:<https://builds.apache.org/job/POI-DSL-API-Check/ws/build/main/build/libs/main-4.0.0-SNAPSHOT.jar>:/home/jenkins/.gradle/caches/modules-2/files-2.1/org.apache.commons/commons-collections4/4.1/a4cf4688fe1c7e3a63aa636cc96d013af537768e/commons-collections4-4.1.jar:/home/jenkins/.gradle/caches/modules-2/files-2.1/org.apache.commons/commons-math3/3.6.1/e4ba98f1d4b3c80ec46392f25e094a6a2e58fcbf/commons-math3-3.6.1.jar:/home/jenkins/.gradle/caches/modules-2/files-2.1/org.apache.commons/commons-compress/1.17/474c20609032e7f815ef534cd8174d2e400d9a8d/commons-compress-1.17.jar:/home/jenkins/.gradle/caches/modules-2/files-2.1/org.apache.santuario/xmlsec/2.1.0/99964d24525fa5ffbfe00bfc02085fc2e3a0f98d/xmlsec-2.1.0.jar:/home/jenkins/.gradle/caches/modules-2/files-2.1/org.bouncycastle/bcpkix-jdk15on/1.59/9cef0aab8a4bb849a8476c058ce3ff302aba3fff/bcpkix-jdk15on-1.59.jar:/home/jenkins/.gradle/caches/modules-2/files-2.1/com.github.virtuald/curvesapi/1.05/d4f227b550a0ab2b48360dd0ef64c9de93e45424/curvesapi-1.05.jar:/home/jenkins/.gradle/caches/modules-2/files-2.1/junit/junit/4.12/2973d150c0dc1fefe998f834810d68f278ea58ec/junit-4.12.jar:/home/jenkins/.gradle/caches/modules-2/files-2.1/stax/stax-api/1.0.1/49c100caf72d658aca8e58bd74a4ba90fa2b0d70/stax-api-1.0.1.jar:/home/jenkins/.gradle/caches/modules-2/files-2.1/org.slf4j/slf4j-api/1.7.22/a1c83373863cec7ae8d89dc1c5722d8cb6ec0309/slf4j-api-1.7.22.jar:/home/jenkins/.gradle/caches/modules-2/files-2.1/org.codehaus.woodstox/woodstox-core-asl/4.4.1/84fee5eb1a4a1cefe65b6883c73b3fa83be3c1a1/woodstox-core-asl-4.4.1.jar:/home/jenkins/.gradle/caches/modules-2/files-2.1/commons-codec/commons-codec/1.11/3acb4705652e16236558f0f4f2192cc33c3bd189/commons-codec-1.11.jar:/home/jenkins/.gradle/caches/modules-2/files-2.1/org.bouncycastle/bcprov-jdk15on/1.59/2507204241ab450456bdb8e8c0a8f986e418bd99/bcprov-jdk15on-1.59.jar:/home/jenkins/.gradle/caches/modules-2/files-2.1/org.hamcrest/hamcrest-core/1.3/42a25dc3219429f0e5d060061f71acb49bf010a0/hamcrest-core-1.3.jar:/home/jenkins/.gradle/caches/modules-2/files-2.1/commons-logging/commons-logging/1.2/4bfc12adfe4842bf07b657f0369c4cb522955686/commons-logging-1.2.jar:/home/jenkins/.gradle/caches/modules-2/files-2.1/javax.xml.stream/stax-api/1.0-2/d6337b0de8b25e53e81b922352fbea9f9f57ba0b/stax-api-1.0-2.jar:/home/jenkins/.gradle/caches/modules-2/files-2.1/org.codehaus.woodstox/stax2-api/3.1.4/ac19014b1e6a7c08aad07fe114af792676b685b7/stax2-api-3.1.4.jar:) or try the option '--ignore-missing-classes'.
* Try:
Run with --stacktrace option to get the stack trace. Run with --info or --debug option to get more log output.
* Get more help at https://help.gradle.org
BUILD FAILED in 1m 19s
24 actionable tasks: 14 executed, 10 up-to-date
Build step 'Invoke Gradle script' changed build result to FAILURE
Build step 'Invoke Gradle script' marked build as failure
Archiving artifacts
[Fast Archiver] Compressed 532.95 KB of artifacts by 60.0% relative to #324
---------------------------------------------------------------------
To unsubscribe, e-mail: dev-unsubscribe@poi.apache.org
For additional commands, e-mail: dev-help@poi.apache.org
Build failed in Jenkins: POI-DSL-API-Check #328
Posted by Apache Jenkins Server <je...@builds.apache.org>.
See <https://builds.apache.org/job/POI-DSL-API-Check/328/display/redirect?page=changes>
Changes:
[fanningpj] fix some deprecation warnings
------------------------------------------
[...truncated 372.84 KB...]
AU src/documentation/resources/images/logoRussellBeattie5.png
AU src/documentation/resources/images/logoGustafsson1.png
AU src/documentation/resources/images/logoRaPiGmbH5.png
AU src/documentation/resources/images/logoGustafsson2.png
AU src/documentation/resources/images/logoRaPiGmbH6.png
AU src/documentation/resources/images/logoKarmokar5s.png
AU src/documentation/resources/images/POIFSPropertyTablePreWrite.gif
AU src/documentation/resources/images/logoRaPiGmbH7.png
AU src/documentation/resources/images/logoRaPiGmbH8.png
AU src/documentation/resources/images/logoRaPiGmbH9.png
AU src/documentation/resources/images/project-logo.png
AU src/documentation/resources/images/logoGlenStampoutlzis.png
AU src/documentation/resources/images/utilClasses.gif
AU src/documentation/resources/images/calculatePayment.jpg
AU src/documentation/resources/images/unknown.jpg
AU src/documentation/resources/images/logoKarmokar2s.png
AU src/documentation/resources/images/ss-features.png
AU src/documentation/resources/images/logoKarmokar6s.png
AU src/documentation/resources/images/old-project-logo.gif
A src/documentation/resources/images/pb-poi.svg
AU src/documentation/resources/images/logoLoicLefevre2.png
AU src/documentation/resources/images/logoKarmokar1.png
AU src/documentation/resources/images/POIFSAddDocument.gif
AU src/documentation/resources/images/logoKarmokar2.png
AU src/documentation/resources/images/logoKarmokar3.png
AU src/documentation/resources/images/logoKarmokar4.png
AU src/documentation/resources/images/logoKarmokar5.png
AU src/documentation/resources/images/logoKarmokar6.png
AU src/documentation/resources/images/ApacheConEu08.jpg
AU src/documentation/resources/images/logoLoicLefevre.png
AU src/documentation/resources/images/logoWendyWise2.png
AU src/documentation/resources/images/POIFSLifeCycle.gif
AU src/documentation/resources/images/POIFSWriteFilesystem.gif
AU src/documentation/resources/images/logoAdria1.png
AU src/documentation/resources/images/logoAdria2.png
AU src/documentation/resources/images/logoAdria3.png
AU src/documentation/resources/images/poi-logo.png
AU src/documentation/resources/images/BlockClassDiagram.gif
AU src/documentation/resources/images/PropertyTableClassDiagram.gif
AU src/documentation/resources/images/remove.jpg
AU src/documentation/resources/images/group-logo.png
A src/documentation/resources/stylesheets
AU src/documentation/resources/stylesheets/changes2rss.xsl
AU src/documentation/resources/stylesheets/changes2document.xsl
AU src/documentation/README.txt
At revision 1833146
Fetching 'https://svn.apache.org/repos/asf/poi/site/forrest.properties' at -1 into '<https://builds.apache.org/job/POI-DSL-API-Check/ws/forrest.properties'>
A forrest.properties
At revision 1833146
At revision 1833146
No changes for https://svn.apache.org/repos/asf/poi/site/src/documentation since the previous build
No changes for https://svn.apache.org/repos/asf/poi/site/forrest.properties since the previous build
[POI-DSL-API-Check] $ /bin/bash -xe /tmp/jenkins629343453891358365.sh
+ svn status
X forrest.properties
X src/documentation
Performing status on external item at 'src/documentation':
+ echo Java-Home: /home/jenkins/tools/java/latest1.8
Java-Home: /home/jenkins/tools/java/latest1.8
+ ls -al /home/jenkins/tools/java/latest1.8/
total 25996
drwxr-xr-x 8 root root 4096 Apr 27 12:24 .
drwxr-xr-x 38 root root 4096 May 9 13:53 ..
drwxr-xr-x 2 root root 4096 Apr 27 12:24 bin
-r--r--r-- 1 root root 3244 Mar 29 04:52 COPYRIGHT
drwxr-xr-x 4 root root 4096 Apr 27 12:24 db
drwxr-xr-x 3 root root 4096 Apr 27 12:24 include
-rw-r--r-- 1 root root 5207083 Mar 28 17:37 javafx-src.zip
drwxr-xr-x 5 root root 4096 Apr 27 12:24 jre
drwxr-xr-x 5 root root 4096 Apr 27 12:24 lib
-r--r--r-- 1 root root 40 Mar 29 04:52 LICENSE
drwxr-xr-x 4 root root 4096 Apr 27 12:24 man
-r--r--r-- 1 root root 159 Mar 29 04:52 README.html
-rw-r--r-- 1 root root 424 Mar 29 04:52 release
-rw-r--r-- 1 root root 21100340 Mar 29 04:52 src.zip
-rw-r--r-- 1 root root 106782 Mar 28 17:37 THIRDPARTYLICENSEREADME-JAVAFX.txt
-r--r--r-- 1 root root 145180 Mar 29 04:52 THIRDPARTYLICENSEREADME.txt
+ ls -al /home/jenkins/tools/java/latest1.8/bin
total 796
drwxr-xr-x 2 root root 4096 Apr 27 12:24 .
drwxr-xr-x 8 root root 4096 Apr 27 12:24 ..
-rwxr-xr-x 1 root root 7965 Mar 29 04:52 appletviewer
lrwxrwxrwx 1 root root 8 Mar 29 04:52 ControlPanel -> jcontrol
-rwxr-xr-x 1 root root 7941 Mar 29 04:52 extcheck
-rwxr-xr-x 1 root root 7973 Mar 29 04:52 idlj
-rwxr-xr-x 1 root root 7925 Mar 29 04:52 jar
-rwxr-xr-x 1 root root 7957 Mar 29 04:52 jarsigner
-rwxr-xr-x 1 root root 7734 Mar 29 04:52 java
-rwxr-xr-x 1 root root 7941 Mar 29 04:52 javac
-rwxr-xr-x 1 root root 7941 Mar 29 04:52 javadoc
-rwxr-xr-x 1 root root 2293 Mar 28 17:37 javafxpackager
-rwxr-xr-x 1 root root 7941 Mar 29 04:52 javah
-rwxr-xr-x 1 root root 7941 Mar 29 04:52 javap
-rwxr-xr-x 1 root root 2293 Mar 28 17:37 javapackager
-rwxr-xr-x 1 root root 1809 Mar 29 04:52 java-rmi.cgi
-rwxr-xr-x 1 root root 139908 Mar 29 04:52 javaws
-rwxr-xr-x 1 root root 7925 Mar 29 04:52 jcmd
-rwxr-xr-x 1 root root 8013 Mar 29 04:52 jconsole
-rwxr-xr-x 1 root root 6264 Mar 29 04:52 jcontrol
-rwxr-xr-x 1 root root 7981 Mar 29 04:52 jdb
-rwxr-xr-x 1 root root 7941 Mar 29 04:52 jdeps
-rwxr-xr-x 1 root root 7941 Mar 29 04:52 jhat
-rwxr-xr-x 1 root root 8109 Mar 29 04:52 jinfo
-rwxr-xr-x 1 root root 7941 Mar 29 04:52 jjs
-rwxr-xr-x 1 root root 8109 Mar 29 04:52 jmap
-rwxr-xr-x 1 root root 74675 Dec 13 19:22 jmc
-rwxr-xr-x 1 root root 402 Dec 13 19:42 jmc.ini
-rwxr-xr-x 1 root root 7925 Mar 29 04:52 jps
-rwxr-xr-x 1 root root 7949 Mar 29 04:52 jrunscript
-rwxr-xr-x 1 root root 7981 Mar 29 04:52 jsadebugd
-rwxr-xr-x 1 root root 8109 Mar 29 04:52 jstack
-rwxr-xr-x 1 root root 7941 Mar 29 04:52 jstat
-rwxr-xr-x 1 root root 7941 Mar 29 04:52 jstatd
-rwxr-xr-x 1 root root 5110 Jan 14 2017 jvisualvm
-rwxr-xr-x 1 root root 7941 Mar 29 04:52 keytool
-rwxr-xr-x 1 root root 7949 Mar 29 04:52 native2ascii
-rwxr-xr-x 1 root root 8149 Mar 29 04:52 orbd
-rwxr-xr-x 1 root root 7957 Mar 29 04:52 pack200
-rwxr-xr-x 1 root root 7997 Mar 29 04:52 policytool
-rwxr-xr-x 1 root root 7925 Mar 29 04:52 rmic
-rwxr-xr-x 1 root root 7941 Mar 29 04:52 rmid
-rwxr-xr-x 1 root root 7949 Mar 29 04:52 rmiregistry
-rwxr-xr-x 1 root root 7957 Mar 29 04:52 schemagen
-rwxr-xr-x 1 root root 7941 Mar 29 04:52 serialver
-rwxr-xr-x 1 root root 7965 Mar 29 04:52 servertool
-rwxr-xr-x 1 root root 8181 Mar 29 04:52 tnameserv
-rwxr-xr-x 1 root root 231450 Mar 29 04:52 unpack200
-rwxr-xr-x 1 root root 7941 Mar 29 04:52 wsgen
-rwxr-xr-x 1 root root 7957 Mar 29 04:52 wsimport
-rwxr-xr-x 1 root root 7957 Mar 29 04:52 xjc
+ /home/jenkins/tools/java/latest1.8/bin/java -version
java version "1.8.0_172"
Java(TM) SE Runtime Environment (build 1.8.0_172-b11)
Java HotSpot(TM) 64-Bit Server VM (build 25.172-b11, mixed mode)
+ echo which java
which java
+ which java
/home/jenkins/tools/java/latest1.8/bin/java
+ java -version
java version "1.8.0_172"
Java(TM) SE Runtime Environment (build 1.8.0_172-b11)
Java HotSpot(TM) 64-Bit Server VM (build 25.172-b11, mixed mode)
+ echo which javac
which javac
+ which javac
/home/jenkins/tools/java/latest1.8/bin/javac
+ javac -version
javac 1.8.0_172
+ echo '<project default="test"><target name="test"><echo>Java ${ant.java.version}/${java.version}</echo><exec executable="javac"><arg value="-version"/></exec></target></project>'
+ ant -f build.javacheck.xml -v
Apache Ant(TM) version 1.9.6 compiled on July 8 2015
Buildfile: <https://builds.apache.org/job/POI-DSL-API-Check/ws/build.javacheck.xml>
Detected Java version: 1.8 in: /usr/local/asfpackages/java/jdk1.8.0_172/jre
Detected OS: Linux
parsing buildfile <https://builds.apache.org/job/POI-DSL-API-Check/ws/build.javacheck.xml> with URI = <https://builds.apache.org/job/POI-DSL-API-Check/ws/build.javacheck.xml>
Project base dir set to: <https://builds.apache.org/job/POI-DSL-API-Check/ws/>
Build sequence for target(s) `test' is [test]
Complete build sequence is [test, ]
test:
parsing buildfile jar:file:/usr/share/ant/lib/ant.jar!/org/apache/tools/ant/antlib.xml with URI = jar:file:/usr/share/ant/lib/ant.jar!/org/apache/tools/ant/antlib.xml from a zip file
[echo] Java 1.8/1.8.0_172
[exec] Current OS is Linux
[exec] Executing 'javac' with arguments:
[exec] '-version'
[exec]
[exec] The ' characters around the executable and arguments are
[exec] not part of the command.
[exec] javac 1.8.0_172
BUILD SUCCESSFUL
Total time: 0 seconds
+ exit 0
[Gradle] - Launching build.
[POI-DSL-API-Check] $ gradle japicmp
:main:compileJavaNote: Some input files use or override a deprecated API.
Note: Recompile with -Xlint:deprecation for details.
Note: Some input files use unchecked or unsafe operations.
Note: Recompile with -Xlint:unchecked for details.
:main:processResources
:main:classes
:main:jar
:ooxml:ant-check-jars
:ooxml:ant-fetch-jars
:ooxml:ant-check-ooxml-jars
:ooxml:ant-fetch-ooxml-jars
:ooxml:ant-init
[ant:echo] Using Ant: Apache Ant(TM) version 1.9.6 compiled on June 29 2015 from ${ant.home}, Ant detected Java 1.8 (may be different than actual Java sometimes...)
[ant:echo] Using Java: 1.8.0_172/1.8.0_172-b11/25.172-b11/Java HotSpot(TM) 64-Bit Server VM from Oracle Corporation on Linux: 4.4.0-43-generic
:ooxml:ant-check-ooxml-xsds
:ooxml:ant-fetch-ooxml-xsds
:ooxml:ant-check-compiled-ooxml-xsds
:ooxml:ant-compile-ooxml-xsds
Time to build schema type system: 2.249 seconds
Time to generate code: 4.429 seconds
[ant:echo] Forking javac with max heap size 1536m
[ant:javac] Note: <https://builds.apache.org/job/POI-DSL-API-Check/ws/build/xmlbean-sources/org/apache/poi/ooxml/POIXMLTypeLoader.java> uses or overrides a deprecated API.
[ant:javac] Note: Recompile with -Xlint:deprecation for details.
Time to build schema type system: 0.767 seconds
Time to generate code: 0.36 seconds
[ant:echo] Forking javac with max heap size 1536m
[ant:javac] Note: <https://builds.apache.org/job/POI-DSL-API-Check/ws/build/xmlbean-sources/org/apache/poi/ooxml/POIXMLTypeLoader.java> uses or overrides a deprecated API.
[ant:javac] Note: Recompile with -Xlint:deprecation for details.
:scratchpad:compileJavaNote: Some input files use or override a deprecated API.
Note: Recompile with -Xlint:deprecation for details.
Note: <https://builds.apache.org/job/POI-DSL-API-Check/ws/src/scratchpad/src/org/apache/poi/extractor/ole2/OLE2ScratchpadExtractorFactory.java> uses unchecked or unsafe operations.
Note: Recompile with -Xlint:unchecked for details.
:scratchpad:processResources
:scratchpad:classes
:scratchpad:jar
:ooxml:compileJava
Download https://repo1.maven.org/maven2/org/apache/commons/commons-compress/1.17/commons-compress-1.17.pom
Download https://repo1.maven.org/maven2/org/apache/commons/commons-compress/1.17/commons-compress-1.17.jar
Note: Some input files use or override a deprecated API.
Note: Recompile with -Xlint:deprecation for details.
Note: <https://builds.apache.org/job/POI-DSL-API-Check/ws/src/ooxml/java/org/apache/poi/ooxml/extractor/ExtractorFactory.java> uses unchecked or unsafe operations.
Note: Recompile with -Xlint:unchecked for details.
:ooxml:processResources
:ooxml:classes
:ooxml:jar
:excelant:compileJava
:excelant:processResources
:excelant:classes
:excelant:jar
:excelant:japicmp
:main:japicmp
:ooxml:japicmp FAILED
FAILURE: Build failed with an exception.
* What went wrong:
Execution failed for task ':ooxml:japicmp'.
> Could not load 'org.apache.poi.POITextExtractor': org.apache.poi.POITextExtractor. Please make sure that all libraries have been added to the classpath (CLASSPATH=:<https://builds.apache.org/job/POI-DSL-API-Check/ws/ooxml-lib/ooxml-schemas-1.4.jar>:<https://builds.apache.org/job/POI-DSL-API-Check/ws/ooxml-lib/ooxml-security-1.1.jar>:/home/jenkins/.gradle/caches/modules-2/files-2.1/org.apache.xmlbeans/xmlbeans/2.6.0/29e80d2dd51f9dcdef8f9ffaee0d4dc1c9bbfc87/xmlbeans-2.6.0.jar:<https://builds.apache.org/job/POI-DSL-API-Check/ws/build/scratchpad/build/libs/scratchpad-4.0.0-SNAPSHOT.jar>:<https://builds.apache.org/job/POI-DSL-API-Check/ws/build/main/build/libs/main-4.0.0-SNAPSHOT.jar>:/home/jenkins/.gradle/caches/modules-2/files-2.1/org.apache.commons/commons-collections4/4.1/a4cf4688fe1c7e3a63aa636cc96d013af537768e/commons-collections4-4.1.jar:/home/jenkins/.gradle/caches/modules-2/files-2.1/org.apache.commons/commons-math3/3.6.1/e4ba98f1d4b3c80ec46392f25e094a6a2e58fcbf/commons-math3-3.6.1.jar:/home/jenkins/.gradle/caches/modules-2/files-2.1/org.apache.commons/commons-compress/1.17/474c20609032e7f815ef534cd8174d2e400d9a8d/commons-compress-1.17.jar:/home/jenkins/.gradle/caches/modules-2/files-2.1/org.apache.santuario/xmlsec/2.1.0/99964d24525fa5ffbfe00bfc02085fc2e3a0f98d/xmlsec-2.1.0.jar:/home/jenkins/.gradle/caches/modules-2/files-2.1/org.bouncycastle/bcpkix-jdk15on/1.59/9cef0aab8a4bb849a8476c058ce3ff302aba3fff/bcpkix-jdk15on-1.59.jar:/home/jenkins/.gradle/caches/modules-2/files-2.1/com.github.virtuald/curvesapi/1.05/d4f227b550a0ab2b48360dd0ef64c9de93e45424/curvesapi-1.05.jar:/home/jenkins/.gradle/caches/modules-2/files-2.1/junit/junit/4.12/2973d150c0dc1fefe998f834810d68f278ea58ec/junit-4.12.jar:/home/jenkins/.gradle/caches/modules-2/files-2.1/stax/stax-api/1.0.1/49c100caf72d658aca8e58bd74a4ba90fa2b0d70/stax-api-1.0.1.jar:/home/jenkins/.gradle/caches/modules-2/files-2.1/org.slf4j/slf4j-api/1.7.22/a1c83373863cec7ae8d89dc1c5722d8cb6ec0309/slf4j-api-1.7.22.jar:/home/jenkins/.gradle/caches/modules-2/files-2.1/org.codehaus.woodstox/woodstox-core-asl/4.4.1/84fee5eb1a4a1cefe65b6883c73b3fa83be3c1a1/woodstox-core-asl-4.4.1.jar:/home/jenkins/.gradle/caches/modules-2/files-2.1/commons-codec/commons-codec/1.11/3acb4705652e16236558f0f4f2192cc33c3bd189/commons-codec-1.11.jar:/home/jenkins/.gradle/caches/modules-2/files-2.1/org.bouncycastle/bcprov-jdk15on/1.59/2507204241ab450456bdb8e8c0a8f986e418bd99/bcprov-jdk15on-1.59.jar:/home/jenkins/.gradle/caches/modules-2/files-2.1/org.hamcrest/hamcrest-core/1.3/42a25dc3219429f0e5d060061f71acb49bf010a0/hamcrest-core-1.3.jar:/home/jenkins/.gradle/caches/modules-2/files-2.1/commons-logging/commons-logging/1.2/4bfc12adfe4842bf07b657f0369c4cb522955686/commons-logging-1.2.jar:/home/jenkins/.gradle/caches/modules-2/files-2.1/javax.xml.stream/stax-api/1.0-2/d6337b0de8b25e53e81b922352fbea9f9f57ba0b/stax-api-1.0-2.jar:/home/jenkins/.gradle/caches/modules-2/files-2.1/org.codehaus.woodstox/stax2-api/3.1.4/ac19014b1e6a7c08aad07fe114af792676b685b7/stax2-api-3.1.4.jar:) or try the option '--ignore-missing-classes'.
* Try:
Run with --stacktrace option to get the stack trace. Run with --info or --debug option to get more log output.
BUILD FAILED in 2m 18s
24 actionable tasks: 24 executed
Build step 'Invoke Gradle script' changed build result to FAILURE
Build step 'Invoke Gradle script' marked build as failure
Archiving artifacts
[Fast Archiver] Compressed 532.95 KB of artifacts by 60.0% relative to #324
---------------------------------------------------------------------
To unsubscribe, e-mail: dev-unsubscribe@poi.apache.org
For additional commands, e-mail: dev-help@poi.apache.org