You are viewing a plain text version of this content. The canonical link for it is here.
Posted to notifications@maven.apache.org by Apache Jenkins Server <je...@builds.apache.org> on 2019/06/13 06:07:52 UTC

Build failed in Jenkins: Maven TLP » maven-project-info-reports-plugin » MPIR-366 #52

See https://builds.apache.org/job/maven-box/job/maven-project-info-reports-plugin/job/MPIR-366/52/

No changes.

2 tests failed.
FAILED:  org.apache.maven.report.projectinfo.PluginManagementReportTest.linux-jdk11 / Build linux-jdk11 / testReport

Error Message:

Mockito cannot mock this class: interface org.apache.maven.project.ProjectBuilder.

Mockito can only mock non-private & non-final classes.
If you're not sure why you're getting this error, please report to the mailing list.


Java               : 11
JVM vendor name    : Oracle Corporation
JVM vendor version : 11.0.1+13-LTS
JVM name           : Java HotSpot(TM) 64-Bit Server VM
JVM version        : 11.0.1+13-LTS
JVM info           : mixed mode
OS name            : Linux
OS version         : 4.4.0-138-generic


Underlying exception : java.lang.UnsupportedOperationException: Cannot define class using reflection

Stack Trace:
org.mockito.exceptions.base.MockitoException: 

Mockito cannot mock this class: interface org.apache.maven.project.ProjectBuilder.

Mockito can only mock non-private & non-final classes.
If you're not sure why you're getting this error, please report to the mailing list.


Java               : 11
JVM vendor name    : Oracle Corporation
JVM vendor version : 11.0.1+13-LTS
JVM name           : Java HotSpot(TM) 64-Bit Server VM
JVM version        : 11.0.1+13-LTS
JVM info           : mixed mode
OS name            : Linux
OS version         : 4.4.0-138-generic


Underlying exception : java.lang.UnsupportedOperationException: Cannot define class using reflection
	at org.apache.maven.report.projectinfo.PluginManagementReportTest.createReportMojo(PluginManagementReportTest.java:64)
	at org.apache.maven.report.projectinfo.PluginManagementReportTest.testReport(PluginManagementReportTest.java:91)
Caused by: java.lang.UnsupportedOperationException: Cannot define class using reflection
	at org.apache.maven.report.projectinfo.PluginManagementReportTest.createReportMojo(PluginManagementReportTest.java:64)
	at org.apache.maven.report.projectinfo.PluginManagementReportTest.testReport(PluginManagementReportTest.java:91)
Caused by: java.lang.IllegalStateException: Could not find sun.misc.Unsafe
	at org.apache.maven.report.projectinfo.PluginManagementReportTest.createReportMojo(PluginManagementReportTest.java:64)
	at org.apache.maven.report.projectinfo.PluginManagementReportTest.testReport(PluginManagementReportTest.java:91)
Caused by: java.lang.NoSuchMethodException: sun.misc.Unsafe.defineClass(java.lang.String, [B, int, int, java.lang.ClassLoader, java.security.ProtectionDomain)
	at org.apache.maven.report.projectinfo.PluginManagementReportTest.createReportMojo(PluginManagementReportTest.java:64)
	at org.apache.maven.report.projectinfo.PluginManagementReportTest.testReport(PluginManagementReportTest.java:91)


FAILED:  org.apache.maven.report.projectinfo.PluginManagementReportTest.windows-jdk11 / Build windows-jdk11 / testReport

Error Message:

Mockito cannot mock this class: interface org.apache.maven.project.ProjectBuilder.

Mockito can only mock non-private & non-final classes.
If you're not sure why you're getting this error, please report to the mailing list.


Java               : 11
JVM vendor name    : Oracle Corporation
JVM vendor version : 11+28
JVM name           : Java HotSpot(TM) 64-Bit Server VM
JVM version        : 11+28
JVM info           : mixed mode
OS name            : Windows Server 2012 R2
OS version         : 6.3


Underlying exception : java.lang.UnsupportedOperationException: Cannot define class using reflection

Stack Trace:
org.mockito.exceptions.base.MockitoException: 

Mockito cannot mock this class: interface org.apache.maven.project.ProjectBuilder.

Mockito can only mock non-private & non-final classes.
If you're not sure why you're getting this error, please report to the mailing list.


Java               : 11
JVM vendor name    : Oracle Corporation
JVM vendor version : 11+28
JVM name           : Java HotSpot(TM) 64-Bit Server VM
JVM version        : 11+28
JVM info           : mixed mode
OS name            : Windows Server 2012 R2
OS version         : 6.3


Underlying exception : java.lang.UnsupportedOperationException: Cannot define class using reflection
	at org.apache.maven.report.projectinfo.PluginManagementReportTest.createReportMojo(PluginManagementReportTest.java:64)
	at org.apache.maven.report.projectinfo.PluginManagementReportTest.testReport(PluginManagementReportTest.java:91)
Caused by: java.lang.UnsupportedOperationException: Cannot define class using reflection
	at org.apache.maven.report.projectinfo.PluginManagementReportTest.createReportMojo(PluginManagementReportTest.java:64)
	at org.apache.maven.report.projectinfo.PluginManagementReportTest.testReport(PluginManagementReportTest.java:91)
Caused by: java.lang.IllegalStateException: Could not find sun.misc.Unsafe
	at org.apache.maven.report.projectinfo.PluginManagementReportTest.createReportMojo(PluginManagementReportTest.java:64)
	at org.apache.maven.report.projectinfo.PluginManagementReportTest.testReport(PluginManagementReportTest.java:91)
Caused by: java.lang.NoSuchMethodException: sun.misc.Unsafe.defineClass(java.lang.String, [B, int, int, java.lang.ClassLoader, java.security.ProtectionDomain)
	at org.apache.maven.report.projectinfo.PluginManagementReportTest.createReportMojo(PluginManagementReportTest.java:64)
	at org.apache.maven.report.projectinfo.PluginManagementReportTest.testReport(PluginManagementReportTest.java:91)




Build log:
[...truncated 16868 lines...]
[withMaven] Publishers: Pipeline Graph Publisher: 1 ms
[withMaven] Publishers: Pipeline Graph Publisher: 1 ms
[withMaven] Publishers: Pipeline Graph Publisher: 1 ms
[withMaven] Publishers: 
[withMaven] Publishers: Pipeline Graph Publisher: 1 ms
[withMaven] Publishers: 
[withMaven] Publishers: 
[withMaven] Publishers: 
[withMaven] Publishers: Pipeline Graph Publisher: 1 ms
[withMaven] Publishers: Pipeline Graph Publisher: 1 ms
[withMaven] junitPublisher - Archive test results for Maven artifact org.apache.maven.plugins.project-info-reports.its:dep:jar:1.0-SNAPSHOT generated by maven-surefire-plugin:test (default-test): m\target\it\multi-module\dep\target\surefire-reports\*.xml
[withMaven] junitPublisher - Archive test results for Maven artifact org.apache.maven.plugins.project-info-reports.its:main:jar:1.0-SNAPSHOT generated by maven-surefire-plugin:test (default-test): m\target\it\multi-module\main\target\surefire-reports\*.xml
Recording test results
None of the test reports contained any result
[withMaven] Publishers: Pipeline Graph Publisher: 2 ms, Junit Publisher: 41 ms, Dependencies Fingerprint Publisher: 33 ms
[withMaven] Publishers: Pipeline Graph Publisher: 1 ms, Dependencies Fingerprint Publisher: 35 ms
[Pipeline] // withMaven
[Pipeline] cleanWs
[WS-CLEANUP] Deleting project workspace...
[WS-CLEANUP] Deferred wipeout is used...
[WS-CLEANUP] done
[Pipeline] }
[Pipeline] // stage
[Pipeline] }
[Pipeline] // node
[Pipeline] }
[INFO] run script verify.groovy
[INFO] ..SUCCESS (21.0 s)
[INFO] Building: MPIR-300\pom.xml
[INFO] run script verify.groovy
[INFO] ..SUCCESS (21.9 s)
[INFO] Building: MPIR-300\pom.xml
[INFO] run script verify.groovy
[INFO] ..SUCCESS (8.4 s)
[INFO] Building: MPIR-349\parent\pom.xml
[INFO] run script verify.groovy
[INFO] ..SUCCESS (8.9 s)
[INFO] Building: MPIR-349\parent\pom.xml
[INFO] run script verify.groovy
[INFO] ..SUCCESS (15.5 s)
[INFO] Building: multi-module\pom.xml
[INFO] run script verify.groovy
[INFO] ..SUCCESS (16.6 s)
[INFO] Building: multi-module\pom.xml
[INFO] run script verify.groovy
[INFO] ..SUCCESS (35.4 s)
[INFO] 
[INFO] --- maven-checkstyle-plugin:2.15:check (checkstyle-check) @ maven-project-info-reports-plugin ---
[INFO] Downloading from central: https://repo.maven.apache.org/maven2/org/apache/maven/shared/maven-shared-resources/2/maven-shared-resources-2.pom
[INFO] Downloaded from central: https://repo.maven.apache.org/maven2/org/apache/maven/shared/maven-shared-resources/2/maven-shared-resources-2.pom (3.0 kB at 82 kB/s)
[INFO] Downloading from central: https://repo.maven.apache.org/maven2/org/codehaus/plexus/plexus-utils/3.0.10/plexus-utils-3.0.10.pom
[INFO] Downloaded from central: https://repo.maven.apache.org/maven2/org/codehaus/plexus/plexus-utils/3.0.10/plexus-utils-3.0.10.pom (3.1 kB at 131 kB/s)
[INFO] Downloading from central: https://repo.maven.apache.org/maven2/org/codehaus/plexus/plexus-resources/1.0.1/plexus-resources-1.0.1.pom
[INFO] Downloaded from central: https://repo.maven.apache.org/maven2/org/codehaus/plexus/plexus-resources/1.0.1/plexus-resources-1.0.1.pom (1.3 kB at 35 kB/s)
[INFO] Downloading from central: https://repo.maven.apache.org/maven2/com/puppycrawl/tools/checkstyle/6.1.1/checkstyle-6.1.1.pom
[INFO] Downloaded from central: https://repo.maven.apache.org/maven2/com/puppycrawl/tools/checkstyle/6.1.1/checkstyle-6.1.1.pom (30 kB at 634 kB/s)
[INFO] Downloading from central: https://repo.maven.apache.org/maven2/org/sonatype/oss/oss-parent/7/oss-parent-7.pom
[INFO] Downloaded from central: https://repo.maven.apache.org/maven2/org/sonatype/oss/oss-parent/7/oss-parent-7.pom (4.8 kB at 210 kB/s)
[INFO] Downloading from central: https://repo.maven.apache.org/maven2/org/antlr/antlr4-runtime/4.3/antlr4-runtime-4.3.pom
[INFO] Downloaded from central: https://repo.maven.apache.org/maven2/org/antlr/antlr4-runtime/4.3/antlr4-runtime-4.3.pom (4.8 kB at 24 kB/s)
[INFO] Downloading from central: https://repo.maven.apache.org/maven2/org/antlr/antlr4-master/4.3/antlr4-master-4.3.pom
[INFO] Downloaded from central: https://repo.maven.apache.org/maven2/org/antlr/antlr4-master/4.3/antlr4-master-4.3.pom (7.9 kB at 9.3 kB/s)
[INFO] Downloading from central: https://repo.maven.apache.org/maven2/org/abego/treelayout/org.abego.treelayout.core/1.0.1/org.abego.treelayout.core-1.0.1.pom
[INFO] Downloaded from central: https://repo.maven.apache.org/maven2/org/abego/treelayout/org.abego.treelayout.core/1.0.1/org.abego.treelayout.core-1.0.1.pom (3.1 kB at 119 kB/s)
[INFO] Downloading from central: https://repo.maven.apache.org/maven2/org/antlr/antlr4-annotations/4.3/antlr4-annotations-4.3.pom
[INFO] Downloaded from central: https://repo.maven.apache.org/maven2/org/antlr/antlr4-annotations/4.3/antlr4-annotations-4.3.pom (1.3 kB at 80 kB/s)
[INFO] Downloading from central: https://repo.maven.apache.org/maven2/commons-beanutils/commons-beanutils-core/1.8.3/commons-beanutils-core-1.8.3.pom
[INFO] Downloaded from central: https://repo.maven.apache.org/maven2/commons-beanutils/commons-beanutils-core/1.8.3/commons-beanutils-core-1.8.3.pom (1.6 kB at 14 kB/s)
[INFO] Downloading from central: https://repo.maven.apache.org/maven2/com/google/guava/guava/18.0/guava-18.0.pom
[INFO] Downloaded from central: https://repo.maven.apache.org/maven2/com/google/guava/guava/18.0/guava-18.0.pom (5.7 kB at 315 kB/s)
[INFO] Downloading from central: https://repo.maven.apache.org/maven2/com/google/guava/guava-parent/18.0/guava-parent-18.0.pom
[INFO] Downloaded from central: https://repo.maven.apache.org/maven2/com/google/guava/guava-parent/18.0/guava-parent-18.0.pom (7.7 kB at 427 kB/s)
[INFO] Downloading from central: https://repo.maven.apache.org/maven2/org/apache/maven/shared/maven-shared-resources/2/maven-shared-resources-2.jar
[INFO] Downloading from central: https://repo.maven.apache.org/maven2/org/antlr/antlr4-runtime/4.3/antlr4-runtime-4.3.jar
[INFO] Downloading from central: https://repo.maven.apache.org/maven2/org/abego/treelayout/org.abego.treelayout.core/1.0.1/org.abego.treelayout.core-1.0.1.jar
[INFO] Downloading from central: https://repo.maven.apache.org/maven2/com/puppycrawl/tools/checkstyle/6.1.1/checkstyle-6.1.1.jar
[INFO] Downloading from central: https://repo.maven.apache.org/maven2/org/codehaus/plexus/plexus-resources/1.0.1/plexus-resources-1.0.1.jar
[INFO] Downloaded from central: https://repo.maven.apache.org/maven2/com/puppycrawl/tools/checkstyle/6.1.1/checkstyle-6.1.1.jar (1.0 MB at 8.5 MB/s)
[INFO] Downloading from central: https://repo.maven.apache.org/maven2/org/antlr/antlr4-annotations/4.3/antlr4-annotations-4.3.jar
[INFO] Downloaded from central: https://repo.maven.apache.org/maven2/org/apache/maven/shared/maven-shared-resources/2/maven-shared-resources-2.jar (13 kB at 81 kB/s)
[INFO] Downloading from central: https://repo.maven.apache.org/maven2/commons-beanutils/commons-beanutils-core/1.8.3/commons-beanutils-core-1.8.3.jar
[INFO] Downloaded from central: https://repo.maven.apache.org/maven2/org/abego/treelayout/org.abego.treelayout.core/1.0.1/org.abego.treelayout.core-1.0.1.jar (26 kB at 145 kB/s)
[INFO] Downloading from central: https://repo.maven.apache.org/maven2/com/google/guava/guava/18.0/guava-18.0.jar
[INFO] Downloaded from central: https://repo.maven.apache.org/maven2/org/codehaus/plexus/plexus-resources/1.0.1/plexus-resources-1.0.1.jar (22 kB at 103 kB/s)
[INFO] Downloaded from central: https://repo.maven.apache.org/maven2/org/antlr/antlr4-annotations/4.3/antlr4-annotations-4.3.jar (10 kB at 38 kB/s)
[INFO] Downloaded from central: https://repo.maven.apache.org/maven2/com/google/guava/guava/18.0/guava-18.0.jar (2.3 MB at 5.0 MB/s)
[INFO] Downloaded from central: https://repo.maven.apache.org/maven2/org/antlr/antlr4-runtime/4.3/antlr4-runtime-4.3.jar (345 kB at 579 kB/s)
[INFO] Downloaded from central: https://repo.maven.apache.org/maven2/commons-beanutils/commons-beanutils-core/1.8.3/commons-beanutils-core-1.8.3.jar (207 kB at 346 kB/s)
[INFO] There are 10 errors reported by Checkstyle 6.1.1 with config/maven_checks.xml ruleset.
[INFO] Ignored 10 errors, 0 violation remaining.
[INFO] 
[INFO] --- maven-jarsigner-plugin:1.3.2:verify (verify) @ maven-project-info-reports-plugin ---
[WARNING] Picked up JAVA_TOOL_OPTIONS: -Dmaven.ext.class.path="f:\jenkins\jenkins-slave\workspace\ect-info-reports-plugin_MPIR-366@2@tmp\withMavenc741f3fa\pipeline-maven-spy.jar" -Dorg.jenkinsci.plugins.pipeline.maven.reportsFolder="f:\jenkins\jenkins-slave\workspace\ect-info-reports-plugin_MPIR-366@2@tmp\withMavenc741f3fa" 
[INFO] 1 archive(s) processed
[INFO] 
[INFO] --- maven-invoker-plugin:2.0.0:verify (integration-test) @ maven-project-info-reports-plugin ---
[INFO] -------------------------------------------------
[INFO] Build Summary:
[INFO]   Passed: 11, Failed: 0, Errors: 0, Skipped: 0
[INFO] -------------------------------------------------
[INFO] ------------------------------------------------------------------------
[INFO] BUILD SUCCESS
[INFO] ------------------------------------------------------------------------
[INFO] Total time:  06:21 min
[INFO] Finished at: 2019-06-12T23:07:37-07:00
[INFO] ------------------------------------------------------------------------
[INFO] [jenkins-event-spy] Generated F:\jenkins\jenkins-slave\workspace\ect-info-reports-plugin_MPIR-366@2@tmp\withMavenc741f3fa\maven-spy-20190612-230115-4025949437262262352012.log
Picked up JAVA_TOOL_OPTIONS: -Dmaven.ext.class.path="f:\jenkins\jenkins-slave\workspace\ect-info-reports-plugin_MPIR-366@2@tmp\withMavenc741f3fa\pipeline-maven-spy.jar" -Dorg.jenkinsci.plugins.pipeline.maven.reportsFolder="f:\jenkins\jenkins-slave\workspace\ect-info-reports-plugin_MPIR-366@2@tmp\withMavenc741f3fa" 
[Pipeline] }
[Pipeline] // dir
[Pipeline] }
[withMaven] invokerPublisher - Archive invoker results for Maven artifact MavenArtifact{org.apache.maven.plugins:maven-project-info-reports-plugin:maven-plugin:2.10-SNAPSHOT(version: 2.10-SNAPSHOT, snapshot:false) } generated by PluginInvocation{org.apache.maven.plugins:maven-invoker-plugin:2.0.0@integration-test  integration-test}: m\target\invoker-reports\*.xml
[INFO] run script verify.groovy
[INFO] ..SUCCESS (38.3 s)
[INFO] 
[INFO] --- maven-checkstyle-plugin:2.15:check (checkstyle-check) @ maven-project-info-reports-plugin ---
[INFO] Downloading from central: https://repo.maven.apache.org/maven2/org/apache/maven/shared/maven-shared-resources/2/maven-shared-resources-2.pom
[INFO] Downloaded from central: https://repo.maven.apache.org/maven2/org/apache/maven/shared/maven-shared-resources/2/maven-shared-resources-2.pom (3.0 kB at 185 kB/s)
[INFO] Downloading from central: https://repo.maven.apache.org/maven2/org/codehaus/plexus/plexus-utils/3.0.10/plexus-utils-3.0.10.pom
[INFO] Downloaded from central: https://repo.maven.apache.org/maven2/org/codehaus/plexus/plexus-utils/3.0.10/plexus-utils-3.0.10.pom (3.1 kB at 242 kB/s)
[INFO] Downloading from central: https://repo.maven.apache.org/maven2/org/codehaus/plexus/plexus-resources/1.0.1/plexus-resources-1.0.1.pom
[INFO] Downloaded from central: https://repo.maven.apache.org/maven2/org/codehaus/plexus/plexus-resources/1.0.1/plexus-resources-1.0.1.pom (1.3 kB at 82 kB/s)
[INFO] Downloading from central: https://repo.maven.apache.org/maven2/com/puppycrawl/tools/checkstyle/6.1.1/checkstyle-6.1.1.pom
[INFO] Downloaded from central: https://repo.maven.apache.org/maven2/com/puppycrawl/tools/checkstyle/6.1.1/checkstyle-6.1.1.pom (30 kB at 1.2 MB/s)
[INFO] Downloading from central: https://repo.maven.apache.org/maven2/org/sonatype/oss/oss-parent/7/oss-parent-7.pom
[INFO] Downloaded from central: https://repo.maven.apache.org/maven2/org/sonatype/oss/oss-parent/7/oss-parent-7.pom (4.8 kB at 284 kB/s)
[INFO] Downloading from central: https://repo.maven.apache.org/maven2/org/antlr/antlr4-runtime/4.3/antlr4-runtime-4.3.pom
[INFO] Downloaded from central: https://repo.maven.apache.org/maven2/org/antlr/antlr4-runtime/4.3/antlr4-runtime-4.3.pom (4.8 kB at 342 kB/s)
[INFO] Downloading from central: https://repo.maven.apache.org/maven2/org/antlr/antlr4-master/4.3/antlr4-master-4.3.pom
[INFO] Downloaded from central: https://repo.maven.apache.org/maven2/org/antlr/antlr4-master/4.3/antlr4-master-4.3.pom (7.9 kB at 466 kB/s)
[INFO] Downloading from central: https://repo.maven.apache.org/maven2/org/abego/treelayout/org.abego.treelayout.core/1.0.1/org.abego.treelayout.core-1.0.1.pom
[INFO] Downloaded from central: https://repo.maven.apache.org/maven2/org/abego/treelayout/org.abego.treelayout.core/1.0.1/org.abego.treelayout.core-1.0.1.pom (3.1 kB at 172 kB/s)
[INFO] Downloading from central: https://repo.maven.apache.org/maven2/org/antlr/antlr4-annotations/4.3/antlr4-annotations-4.3.pom
[INFO] Downloaded from central: https://repo.maven.apache.org/maven2/org/antlr/antlr4-annotations/4.3/antlr4-annotations-4.3.pom (1.3 kB at 71 kB/s)
[INFO] Downloading from central: https://repo.maven.apache.org/maven2/commons-beanutils/commons-beanutils-core/1.8.3/commons-beanutils-core-1.8.3.pom
[INFO] Downloaded from central: https://repo.maven.apache.org/maven2/commons-beanutils/commons-beanutils-core/1.8.3/commons-beanutils-core-1.8.3.pom (1.6 kB at 102 kB/s)
[INFO] Downloading from central: https://repo.maven.apache.org/maven2/com/google/guava/guava/18.0/guava-18.0.pom
[INFO] Downloaded from central: https://repo.maven.apache.org/maven2/com/google/guava/guava/18.0/guava-18.0.pom (5.7 kB at 333 kB/s)
[INFO] Downloading from central: https://repo.maven.apache.org/maven2/com/google/guava/guava-parent/18.0/guava-parent-18.0.pom
[INFO] Downloaded from central: https://repo.maven.apache.org/maven2/com/google/guava/guava-parent/18.0/guava-parent-18.0.pom (7.7 kB at 591 kB/s)
[INFO] Downloading from central: https://repo.maven.apache.org/maven2/org/apache/maven/shared/maven-shared-resources/2/maven-shared-resources-2.jar
[INFO] Downloading from central: https://repo.maven.apache.org/maven2/org/antlr/antlr4-runtime/4.3/antlr4-runtime-4.3.jar
[INFO] Downloading from central: https://repo.maven.apache.org/maven2/org/abego/treelayout/org.abego.treelayout.core/1.0.1/org.abego.treelayout.core-1.0.1.jar
[INFO] Downloading from central: https://repo.maven.apache.org/maven2/com/puppycrawl/tools/checkstyle/6.1.1/checkstyle-6.1.1.jar
[INFO] Downloading from central: https://repo.maven.apache.org/maven2/org/codehaus/plexus/plexus-resources/1.0.1/plexus-resources-1.0.1.jar
[INFO] Downloaded from central: https://repo.maven.apache.org/maven2/org/apache/maven/shared/maven-shared-resources/2/maven-shared-resources-2.jar (13 kB at 163 kB/s)
[INFO] Downloading from central: https://repo.maven.apache.org/maven2/org/antlr/antlr4-annotations/4.3/antlr4-annotations-4.3.jar
[INFO] Downloaded from central: https://repo.maven.apache.org/maven2/com/puppycrawl/tools/checkstyle/6.1.1/checkstyle-6.1.1.jar (1.0 MB at 12 MB/s)
[INFO] Downloading from central: https://repo.maven.apache.org/maven2/commons-beanutils/commons-beanutils-core/1.8.3/commons-beanutils-core-1.8.3.jar
[INFO] Downloaded from central: https://repo.maven.apache.org/maven2/org/antlr/antlr4-annotations/4.3/antlr4-annotations-4.3.jar (10 kB at 77 kB/s)
[INFO] Downloading from central: https://repo.maven.apache.org/maven2/com/google/guava/guava/18.0/guava-18.0.jar
[INFO] Downloaded from central: https://repo.maven.apache.org/maven2/com/google/guava/guava/18.0/guava-18.0.jar (2.3 MB at 9.0 MB/s)
[INFO] Downloaded from central: https://repo.maven.apache.org/maven2/org/abego/treelayout/org.abego.treelayout.core/1.0.1/org.abego.treelayout.core-1.0.1.jar (26 kB at 97 kB/s)
[INFO] Downloaded from central: https://repo.maven.apache.org/maven2/org/codehaus/plexus/plexus-resources/1.0.1/plexus-resources-1.0.1.jar (22 kB at 81 kB/s)
[INFO] Downloaded from central: https://repo.maven.apache.org/maven2/commons-beanutils/commons-beanutils-core/1.8.3/commons-beanutils-core-1.8.3.jar (207 kB at 372 kB/s)
[INFO] Downloaded from central: https://repo.maven.apache.org/maven2/org/antlr/antlr4-runtime/4.3/antlr4-runtime-4.3.jar (345 kB at 544 kB/s)
[INFO] There are 10 errors reported by Checkstyle 6.1.1 with config/maven_checks.xml ruleset.
[INFO] Ignored 10 errors, 0 violation remaining.
[INFO] 
[INFO] --- maven-jarsigner-plugin:1.3.2:verify (verify) @ maven-project-info-reports-plugin ---
[withMaven] junitPublisher - Archive test results for Maven artifact org.apache.maven.plugins:maven-project-info-reports-plugin:maven-plugin:2.10-SNAPSHOT generated by maven-surefire-plugin:test (default-test): m\target\surefire-reports\*.xml
Recording test results
[WARNING] Picked up JAVA_TOOL_OPTIONS: -Dmaven.ext.class.path="f:\jenkins\jenkins-slave\workspace\ect-info-reports-plugin_MPIR-366@tmp\withMaven99aa2046\pipeline-maven-spy.jar" -Dorg.jenkinsci.plugins.pipeline.maven.reportsFolder="f:\jenkins\jenkins-slave\workspace\ect-info-reports-plugin_MPIR-366@tmp\withMaven99aa2046" 
[INFO] 1 archive(s) processed
[INFO] 
[INFO] --- maven-invoker-plugin:2.0.0:verify (integration-test) @ maven-project-info-reports-plugin ---
[INFO] -------------------------------------------------
[INFO] Build Summary:
[INFO]   Passed: 11, Failed: 0, Errors: 0, Skipped: 0
[INFO] -------------------------------------------------
[INFO] ------------------------------------------------------------------------
[INFO] BUILD SUCCESS
[INFO] ------------------------------------------------------------------------
[INFO] Total time:  06:27 min
[INFO] Finished at: 2019-06-12T23:07:43-07:00
[INFO] ------------------------------------------------------------------------
[INFO] [jenkins-event-spy] Generated F:\jenkins\jenkins-slave\workspace\ect-info-reports-plugin_MPIR-366@tmp\withMaven99aa2046\maven-spy-20190612-230115-3371190908024846843488.log
Picked up JAVA_TOOL_OPTIONS: -Dmaven.ext.class.path="f:\jenkins\jenkins-slave\workspace\ect-info-reports-plugin_MPIR-366@tmp\withMaven99aa2046\pipeline-maven-spy.jar" -Dorg.jenkinsci.plugins.pipeline.maven.reportsFolder="f:\jenkins\jenkins-slave\workspace\ect-info-reports-plugin_MPIR-366@tmp\withMaven99aa2046" 
[Pipeline] }
[Pipeline] // dir
[Pipeline] }
[withMaven] Publishers: Pipeline Graph Publisher: 2 ms, Invoker Publisher: 5166 ms, Junit Publisher: 828 ms
[withMaven] invokerPublisher - Archive invoker results for Maven artifact MavenArtifact{org.apache.maven.plugins:maven-project-info-reports-plugin:maven-plugin:2.10-SNAPSHOT(version: 2.10-SNAPSHOT, snapshot:false) } generated by PluginInvocation{org.apache.maven.plugins:maven-invoker-plugin:2.0.0@integration-test  integration-test}: m\target\invoker-reports\*.xml
[withMaven] Publishers: 
[withMaven] Publishers: 
[withMaven] Publishers: Pipeline Graph Publisher: 1 ms
[withMaven] Publishers: Pipeline Graph Publisher: 2 ms
[withMaven] Publishers: 
[withMaven] Publishers: 
[withMaven] Publishers: 
[withMaven] Publishers: 
[withMaven] Publishers: 
[withMaven] Publishers: Pipeline Graph Publisher: 1 ms
[withMaven] Publishers: Pipeline Graph Publisher: 1 ms
[withMaven] junitPublisher - Archive test results for Maven artifact org.apache.maven.plugins.project-info-reports.its:dep:jar:1.0-SNAPSHOT generated by maven-surefire-plugin:test (default-test): m\target\it\multi-module\dep\target\surefire-reports\*.xml
[withMaven] junitPublisher - Archive test results for Maven artifact org.apache.maven.plugins.project-info-reports.its:main:jar:1.0-SNAPSHOT generated by maven-surefire-plugin:test (default-test): m\target\it\multi-module\main\target\surefire-reports\*.xml
Recording test results
None of the test reports contained any result
[withMaven] Publishers: Pipeline Graph Publisher: 1 ms, Junit Publisher: 41 ms, Dependencies Fingerprint Publisher: 31 ms
[withMaven] Publishers: Pipeline Graph Publisher: 1 ms, Dependencies Fingerprint Publisher: 29 ms
[Pipeline] // withMaven
[Pipeline] cleanWs
[WS-CLEANUP] Deleting project workspace...
[WS-CLEANUP] Deferred wipeout is used...
[WS-CLEANUP] done
[Pipeline] }
[Pipeline] // stage
[Pipeline] }
[Pipeline] // node
[Pipeline] }
[withMaven] junitPublisher - Archive test results for Maven artifact org.apache.maven.plugins:maven-project-info-reports-plugin:maven-plugin:2.10-SNAPSHOT generated by maven-surefire-plugin:test (default-test): m\target\surefire-reports\*.xml
Recording test results
[withMaven] Publishers: Pipeline Graph Publisher: 2 ms, Invoker Publisher: 5202 ms, Junit Publisher: 685 ms
[withMaven] Publishers: 
[withMaven] Publishers: 
[withMaven] Publishers: Pipeline Graph Publisher: 1 ms
[withMaven] Publishers: Pipeline Graph Publisher: 26 ms
[withMaven] Publishers: 
[withMaven] Publishers: 
[withMaven] Publishers: 
[withMaven] Publishers: 
[withMaven] Publishers: 
[withMaven] Publishers: Pipeline Graph Publisher: 1 ms
[withMaven] Publishers: Pipeline Graph Publisher: 1 ms
[withMaven] junitPublisher - Archive test results for Maven artifact org.apache.maven.plugins.project-info-reports.its:dep:jar:1.0-SNAPSHOT generated by maven-surefire-plugin:test (default-test): m\target\it\multi-module\dep\target\surefire-reports\*.xml
[withMaven] junitPublisher - Archive test results for Maven artifact org.apache.maven.plugins.project-info-reports.its:main:jar:1.0-SNAPSHOT generated by maven-surefire-plugin:test (default-test): m\target\it\multi-module\main\target\surefire-reports\*.xml
Recording test results
None of the test reports contained any result
[withMaven] Publishers: Pipeline Graph Publisher: 2 ms, Junit Publisher: 34 ms, Dependencies Fingerprint Publisher: 33 ms
[withMaven] Publishers: Pipeline Graph Publisher: 1 ms, Dependencies Fingerprint Publisher: 31 ms
[Pipeline] // withMaven
[Pipeline] cleanWs
[WS-CLEANUP] Deleting project workspace...
[WS-CLEANUP] Deferred wipeout is used...
[WS-CLEANUP] done
[Pipeline] }
[Pipeline] // stage
[Pipeline] }
[Pipeline] // node
[Pipeline] }
[Pipeline] // parallel
[Pipeline] echo
[FAILURE-003] AbortException hudson.AbortException: script returned exit code 1
[Pipeline] stage
[Pipeline] { (Notifications)
[Pipeline] echo
Build result: FAILURE
[Pipeline] jiraIssueSelector
[Pipeline] emailext

Build failed in Jenkins: Maven TLP » maven-project-info-reports-plugin » MPIR-366 #54

Posted by Apache Jenkins Server <je...@builds.apache.org>.
See https://builds.apache.org/job/maven-box/job/maven-project-info-reports-plugin/job/MPIR-366/54/

No changes.

2 tests failed.
FAILED:  org.apache.maven.report.projectinfo.PluginManagementReportTest.linux-jdk11 / Build linux-jdk11 / testReport

Error Message:

Mockito cannot mock this class: interface org.apache.maven.project.ProjectBuilder.

Mockito can only mock non-private & non-final classes.
If you're not sure why you're getting this error, please report to the mailing list.


Java               : 11
JVM vendor name    : Oracle Corporation
JVM vendor version : 11.0.1+13-LTS
JVM name           : Java HotSpot(TM) 64-Bit Server VM
JVM version        : 11.0.1+13-LTS
JVM info           : mixed mode
OS name            : Linux
OS version         : 4.4.0-145-generic


Underlying exception : java.lang.UnsupportedOperationException: Cannot define class using reflection

Stack Trace:
org.mockito.exceptions.base.MockitoException: 

Mockito cannot mock this class: interface org.apache.maven.project.ProjectBuilder.

Mockito can only mock non-private & non-final classes.
If you're not sure why you're getting this error, please report to the mailing list.


Java               : 11
JVM vendor name    : Oracle Corporation
JVM vendor version : 11.0.1+13-LTS
JVM name           : Java HotSpot(TM) 64-Bit Server VM
JVM version        : 11.0.1+13-LTS
JVM info           : mixed mode
OS name            : Linux
OS version         : 4.4.0-145-generic


Underlying exception : java.lang.UnsupportedOperationException: Cannot define class using reflection
	at org.apache.maven.report.projectinfo.PluginManagementReportTest.createReportMojo(PluginManagementReportTest.java:64)
	at org.apache.maven.report.projectinfo.PluginManagementReportTest.testReport(PluginManagementReportTest.java:91)
Caused by: java.lang.UnsupportedOperationException: Cannot define class using reflection
	at org.apache.maven.report.projectinfo.PluginManagementReportTest.createReportMojo(PluginManagementReportTest.java:64)
	at org.apache.maven.report.projectinfo.PluginManagementReportTest.testReport(PluginManagementReportTest.java:91)
Caused by: java.lang.IllegalStateException: Could not find sun.misc.Unsafe
	at org.apache.maven.report.projectinfo.PluginManagementReportTest.createReportMojo(PluginManagementReportTest.java:64)
	at org.apache.maven.report.projectinfo.PluginManagementReportTest.testReport(PluginManagementReportTest.java:91)
Caused by: java.lang.NoSuchMethodException: sun.misc.Unsafe.defineClass(java.lang.String, [B, int, int, java.lang.ClassLoader, java.security.ProtectionDomain)
	at org.apache.maven.report.projectinfo.PluginManagementReportTest.createReportMojo(PluginManagementReportTest.java:64)
	at org.apache.maven.report.projectinfo.PluginManagementReportTest.testReport(PluginManagementReportTest.java:91)


FAILED:  org.apache.maven.report.projectinfo.PluginManagementReportTest.windows-jdk11 / Build windows-jdk11 / testReport

Error Message:

Mockito cannot mock this class: interface org.apache.maven.project.ProjectBuilder.

Mockito can only mock non-private & non-final classes.
If you're not sure why you're getting this error, please report to the mailing list.


Java               : 11
JVM vendor name    : Oracle Corporation
JVM vendor version : 11+28
JVM name           : Java HotSpot(TM) 64-Bit Server VM
JVM version        : 11+28
JVM info           : mixed mode
OS name            : Windows Server 2012 R2
OS version         : 6.3


Underlying exception : java.lang.UnsupportedOperationException: Cannot define class using reflection

Stack Trace:
org.mockito.exceptions.base.MockitoException: 

Mockito cannot mock this class: interface org.apache.maven.project.ProjectBuilder.

Mockito can only mock non-private & non-final classes.
If you're not sure why you're getting this error, please report to the mailing list.


Java               : 11
JVM vendor name    : Oracle Corporation
JVM vendor version : 11+28
JVM name           : Java HotSpot(TM) 64-Bit Server VM
JVM version        : 11+28
JVM info           : mixed mode
OS name            : Windows Server 2012 R2
OS version         : 6.3


Underlying exception : java.lang.UnsupportedOperationException: Cannot define class using reflection
	at org.apache.maven.report.projectinfo.PluginManagementReportTest.createReportMojo(PluginManagementReportTest.java:64)
	at org.apache.maven.report.projectinfo.PluginManagementReportTest.testReport(PluginManagementReportTest.java:91)
Caused by: java.lang.UnsupportedOperationException: Cannot define class using reflection
	at org.apache.maven.report.projectinfo.PluginManagementReportTest.createReportMojo(PluginManagementReportTest.java:64)
	at org.apache.maven.report.projectinfo.PluginManagementReportTest.testReport(PluginManagementReportTest.java:91)
Caused by: java.lang.IllegalStateException: Could not find sun.misc.Unsafe
	at org.apache.maven.report.projectinfo.PluginManagementReportTest.createReportMojo(PluginManagementReportTest.java:64)
	at org.apache.maven.report.projectinfo.PluginManagementReportTest.testReport(PluginManagementReportTest.java:91)
Caused by: java.lang.NoSuchMethodException: sun.misc.Unsafe.defineClass(java.lang.String, [B, int, int, java.lang.ClassLoader, java.security.ProtectionDomain)
	at org.apache.maven.report.projectinfo.PluginManagementReportTest.createReportMojo(PluginManagementReportTest.java:64)
	at org.apache.maven.report.projectinfo.PluginManagementReportTest.testReport(PluginManagementReportTest.java:91)




Build log:
[...truncated 16876 lines...]
[INFO] Total time:  03:56 min
[INFO] Finished at: 2019-06-22T17:23:37Z
[INFO] ------------------------------------------------------------------------
[INFO] [jenkins-event-spy] Generated F:\jenkins\jenkins-slave\workspace\ect-info-reports-plugin_MPIR-366@tmp\withMavenbbab85b1\maven-spy-20190622-171940-907835464031148807941.log
Picked up JAVA_TOOL_OPTIONS: -Dmaven.ext.class.path="f:\jenkins\jenkins-slave\workspace\ect-info-reports-plugin_MPIR-366@tmp\withMavenbbab85b1\pipeline-maven-spy.jar" -Dorg.jenkinsci.plugins.pipeline.maven.reportsFolder="f:\jenkins\jenkins-slave\workspace\ect-info-reports-plugin_MPIR-366@tmp\withMavenbbab85b1" 
[Pipeline] }
[Pipeline] // dir
[Pipeline] }
[withMaven] invokerPublisher - Archive invoker results for Maven artifact MavenArtifact{org.apache.maven.plugins:maven-project-info-reports-plugin:maven-plugin:2.10-SNAPSHOT(version: 2.10-SNAPSHOT, snapshot:false) } generated by PluginInvocation{org.apache.maven.plugins:maven-invoker-plugin:2.0.0@integration-test  integration-test}: m\target\invoker-reports\*.xml
[withMaven] junitPublisher - Archive test results for Maven artifact org.apache.maven.plugins:maven-project-info-reports-plugin:maven-plugin:2.10-SNAPSHOT generated by maven-surefire-plugin:test (default-test): m\target\surefire-reports\*.xml
Recording test results
[withMaven] Publishers: Pipeline Graph Publisher: 2 ms, Invoker Publisher: 3639 ms, Junit Publisher: 608 ms
[withMaven] Publishers: Pipeline Graph Publisher: 1 ms
[withMaven] Publishers: Pipeline Graph Publisher: 1 ms
[INFO] run script verify.groovy
[INFO] ..SUCCESS (14.1 s)
[INFO] Building: multi-module\pom.xml
[withMaven] Publishers: Pipeline Graph Publisher: 2 ms
[withMaven] Publishers: Pipeline Graph Publisher: 1 ms
[withMaven] Publishers: 
[withMaven] Publishers: Pipeline Graph Publisher: 1 ms
[withMaven] Publishers: 
[withMaven] Publishers: 
[withMaven] Publishers: 
[withMaven] Publishers: Pipeline Graph Publisher: 1 ms
[withMaven] Publishers: Pipeline Graph Publisher: 1 ms
[withMaven] junitPublisher - Archive test results for Maven artifact org.apache.maven.plugins.project-info-reports.its:dep:jar:1.0-SNAPSHOT generated by maven-surefire-plugin:test (default-test): m\target\it\multi-module\dep\target\surefire-reports\*.xml
[withMaven] junitPublisher - Archive test results for Maven artifact org.apache.maven.plugins.project-info-reports.its:main:jar:1.0-SNAPSHOT generated by maven-surefire-plugin:test (default-test): m\target\it\multi-module\main\target\surefire-reports\*.xml
Recording test results
None of the test reports contained any result
[withMaven] Publishers: Pipeline Graph Publisher: 1 ms, Junit Publisher: 34 ms, Dependencies Fingerprint Publisher: 33 ms
[withMaven] Publishers: Pipeline Graph Publisher: 1 ms, Dependencies Fingerprint Publisher: 31 ms
[Pipeline] // withMaven
[Pipeline] cleanWs
[WS-CLEANUP] Deleting project workspace...
[WS-CLEANUP] Deferred wipeout is used...
[WS-CLEANUP] done
[Pipeline] }
[Pipeline] // stage
[Pipeline] }
[Pipeline] // node
[Pipeline] }
[INFO] run script verify.groovy
[INFO] ..SUCCESS (17.0 s)
[INFO] Building: multi-module\pom.xml
[INFO] run script verify.groovy
[INFO] ..SUCCESS (24.3 s)
[INFO] 
[INFO] --- maven-checkstyle-plugin:2.15:check (checkstyle-check) @ maven-project-info-reports-plugin ---
[INFO] Downloading from central: https://repo.maven.apache.org/maven2/org/apache/maven/shared/maven-shared-resources/2/maven-shared-resources-2.pom
[INFO] Downloaded from central: https://repo.maven.apache.org/maven2/org/apache/maven/shared/maven-shared-resources/2/maven-shared-resources-2.pom (3.0 kB at 227 kB/s)
[INFO] Downloading from central: https://repo.maven.apache.org/maven2/org/codehaus/plexus/plexus-utils/3.0.10/plexus-utils-3.0.10.pom
[INFO] Downloaded from central: https://repo.maven.apache.org/maven2/org/codehaus/plexus/plexus-utils/3.0.10/plexus-utils-3.0.10.pom (3.1 kB at 524 kB/s)
[INFO] Downloading from central: https://repo.maven.apache.org/maven2/org/codehaus/plexus/plexus-resources/1.0.1/plexus-resources-1.0.1.pom
[INFO] Downloaded from central: https://repo.maven.apache.org/maven2/org/codehaus/plexus/plexus-resources/1.0.1/plexus-resources-1.0.1.pom (1.3 kB at 146 kB/s)
[INFO] Downloading from central: https://repo.maven.apache.org/maven2/com/puppycrawl/tools/checkstyle/6.1.1/checkstyle-6.1.1.pom
[INFO] Downloaded from central: https://repo.maven.apache.org/maven2/com/puppycrawl/tools/checkstyle/6.1.1/checkstyle-6.1.1.pom (30 kB at 4.3 MB/s)
[INFO] Downloading from central: https://repo.maven.apache.org/maven2/org/sonatype/oss/oss-parent/7/oss-parent-7.pom
[INFO] Downloaded from central: https://repo.maven.apache.org/maven2/org/sonatype/oss/oss-parent/7/oss-parent-7.pom (4.8 kB at 689 kB/s)
[INFO] Downloading from central: https://repo.maven.apache.org/maven2/org/antlr/antlr4-runtime/4.3/antlr4-runtime-4.3.pom
[INFO] Downloaded from central: https://repo.maven.apache.org/maven2/org/antlr/antlr4-runtime/4.3/antlr4-runtime-4.3.pom (4.8 kB at 684 kB/s)
[INFO] Downloading from central: https://repo.maven.apache.org/maven2/org/antlr/antlr4-master/4.3/antlr4-master-4.3.pom
[INFO] Downloaded from central: https://repo.maven.apache.org/maven2/org/antlr/antlr4-master/4.3/antlr4-master-4.3.pom (7.9 kB at 172 kB/s)
[INFO] Downloading from central: https://repo.maven.apache.org/maven2/org/abego/treelayout/org.abego.treelayout.core/1.0.1/org.abego.treelayout.core-1.0.1.pom
[INFO] Downloaded from central: https://repo.maven.apache.org/maven2/org/abego/treelayout/org.abego.treelayout.core/1.0.1/org.abego.treelayout.core-1.0.1.pom (3.1 kB at 259 kB/s)
[INFO] Downloading from central: https://repo.maven.apache.org/maven2/org/antlr/antlr4-annotations/4.3/antlr4-annotations-4.3.pom
[INFO] Downloaded from central: https://repo.maven.apache.org/maven2/org/antlr/antlr4-annotations/4.3/antlr4-annotations-4.3.pom (1.3 kB at 75 kB/s)
[INFO] Downloading from central: https://repo.maven.apache.org/maven2/commons-beanutils/commons-beanutils-core/1.8.3/commons-beanutils-core-1.8.3.pom
[INFO] Downloaded from central: https://repo.maven.apache.org/maven2/commons-beanutils/commons-beanutils-core/1.8.3/commons-beanutils-core-1.8.3.pom (1.6 kB at 273 kB/s)
[INFO] Downloading from central: https://repo.maven.apache.org/maven2/com/google/guava/guava/18.0/guava-18.0.pom
[INFO] Downloaded from central: https://repo.maven.apache.org/maven2/com/google/guava/guava/18.0/guava-18.0.pom (5.7 kB at 630 kB/s)
[INFO] Downloading from central: https://repo.maven.apache.org/maven2/com/google/guava/guava-parent/18.0/guava-parent-18.0.pom
[INFO] Downloaded from central: https://repo.maven.apache.org/maven2/com/google/guava/guava-parent/18.0/guava-parent-18.0.pom (7.7 kB at 1.1 MB/s)
[INFO] Downloading from central: https://repo.maven.apache.org/maven2/org/antlr/antlr4-runtime/4.3/antlr4-runtime-4.3.jar
[INFO] Downloading from central: https://repo.maven.apache.org/maven2/org/apache/maven/shared/maven-shared-resources/2/maven-shared-resources-2.jar
[INFO] Downloading from central: https://repo.maven.apache.org/maven2/org/codehaus/plexus/plexus-resources/1.0.1/plexus-resources-1.0.1.jar
[INFO] Downloading from central: https://repo.maven.apache.org/maven2/org/abego/treelayout/org.abego.treelayout.core/1.0.1/org.abego.treelayout.core-1.0.1.jar
[INFO] Downloading from central: https://repo.maven.apache.org/maven2/com/puppycrawl/tools/checkstyle/6.1.1/checkstyle-6.1.1.jar
[INFO] Downloaded from central: https://repo.maven.apache.org/maven2/org/apache/maven/shared/maven-shared-resources/2/maven-shared-resources-2.jar (13 kB at 870 kB/s)
[INFO] Downloading from central: https://repo.maven.apache.org/maven2/org/antlr/antlr4-annotations/4.3/antlr4-annotations-4.3.jar
[INFO] Downloaded from central: https://repo.maven.apache.org/maven2/org/abego/treelayout/org.abego.treelayout.core/1.0.1/org.abego.treelayout.core-1.0.1.jar (26 kB at 1.3 MB/s)
[INFO] Downloading from central: https://repo.maven.apache.org/maven2/commons-beanutils/commons-beanutils-core/1.8.3/commons-beanutils-core-1.8.3.jar
[INFO] Downloaded from central: https://repo.maven.apache.org/maven2/org/codehaus/plexus/plexus-resources/1.0.1/plexus-resources-1.0.1.jar (22 kB at 1.3 MB/s)
[INFO] Downloading from central: https://repo.maven.apache.org/maven2/com/google/guava/guava/18.0/guava-18.0.jar
[INFO] Downloaded from central: https://repo.maven.apache.org/maven2/org/antlr/antlr4-annotations/4.3/antlr4-annotations-4.3.jar (10 kB at 421 kB/s)
[INFO] Downloaded from central: https://repo.maven.apache.org/maven2/org/antlr/antlr4-runtime/4.3/antlr4-runtime-4.3.jar (345 kB at 11 MB/s)
[INFO] Downloaded from central: https://repo.maven.apache.org/maven2/commons-beanutils/commons-beanutils-core/1.8.3/commons-beanutils-core-1.8.3.jar (207 kB at 5.7 MB/s)
[INFO] Downloaded from central: https://repo.maven.apache.org/maven2/com/google/guava/guava/18.0/guava-18.0.jar (2.3 MB at 22 MB/s)
[INFO] Downloaded from central: https://repo.maven.apache.org/maven2/com/puppycrawl/tools/checkstyle/6.1.1/checkstyle-6.1.1.jar (1.0 MB at 5.9 MB/s)
[INFO] There are 10 errors reported by Checkstyle 6.1.1 with config/maven_checks.xml ruleset.
[INFO] Ignored 10 errors, 0 violation remaining.
[INFO] 
[INFO] --- maven-jarsigner-plugin:1.3.2:verify (verify) @ maven-project-info-reports-plugin ---
[WARNING] Picked up JAVA_TOOL_OPTIONS: -Dmaven.ext.class.path="f:\jenkins\jenkins-slave\workspace\nfo-reports-plugin_MPIR-366-S464FI4ATSVOULE3N7MCKV5FYYG6GVHDD7OLISMYBGUEPLQM2UNA@2@tmp\withMavena633356a\pipeline-maven-spy.jar" -Dorg.jenkinsci.plugins.pipeline.maven.reportsFolder="f:\jenkins\jenkins-slave\workspace\nfo-reports-plugin_MPIR-366-S464FI4ATSVOULE3N7MCKV5FYYG6GVHDD7OLISMYBGUEPLQM2UNA@2@tmp\withMavena633356a" 
[INFO] 1 archive(s) processed
[INFO] 
[INFO] --- maven-invoker-plugin:2.0.0:verify (integration-test) @ maven-project-info-reports-plugin ---
[INFO] -------------------------------------------------
[INFO] Build Summary:
[INFO]   Passed: 11, Failed: 0, Errors: 0, Skipped: 0
[INFO] -------------------------------------------------
[INFO] ------------------------------------------------------------------------
[INFO] BUILD SUCCESS
[INFO] ------------------------------------------------------------------------
[INFO] Total time:  04:25 min
[INFO] Finished at: 2019-06-22T17:24:10Z
[INFO] ------------------------------------------------------------------------
[INFO] [jenkins-event-spy] Generated F:\jenkins\jenkins-slave\workspace\nfo-reports-plugin_MPIR-366-S464FI4ATSVOULE3N7MCKV5FYYG6GVHDD7OLISMYBGUEPLQM2UNA@2@tmp\withMavena633356a\maven-spy-20190622-171944-61212103180232006301979.log
[Pipeline] }
[Pipeline] // dir
[Pipeline] }
[withMaven] invokerPublisher - Archive invoker results for Maven artifact MavenArtifact{org.apache.maven.plugins:maven-project-info-reports-plugin:maven-plugin:2.10-SNAPSHOT(version: 2.10-SNAPSHOT, snapshot:false) } generated by PluginInvocation{org.apache.maven.plugins:maven-invoker-plugin:2.0.0@integration-test  integration-test}: m\target\invoker-reports\*.xml
[withMaven] junitPublisher - Archive test results for Maven artifact org.apache.maven.plugins:maven-project-info-reports-plugin:maven-plugin:2.10-SNAPSHOT generated by maven-surefire-plugin:test (default-test): m\target\surefire-reports\*.xml
Recording test results
[withMaven] Publishers: Pipeline Graph Publisher: 1 ms, Invoker Publisher: 4176 ms, Junit Publisher: 689 ms
[withMaven] Publishers: 
[withMaven] Publishers: 
[withMaven] Publishers: Pipeline Graph Publisher: 1 ms
[withMaven] Publishers: Pipeline Graph Publisher: 1 ms
[withMaven] Publishers: 
[withMaven] Publishers: 
[withMaven] Publishers: 
[withMaven] Publishers: 
[withMaven] Publishers: 
[INFO] run script verify.groovy
[INFO] ..SUCCESS (26.9 s)
[INFO] 
[INFO] --- maven-checkstyle-plugin:2.15:check (checkstyle-check) @ maven-project-info-reports-plugin ---
[INFO] Downloading from central: https://repo.maven.apache.org/maven2/org/apache/maven/shared/maven-shared-resources/2/maven-shared-resources-2.pom
[INFO] Downloaded from central: https://repo.maven.apache.org/maven2/org/apache/maven/shared/maven-shared-resources/2/maven-shared-resources-2.pom (3.0 kB at 211 kB/s)
[INFO] Downloading from central: https://repo.maven.apache.org/maven2/org/codehaus/plexus/plexus-utils/3.0.10/plexus-utils-3.0.10.pom
[INFO] Downloaded from central: https://repo.maven.apache.org/maven2/org/codehaus/plexus/plexus-utils/3.0.10/plexus-utils-3.0.10.pom (3.1 kB at 393 kB/s)
[INFO] Downloading from central: https://repo.maven.apache.org/maven2/org/codehaus/plexus/plexus-resources/1.0.1/plexus-resources-1.0.1.pom
[INFO] Downloaded from central: https://repo.maven.apache.org/maven2/org/codehaus/plexus/plexus-resources/1.0.1/plexus-resources-1.0.1.pom (1.3 kB at 120 kB/s)
[INFO] Downloading from central: https://repo.maven.apache.org/maven2/com/puppycrawl/tools/checkstyle/6.1.1/checkstyle-6.1.1.pom
[INFO] Downloaded from central: https://repo.maven.apache.org/maven2/com/puppycrawl/tools/checkstyle/6.1.1/checkstyle-6.1.1.pom (30 kB at 2.5 MB/s)
[INFO] Downloading from central: https://repo.maven.apache.org/maven2/org/sonatype/oss/oss-parent/7/oss-parent-7.pom
[INFO] Downloaded from central: https://repo.maven.apache.org/maven2/org/sonatype/oss/oss-parent/7/oss-parent-7.pom (4.8 kB at 603 kB/s)
[INFO] Downloading from central: https://repo.maven.apache.org/maven2/org/antlr/antlr4-runtime/4.3/antlr4-runtime-4.3.pom
[INFO] Downloaded from central: https://repo.maven.apache.org/maven2/org/antlr/antlr4-runtime/4.3/antlr4-runtime-4.3.pom (4.8 kB at 599 kB/s)
[INFO] Downloading from central: https://repo.maven.apache.org/maven2/org/antlr/antlr4-master/4.3/antlr4-master-4.3.pom
[INFO] Downloaded from central: https://repo.maven.apache.org/maven2/org/antlr/antlr4-master/4.3/antlr4-master-4.3.pom (7.9 kB at 721 kB/s)
[INFO] Downloading from central: https://repo.maven.apache.org/maven2/org/abego/treelayout/org.abego.treelayout.core/1.0.1/org.abego.treelayout.core-1.0.1.pom
[INFO] Downloaded from central: https://repo.maven.apache.org/maven2/org/abego/treelayout/org.abego.treelayout.core/1.0.1/org.abego.treelayout.core-1.0.1.pom (3.1 kB at 310 kB/s)
[INFO] Downloading from central: https://repo.maven.apache.org/maven2/org/antlr/antlr4-annotations/4.3/antlr4-annotations-4.3.pom
[INFO] Downloaded from central: https://repo.maven.apache.org/maven2/org/antlr/antlr4-annotations/4.3/antlr4-annotations-4.3.pom (1.3 kB at 116 kB/s)
[INFO] Downloading from central: https://repo.maven.apache.org/maven2/commons-beanutils/commons-beanutils-core/1.8.3/commons-beanutils-core-1.8.3.pom
[INFO] Downloaded from central: https://repo.maven.apache.org/maven2/commons-beanutils/commons-beanutils-core/1.8.3/commons-beanutils-core-1.8.3.pom (1.6 kB at 182 kB/s)
[INFO] Downloading from central: https://repo.maven.apache.org/maven2/com/google/guava/guava/18.0/guava-18.0.pom
[INFO] Downloaded from central: https://repo.maven.apache.org/maven2/com/google/guava/guava/18.0/guava-18.0.pom (5.7 kB at 515 kB/s)
[INFO] Downloading from central: https://repo.maven.apache.org/maven2/com/google/guava/guava-parent/18.0/guava-parent-18.0.pom
[INFO] Downloaded from central: https://repo.maven.apache.org/maven2/com/google/guava/guava-parent/18.0/guava-parent-18.0.pom (7.7 kB at 769 kB/s)
[INFO] Downloading from central: https://repo.maven.apache.org/maven2/org/apache/maven/shared/maven-shared-resources/2/maven-shared-resources-2.jar
[INFO] Downloading from central: https://repo.maven.apache.org/maven2/org/antlr/antlr4-runtime/4.3/antlr4-runtime-4.3.jar
[INFO] Downloading from central: https://repo.maven.apache.org/maven2/org/abego/treelayout/org.abego.treelayout.core/1.0.1/org.abego.treelayout.core-1.0.1.jar
[INFO] Downloading from central: https://repo.maven.apache.org/maven2/com/puppycrawl/tools/checkstyle/6.1.1/checkstyle-6.1.1.jar
[INFO] Downloading from central: https://repo.maven.apache.org/maven2/org/codehaus/plexus/plexus-resources/1.0.1/plexus-resources-1.0.1.jar
[INFO] Downloaded from central: https://repo.maven.apache.org/maven2/org/apache/maven/shared/maven-shared-resources/2/maven-shared-resources-2.jar (13 kB at 653 kB/s)
[INFO] Downloading from central: https://repo.maven.apache.org/maven2/org/antlr/antlr4-annotations/4.3/antlr4-annotations-4.3.jar
[INFO] Downloaded from central: https://repo.maven.apache.org/maven2/org/abego/treelayout/org.abego.treelayout.core/1.0.1/org.abego.treelayout.core-1.0.1.jar (26 kB at 945 kB/s)
[INFO] Downloading from central: https://repo.maven.apache.org/maven2/commons-beanutils/commons-beanutils-core/1.8.3/commons-beanutils-core-1.8.3.jar
[INFO] Downloaded from central: https://repo.maven.apache.org/maven2/org/codehaus/plexus/plexus-resources/1.0.1/plexus-resources-1.0.1.jar (22 kB at 754 kB/s)
[INFO] Downloading from central: https://repo.maven.apache.org/maven2/com/google/guava/guava/18.0/guava-18.0.jar
[INFO] Downloaded from central: https://repo.maven.apache.org/maven2/org/antlr/antlr4-runtime/4.3/antlr4-runtime-4.3.jar (345 kB at 11 MB/s)
[INFO] Downloaded from central: https://repo.maven.apache.org/maven2/org/antlr/antlr4-annotations/4.3/antlr4-annotations-4.3.jar (10 kB at 241 kB/s)
[INFO] Downloaded from central: https://repo.maven.apache.org/maven2/commons-beanutils/commons-beanutils-core/1.8.3/commons-beanutils-core-1.8.3.jar (207 kB at 3.7 MB/s)
[INFO] Downloaded from central: https://repo.maven.apache.org/maven2/com/puppycrawl/tools/checkstyle/6.1.1/checkstyle-6.1.1.jar (1.0 MB at 17 MB/s)
[INFO] Downloaded from central: https://repo.maven.apache.org/maven2/com/google/guava/guava/18.0/guava-18.0.jar (2.3 MB at 21 MB/s)
[withMaven] Publishers: Pipeline Graph Publisher: 1 ms
[withMaven] Publishers: Pipeline Graph Publisher: 1 ms
[withMaven] junitPublisher - Archive test results for Maven artifact org.apache.maven.plugins.project-info-reports.its:dep:jar:1.0-SNAPSHOT generated by maven-surefire-plugin:test (default-test): m\target\it\multi-module\dep\target\surefire-reports\*.xml
[withMaven] junitPublisher - Archive test results for Maven artifact org.apache.maven.plugins.project-info-reports.its:main:jar:1.0-SNAPSHOT generated by maven-surefire-plugin:test (default-test): m\target\it\multi-module\main\target\surefire-reports\*.xml
Recording test results
None of the test reports contained any result
[withMaven] Publishers: Pipeline Graph Publisher: 1 ms, Junit Publisher: 38 ms, Dependencies Fingerprint Publisher: 32 ms
[INFO] There are 10 errors reported by Checkstyle 6.1.1 with config/maven_checks.xml ruleset.
[INFO] Ignored 10 errors, 0 violation remaining.
[INFO] 
[INFO] --- maven-jarsigner-plugin:1.3.2:verify (verify) @ maven-project-info-reports-plugin ---
[withMaven] Publishers: Pipeline Graph Publisher: 1 ms, Dependencies Fingerprint Publisher: 31 ms
[Pipeline] // withMaven
[Pipeline] cleanWs
[WS-CLEANUP] Deleting project workspace...
[WS-CLEANUP] Deferred wipeout is used...
[WS-CLEANUP] done
[Pipeline] }
[Pipeline] // stage
[Pipeline] }
[Pipeline] // node
[Pipeline] }
[WARNING] Picked up JAVA_TOOL_OPTIONS: -Dmaven.ext.class.path="f:\jenkins\jenkins-slave\workspace\nfo-reports-plugin_MPIR-366-S464FI4ATSVOULE3N7MCKV5FYYG6GVHDD7OLISMYBGUEPLQM2UNA@tmp\withMaven7bdae716\pipeline-maven-spy.jar" -Dorg.jenkinsci.plugins.pipeline.maven.reportsFolder="f:\jenkins\jenkins-slave\workspace\nfo-reports-plugin_MPIR-366-S464FI4ATSVOULE3N7MCKV5FYYG6GVHDD7OLISMYBGUEPLQM2UNA@tmp\withMaven7bdae716" 
[INFO] 1 archive(s) processed
[INFO] 
[INFO] --- maven-invoker-plugin:2.0.0:verify (integration-test) @ maven-project-info-reports-plugin ---
[INFO] -------------------------------------------------
[INFO] Build Summary:
[INFO]   Passed: 11, Failed: 0, Errors: 0, Skipped: 0
[INFO] -------------------------------------------------
[INFO] ------------------------------------------------------------------------
[INFO] BUILD SUCCESS
[INFO] ------------------------------------------------------------------------
[INFO] Total time:  04:48 min
[INFO] Finished at: 2019-06-22T17:24:18Z
[INFO] ------------------------------------------------------------------------
[INFO] [jenkins-event-spy] Generated F:\jenkins\jenkins-slave\workspace\nfo-reports-plugin_MPIR-366-S464FI4ATSVOULE3N7MCKV5FYYG6GVHDD7OLISMYBGUEPLQM2UNA@tmp\withMaven7bdae716\maven-spy-20190622-171929-4116339859161091490810.log
Picked up JAVA_TOOL_OPTIONS: -Dmaven.ext.class.path="f:\jenkins\jenkins-slave\workspace\nfo-reports-plugin_MPIR-366-S464FI4ATSVOULE3N7MCKV5FYYG6GVHDD7OLISMYBGUEPLQM2UNA@tmp\withMaven7bdae716\pipeline-maven-spy.jar" -Dorg.jenkinsci.plugins.pipeline.maven.reportsFolder="f:\jenkins\jenkins-slave\workspace\nfo-reports-plugin_MPIR-366-S464FI4ATSVOULE3N7MCKV5FYYG6GVHDD7OLISMYBGUEPLQM2UNA@tmp\withMaven7bdae716" 
[Pipeline] }
[Pipeline] // dir
[Pipeline] }
[withMaven] invokerPublisher - Archive invoker results for Maven artifact MavenArtifact{org.apache.maven.plugins:maven-project-info-reports-plugin:maven-plugin:2.10-SNAPSHOT(version: 2.10-SNAPSHOT, snapshot:false) } generated by PluginInvocation{org.apache.maven.plugins:maven-invoker-plugin:2.0.0@integration-test  integration-test}: m\target\invoker-reports\*.xml
[withMaven] junitPublisher - Archive test results for Maven artifact org.apache.maven.plugins:maven-project-info-reports-plugin:maven-plugin:2.10-SNAPSHOT generated by maven-surefire-plugin:test (default-test): m\target\surefire-reports\*.xml
Recording test results
[withMaven] Publishers: Pipeline Graph Publisher: 1 ms, Invoker Publisher: 5491 ms, Junit Publisher: 676 ms
[withMaven] Publishers: 
[withMaven] Publishers: 
[withMaven] Publishers: Pipeline Graph Publisher: 1 ms
[withMaven] Publishers: Pipeline Graph Publisher: 1 ms
[withMaven] Publishers: 
[withMaven] Publishers: 
[withMaven] Publishers: 
[withMaven] Publishers: 
[withMaven] Publishers: 
[withMaven] Publishers: Pipeline Graph Publisher: 1 ms
[withMaven] Publishers: Pipeline Graph Publisher: 1 ms
[withMaven] junitPublisher - Archive test results for Maven artifact org.apache.maven.plugins.project-info-reports.its:dep:jar:1.0-SNAPSHOT generated by maven-surefire-plugin:test (default-test): m\target\it\multi-module\dep\target\surefire-reports\*.xml
[withMaven] junitPublisher - Archive test results for Maven artifact org.apache.maven.plugins.project-info-reports.its:main:jar:1.0-SNAPSHOT generated by maven-surefire-plugin:test (default-test): m\target\it\multi-module\main\target\surefire-reports\*.xml
Recording test results
None of the test reports contained any result
[withMaven] Publishers: Pipeline Graph Publisher: 2 ms, Junit Publisher: 44 ms, Dependencies Fingerprint Publisher: 53 ms
[withMaven] Publishers: Pipeline Graph Publisher: 1 ms, Dependencies Fingerprint Publisher: 44 ms
[Pipeline] // withMaven
[Pipeline] cleanWs
[WS-CLEANUP] Deleting project workspace...
[WS-CLEANUP] Deferred wipeout is used...
[WS-CLEANUP] done
[Pipeline] }
[Pipeline] // stage
[Pipeline] }
[Pipeline] // node
[Pipeline] }
[Pipeline] // parallel
[Pipeline] echo
[FAILURE-003] AbortException hudson.AbortException: script returned exit code 1
[Pipeline] stage
[Pipeline] { (Notifications)
[Pipeline] echo
Build result: FAILURE
[Pipeline] jiraIssueSelector
[Pipeline] emailext

Build failed in Jenkins: Maven TLP » maven-project-info-reports-plugin » MPIR-366 #53

Posted by Apache Jenkins Server <je...@builds.apache.org>.
See https://builds.apache.org/job/maven-box/job/maven-project-info-reports-plugin/job/MPIR-366/53/

No changes.

2 tests failed.
FAILED:  org.apache.maven.report.projectinfo.PluginManagementReportTest.linux-jdk11 / Build linux-jdk11 / testReport

Error Message:

Mockito cannot mock this class: interface org.apache.maven.project.ProjectBuilder.

Mockito can only mock non-private & non-final classes.
If you're not sure why you're getting this error, please report to the mailing list.


Java               : 11
JVM vendor name    : Oracle Corporation
JVM vendor version : 11.0.1+13-LTS
JVM name           : Java HotSpot(TM) 64-Bit Server VM
JVM version        : 11.0.1+13-LTS
JVM info           : mixed mode
OS name            : Linux
OS version         : 4.4.0-138-generic


Underlying exception : java.lang.UnsupportedOperationException: Cannot define class using reflection

Stack Trace:
org.mockito.exceptions.base.MockitoException: 

Mockito cannot mock this class: interface org.apache.maven.project.ProjectBuilder.

Mockito can only mock non-private & non-final classes.
If you're not sure why you're getting this error, please report to the mailing list.


Java               : 11
JVM vendor name    : Oracle Corporation
JVM vendor version : 11.0.1+13-LTS
JVM name           : Java HotSpot(TM) 64-Bit Server VM
JVM version        : 11.0.1+13-LTS
JVM info           : mixed mode
OS name            : Linux
OS version         : 4.4.0-138-generic


Underlying exception : java.lang.UnsupportedOperationException: Cannot define class using reflection
	at org.apache.maven.report.projectinfo.PluginManagementReportTest.createReportMojo(PluginManagementReportTest.java:64)
	at org.apache.maven.report.projectinfo.PluginManagementReportTest.testReport(PluginManagementReportTest.java:91)
Caused by: java.lang.UnsupportedOperationException: Cannot define class using reflection
	at org.apache.maven.report.projectinfo.PluginManagementReportTest.createReportMojo(PluginManagementReportTest.java:64)
	at org.apache.maven.report.projectinfo.PluginManagementReportTest.testReport(PluginManagementReportTest.java:91)
Caused by: java.lang.IllegalStateException: Could not find sun.misc.Unsafe
	at org.apache.maven.report.projectinfo.PluginManagementReportTest.createReportMojo(PluginManagementReportTest.java:64)
	at org.apache.maven.report.projectinfo.PluginManagementReportTest.testReport(PluginManagementReportTest.java:91)
Caused by: java.lang.NoSuchMethodException: sun.misc.Unsafe.defineClass(java.lang.String, [B, int, int, java.lang.ClassLoader, java.security.ProtectionDomain)
	at org.apache.maven.report.projectinfo.PluginManagementReportTest.createReportMojo(PluginManagementReportTest.java:64)
	at org.apache.maven.report.projectinfo.PluginManagementReportTest.testReport(PluginManagementReportTest.java:91)


FAILED:  org.apache.maven.report.projectinfo.PluginManagementReportTest.windows-jdk11 / Build windows-jdk11 / testReport

Error Message:

Mockito cannot mock this class: interface org.apache.maven.project.ProjectBuilder.

Mockito can only mock non-private & non-final classes.
If you're not sure why you're getting this error, please report to the mailing list.


Java               : 11
JVM vendor name    : Oracle Corporation
JVM vendor version : 11+28
JVM name           : Java HotSpot(TM) 64-Bit Server VM
JVM version        : 11+28
JVM info           : mixed mode
OS name            : Windows Server 2012 R2
OS version         : 6.3


Underlying exception : java.lang.UnsupportedOperationException: Cannot define class using reflection

Stack Trace:
org.mockito.exceptions.base.MockitoException: 

Mockito cannot mock this class: interface org.apache.maven.project.ProjectBuilder.

Mockito can only mock non-private & non-final classes.
If you're not sure why you're getting this error, please report to the mailing list.


Java               : 11
JVM vendor name    : Oracle Corporation
JVM vendor version : 11+28
JVM name           : Java HotSpot(TM) 64-Bit Server VM
JVM version        : 11+28
JVM info           : mixed mode
OS name            : Windows Server 2012 R2
OS version         : 6.3


Underlying exception : java.lang.UnsupportedOperationException: Cannot define class using reflection
	at org.apache.maven.report.projectinfo.PluginManagementReportTest.createReportMojo(PluginManagementReportTest.java:64)
	at org.apache.maven.report.projectinfo.PluginManagementReportTest.testReport(PluginManagementReportTest.java:91)
Caused by: java.lang.UnsupportedOperationException: Cannot define class using reflection
	at org.apache.maven.report.projectinfo.PluginManagementReportTest.createReportMojo(PluginManagementReportTest.java:64)
	at org.apache.maven.report.projectinfo.PluginManagementReportTest.testReport(PluginManagementReportTest.java:91)
Caused by: java.lang.IllegalStateException: Could not find sun.misc.Unsafe
	at org.apache.maven.report.projectinfo.PluginManagementReportTest.createReportMojo(PluginManagementReportTest.java:64)
	at org.apache.maven.report.projectinfo.PluginManagementReportTest.testReport(PluginManagementReportTest.java:91)
Caused by: java.lang.NoSuchMethodException: sun.misc.Unsafe.defineClass(java.lang.String, [B, int, int, java.lang.ClassLoader, java.security.ProtectionDomain)
	at org.apache.maven.report.projectinfo.PluginManagementReportTest.createReportMojo(PluginManagementReportTest.java:64)
	at org.apache.maven.report.projectinfo.PluginManagementReportTest.testReport(PluginManagementReportTest.java:91)




Build log:
[...truncated 16879 lines...]
[WS-CLEANUP] Deleting project workspace...
[WS-CLEANUP] Deferred wipeout is used...
[WS-CLEANUP] done
[Pipeline] cleanWs
[WS-CLEANUP] Deleting project workspace...
[WS-CLEANUP] Deferred wipeout is used...
[WS-CLEANUP] done
[Pipeline] }
[Pipeline] // stage
[Pipeline] }
[Pipeline] // node
[Pipeline] }
Failed in branch windows-jdk12
[INFO] run script verify.groovy
[INFO] ..SUCCESS (6.9 s)
[INFO] Building: MPIR-349\parent\pom.xml
[INFO] run script verify.groovy
[INFO] ..SUCCESS (13.6 s)
[INFO] Building: multi-module\pom.xml
[INFO] run script verify.groovy
[INFO] ..SUCCESS (21.0 s)
[INFO] 
[INFO] --- maven-checkstyle-plugin:2.15:check (checkstyle-check) @ maven-project-info-reports-plugin ---
[INFO] Downloading from central: https://repo.maven.apache.org/maven2/org/apache/maven/shared/maven-shared-resources/2/maven-shared-resources-2.pom
[INFO] Downloaded from central: https://repo.maven.apache.org/maven2/org/apache/maven/shared/maven-shared-resources/2/maven-shared-resources-2.pom (3.0 kB at 269 kB/s)
[INFO] Downloading from central: https://repo.maven.apache.org/maven2/org/codehaus/plexus/plexus-utils/3.0.10/plexus-utils-3.0.10.pom
[INFO] Downloaded from central: https://repo.maven.apache.org/maven2/org/codehaus/plexus/plexus-utils/3.0.10/plexus-utils-3.0.10.pom (3.1 kB at 449 kB/s)
[INFO] Downloading from central: https://repo.maven.apache.org/maven2/org/codehaus/plexus/plexus-resources/1.0.1/plexus-resources-1.0.1.pom
[INFO] Downloaded from central: https://repo.maven.apache.org/maven2/org/codehaus/plexus/plexus-resources/1.0.1/plexus-resources-1.0.1.pom (1.3 kB at 188 kB/s)
[INFO] Downloading from central: https://repo.maven.apache.org/maven2/com/puppycrawl/tools/checkstyle/6.1.1/checkstyle-6.1.1.pom
[INFO] Downloaded from central: https://repo.maven.apache.org/maven2/com/puppycrawl/tools/checkstyle/6.1.1/checkstyle-6.1.1.pom (30 kB at 3.0 MB/s)
[INFO] Downloading from central: https://repo.maven.apache.org/maven2/org/sonatype/oss/oss-parent/7/oss-parent-7.pom
[INFO] Downloaded from central: https://repo.maven.apache.org/maven2/org/sonatype/oss/oss-parent/7/oss-parent-7.pom (4.8 kB at 689 kB/s)
[INFO] Downloading from central: https://repo.maven.apache.org/maven2/org/antlr/antlr4-runtime/4.3/antlr4-runtime-4.3.pom
[INFO] Downloaded from central: https://repo.maven.apache.org/maven2/org/antlr/antlr4-runtime/4.3/antlr4-runtime-4.3.pom (4.8 kB at 479 kB/s)
[INFO] Downloading from central: https://repo.maven.apache.org/maven2/org/antlr/antlr4-master/4.3/antlr4-master-4.3.pom
[INFO] Downloaded from central: https://repo.maven.apache.org/maven2/org/antlr/antlr4-master/4.3/antlr4-master-4.3.pom (7.9 kB at 881 kB/s)
[INFO] Downloading from central: https://repo.maven.apache.org/maven2/org/abego/treelayout/org.abego.treelayout.core/1.0.1/org.abego.treelayout.core-1.0.1.pom
[INFO] Downloaded from central: https://repo.maven.apache.org/maven2/org/abego/treelayout/org.abego.treelayout.core/1.0.1/org.abego.treelayout.core-1.0.1.pom (3.1 kB at 345 kB/s)
[INFO] Downloading from central: https://repo.maven.apache.org/maven2/org/antlr/antlr4-annotations/4.3/antlr4-annotations-4.3.pom
[INFO] Downloaded from central: https://repo.maven.apache.org/maven2/org/antlr/antlr4-annotations/4.3/antlr4-annotations-4.3.pom (1.3 kB at 182 kB/s)
[INFO] Downloading from central: https://repo.maven.apache.org/maven2/commons-beanutils/commons-beanutils-core/1.8.3/commons-beanutils-core-1.8.3.pom
[INFO] Downloaded from central: https://repo.maven.apache.org/maven2/commons-beanutils/commons-beanutils-core/1.8.3/commons-beanutils-core-1.8.3.pom (1.6 kB at 182 kB/s)
[INFO] Downloading from central: https://repo.maven.apache.org/maven2/com/google/guava/guava/18.0/guava-18.0.pom
[INFO] Downloaded from central: https://repo.maven.apache.org/maven2/com/google/guava/guava/18.0/guava-18.0.pom (5.7 kB at 809 kB/s)
[INFO] Downloading from central: https://repo.maven.apache.org/maven2/com/google/guava/guava-parent/18.0/guava-parent-18.0.pom
[INFO] Downloaded from central: https://repo.maven.apache.org/maven2/com/google/guava/guava-parent/18.0/guava-parent-18.0.pom (7.7 kB at 1.1 MB/s)
[INFO] Downloading from central: https://repo.maven.apache.org/maven2/org/abego/treelayout/org.abego.treelayout.core/1.0.1/org.abego.treelayout.core-1.0.1.jar
[INFO] Downloading from central: https://repo.maven.apache.org/maven2/org/apache/maven/shared/maven-shared-resources/2/maven-shared-resources-2.jar
[INFO] Downloading from central: https://repo.maven.apache.org/maven2/org/codehaus/plexus/plexus-resources/1.0.1/plexus-resources-1.0.1.jar
[INFO] Downloading from central: https://repo.maven.apache.org/maven2/org/antlr/antlr4-runtime/4.3/antlr4-runtime-4.3.jar
[INFO] Downloading from central: https://repo.maven.apache.org/maven2/com/puppycrawl/tools/checkstyle/6.1.1/checkstyle-6.1.1.jar
[INFO] Downloaded from central: https://repo.maven.apache.org/maven2/org/abego/treelayout/org.abego.treelayout.core/1.0.1/org.abego.treelayout.core-1.0.1.jar (26 kB at 2.1 MB/s)
[INFO] Downloading from central: https://repo.maven.apache.org/maven2/org/antlr/antlr4-annotations/4.3/antlr4-annotations-4.3.jar
[INFO] Downloaded from central: https://repo.maven.apache.org/maven2/org/apache/maven/shared/maven-shared-resources/2/maven-shared-resources-2.jar (13 kB at 870 kB/s)
[INFO] Downloading from central: https://repo.maven.apache.org/maven2/commons-beanutils/commons-beanutils-core/1.8.3/commons-beanutils-core-1.8.3.jar
[INFO] Downloaded from central: https://repo.maven.apache.org/maven2/org/codehaus/plexus/plexus-resources/1.0.1/plexus-resources-1.0.1.jar (22 kB at 1.3 MB/s)
[INFO] Downloading from central: https://repo.maven.apache.org/maven2/com/google/guava/guava/18.0/guava-18.0.jar
[INFO] Downloaded from central: https://repo.maven.apache.org/maven2/org/antlr/antlr4-annotations/4.3/antlr4-annotations-4.3.jar (10 kB at 326 kB/s)
[INFO] Downloaded from central: https://repo.maven.apache.org/maven2/commons-beanutils/commons-beanutils-core/1.8.3/commons-beanutils-core-1.8.3.jar (207 kB at 6.1 MB/s)
[INFO] Downloaded from central: https://repo.maven.apache.org/maven2/org/antlr/antlr4-runtime/4.3/antlr4-runtime-4.3.jar (345 kB at 3.8 MB/s)
[INFO] Downloaded from central: https://repo.maven.apache.org/maven2/com/puppycrawl/tools/checkstyle/6.1.1/checkstyle-6.1.1.jar (1.0 MB at 11 MB/s)
[INFO] Downloaded from central: https://repo.maven.apache.org/maven2/com/google/guava/guava/18.0/guava-18.0.jar (2.3 MB at 22 MB/s)
[INFO] There are 10 errors reported by Checkstyle 6.1.1 with config/maven_checks.xml ruleset.
[INFO] Ignored 10 errors, 0 violation remaining.
[INFO] 
[INFO] --- maven-jarsigner-plugin:1.3.2:verify (verify) @ maven-project-info-reports-plugin ---
[WARNING] Picked up JAVA_TOOL_OPTIONS: -Dmaven.ext.class.path="f:\jenkins\jenkins-slave\workspace\ect-info-reports-plugin_MPIR-366@tmp\withMavenb4edc682\pipeline-maven-spy.jar" -Dorg.jenkinsci.plugins.pipeline.maven.reportsFolder="f:\jenkins\jenkins-slave\workspace\ect-info-reports-plugin_MPIR-366@tmp\withMavenb4edc682" 
[INFO] 1 archive(s) processed
[INFO] 
[INFO] --- maven-invoker-plugin:2.0.0:verify (integration-test) @ maven-project-info-reports-plugin ---
[INFO] -------------------------------------------------
[INFO] Build Summary:
[INFO]   Passed: 11, Failed: 0, Errors: 0, Skipped: 0
[INFO] -------------------------------------------------
[INFO] ------------------------------------------------------------------------
[INFO] BUILD SUCCESS
[INFO] ------------------------------------------------------------------------
[INFO] Total time:  03:52 min
[INFO] Finished at: 2019-06-17T02:40:00Z
[INFO] ------------------------------------------------------------------------
[INFO] [jenkins-event-spy] Generated F:\jenkins\jenkins-slave\workspace\ect-info-reports-plugin_MPIR-366@tmp\withMavenb4edc682\maven-spy-20190617-023608-845566675662859917838.log
[Pipeline] }
[Pipeline] // dir
[Pipeline] }
[withMaven] invokerPublisher - Archive invoker results for Maven artifact MavenArtifact{org.apache.maven.plugins:maven-project-info-reports-plugin:maven-plugin:2.10-SNAPSHOT(version: 2.10-SNAPSHOT, snapshot:false) } generated by PluginInvocation{org.apache.maven.plugins:maven-invoker-plugin:2.0.0@integration-test  integration-test}: m\target\invoker-reports\*.xml
[withMaven] junitPublisher - Archive test results for Maven artifact org.apache.maven.plugins:maven-project-info-reports-plugin:maven-plugin:2.10-SNAPSHOT generated by maven-surefire-plugin:test (default-test): m\target\surefire-reports\*.xml
Recording test results
[withMaven] Publishers: Pipeline Graph Publisher: 2 ms, Invoker Publisher: 4049 ms, Junit Publisher: 615 ms
[withMaven] Publishers: 
[withMaven] Publishers: 
[withMaven] Publishers: Pipeline Graph Publisher: 1 ms
[withMaven] Publishers: Pipeline Graph Publisher: 1 ms
[withMaven] Publishers: 
[withMaven] Publishers: 
[withMaven] Publishers: 
[withMaven] Publishers: 
[withMaven] Publishers: 
[withMaven] Publishers: Pipeline Graph Publisher: 1 ms
[withMaven] Publishers: Pipeline Graph Publisher: 1 ms
[withMaven] junitPublisher - Archive test results for Maven artifact org.apache.maven.plugins.project-info-reports.its:dep:jar:1.0-SNAPSHOT generated by maven-surefire-plugin:test (default-test): m\target\it\multi-module\dep\target\surefire-reports\*.xml
[withMaven] junitPublisher - Archive test results for Maven artifact org.apache.maven.plugins.project-info-reports.its:main:jar:1.0-SNAPSHOT generated by maven-surefire-plugin:test (default-test): m\target\it\multi-module\main\target\surefire-reports\*.xml
Recording test results
None of the test reports contained any result
[withMaven] Publishers: Pipeline Graph Publisher: 1 ms, Junit Publisher: 32 ms, Dependencies Fingerprint Publisher: 32 ms
[withMaven] Publishers: Dependencies Fingerprint Publisher: 28 ms
[Pipeline] // withMaven
[Pipeline] cleanWs
[WS-CLEANUP] Deleting project workspace...
[WS-CLEANUP] Deferred wipeout is used...
[WS-CLEANUP] done
[Pipeline] }
[Pipeline] // stage
[Pipeline] }
[Pipeline] // node
[Pipeline] }
[INFO] run script verify.bsh
[INFO] ..SUCCESS (133.8 s)
[INFO] Building: git\pom.xml
[INFO] ..SUCCESS (62.1 s)
[INFO] Building: java-version\pom.xml
[INFO] run script verify.groovy
[INFO] ..SUCCESS (50.2 s)
[INFO] Building: minimal-pom\pom.xml
[INFO] run script verify.bsh
[INFO] ..SUCCESS (122.4 s)
[INFO] Building: mpir-229\pom.xml
[INFO] run script verify.groovy
[INFO] ..SUCCESS (20.1 s)
[INFO] Building: MPIR-242\pom.xml
[INFO] run script verify.groovy
[INFO] ..SUCCESS (7.7 s)
[INFO] Building: MPIR-251\pom.xml
[INFO] run script verify.groovy
[INFO] ..SUCCESS (14.7 s)
[INFO] Building: MPIR-300\pom.xml
[INFO] run script verify.groovy
[INFO] ..SUCCESS (7.9 s)
[INFO] Building: MPIR-349\parent\pom.xml
[INFO] run script verify.groovy
[INFO] ..SUCCESS (21.5 s)
[INFO] Building: multi-module\pom.xml
[INFO] run script verify.groovy
[INFO] ..SUCCESS (193.2 s)
[INFO] 
[INFO] --- maven-checkstyle-plugin:2.15:check (checkstyle-check) @ maven-project-info-reports-plugin ---
[INFO] Downloading from central: https://repo.maven.apache.org/maven2/org/apache/maven/shared/maven-shared-resources/2/maven-shared-resources-2.pom
[INFO] Downloaded from central: https://repo.maven.apache.org/maven2/org/apache/maven/shared/maven-shared-resources/2/maven-shared-resources-2.pom (3.0 kB at 8.1 kB/s)
[INFO] Downloading from central: https://repo.maven.apache.org/maven2/org/codehaus/plexus/plexus-utils/3.0.10/plexus-utils-3.0.10.pom
[INFO] Downloaded from central: https://repo.maven.apache.org/maven2/org/codehaus/plexus/plexus-utils/3.0.10/plexus-utils-3.0.10.pom (3.1 kB at 85 kB/s)
[INFO] Downloading from central: https://repo.maven.apache.org/maven2/org/codehaus/plexus/plexus-resources/1.0.1/plexus-resources-1.0.1.pom
[INFO] Downloaded from central: https://repo.maven.apache.org/maven2/org/codehaus/plexus/plexus-resources/1.0.1/plexus-resources-1.0.1.pom (1.3 kB at 36 kB/s)
[INFO] Downloading from central: https://repo.maven.apache.org/maven2/com/puppycrawl/tools/checkstyle/6.1.1/checkstyle-6.1.1.pom
[INFO] Downloaded from central: https://repo.maven.apache.org/maven2/com/puppycrawl/tools/checkstyle/6.1.1/checkstyle-6.1.1.pom (30 kB at 845 kB/s)
[INFO] Downloading from central: https://repo.maven.apache.org/maven2/org/sonatype/oss/oss-parent/7/oss-parent-7.pom
[INFO] Downloaded from central: https://repo.maven.apache.org/maven2/org/sonatype/oss/oss-parent/7/oss-parent-7.pom (4.8 kB at 134 kB/s)
[INFO] Downloading from central: https://repo.maven.apache.org/maven2/org/antlr/antlr4-runtime/4.3/antlr4-runtime-4.3.pom
[INFO] Downloaded from central: https://repo.maven.apache.org/maven2/org/antlr/antlr4-runtime/4.3/antlr4-runtime-4.3.pom (4.8 kB at 92 kB/s)
[INFO] Downloading from central: https://repo.maven.apache.org/maven2/org/antlr/antlr4-master/4.3/antlr4-master-4.3.pom
[INFO] Downloaded from central: https://repo.maven.apache.org/maven2/org/antlr/antlr4-master/4.3/antlr4-master-4.3.pom (7.9 kB at 220 kB/s)
[INFO] Downloading from central: https://repo.maven.apache.org/maven2/org/abego/treelayout/org.abego.treelayout.core/1.0.1/org.abego.treelayout.core-1.0.1.pom
[INFO] Downloaded from central: https://repo.maven.apache.org/maven2/org/abego/treelayout/org.abego.treelayout.core/1.0.1/org.abego.treelayout.core-1.0.1.pom (3.1 kB at 6.1 kB/s)
[INFO] Downloading from central: https://repo.maven.apache.org/maven2/org/antlr/antlr4-annotations/4.3/antlr4-annotations-4.3.pom
[INFO] Downloaded from central: https://repo.maven.apache.org/maven2/org/antlr/antlr4-annotations/4.3/antlr4-annotations-4.3.pom (1.3 kB at 2.7 kB/s)
[INFO] Downloading from central: https://repo.maven.apache.org/maven2/commons-beanutils/commons-beanutils-core/1.8.3/commons-beanutils-core-1.8.3.pom
[INFO] Downloaded from central: https://repo.maven.apache.org/maven2/commons-beanutils/commons-beanutils-core/1.8.3/commons-beanutils-core-1.8.3.pom (1.6 kB at 9.0 kB/s)
[INFO] Downloading from central: https://repo.maven.apache.org/maven2/com/google/guava/guava/18.0/guava-18.0.pom
[INFO] Downloaded from central: https://repo.maven.apache.org/maven2/com/google/guava/guava/18.0/guava-18.0.pom (5.7 kB at 153 kB/s)
[INFO] Downloading from central: https://repo.maven.apache.org/maven2/com/google/guava/guava-parent/18.0/guava-parent-18.0.pom
[INFO] Downloaded from central: https://repo.maven.apache.org/maven2/com/google/guava/guava-parent/18.0/guava-parent-18.0.pom (7.7 kB at 208 kB/s)
[INFO] Downloading from central: https://repo.maven.apache.org/maven2/org/antlr/antlr4-runtime/4.3/antlr4-runtime-4.3.jar
[INFO] Downloaded from central: https://repo.maven.apache.org/maven2/org/antlr/antlr4-runtime/4.3/antlr4-runtime-4.3.jar (345 kB at 246 kB/s)
[INFO] Downloading from central: https://repo.maven.apache.org/maven2/org/antlr/antlr4-annotations/4.3/antlr4-annotations-4.3.jar
[INFO] Downloaded from central: https://repo.maven.apache.org/maven2/org/antlr/antlr4-annotations/4.3/antlr4-annotations-4.3.jar (10 kB at 6.8 kB/s)
[INFO] Downloading from central: https://repo.maven.apache.org/maven2/commons-beanutils/commons-beanutils-core/1.8.3/commons-beanutils-core-1.8.3.jar
[INFO] Downloading from central: https://repo.maven.apache.org/maven2/com/puppycrawl/tools/checkstyle/6.1.1/checkstyle-6.1.1.jar
[INFO] Downloading from central: https://repo.maven.apache.org/maven2/org/abego/treelayout/org.abego.treelayout.core/1.0.1/org.abego.treelayout.core-1.0.1.jar
[INFO] Downloading from central: https://repo.maven.apache.org/maven2/org/apache/maven/shared/maven-shared-resources/2/maven-shared-resources-2.jar
[INFO] Downloaded from central: https://repo.maven.apache.org/maven2/org/apache/maven/shared/maven-shared-resources/2/maven-shared-resources-2.jar (13 kB at 4.7 kB/s)
[INFO] Downloading from central: https://repo.maven.apache.org/maven2/com/google/guava/guava/18.0/guava-18.0.jar
[INFO] Downloaded from central: https://repo.maven.apache.org/maven2/org/abego/treelayout/org.abego.treelayout.core/1.0.1/org.abego.treelayout.core-1.0.1.jar (26 kB at 9.2 kB/s)
[INFO] Downloading from central: https://repo.maven.apache.org/maven2/org/codehaus/plexus/plexus-resources/1.0.1/plexus-resources-1.0.1.jar
[INFO] Downloaded from central: https://repo.maven.apache.org/maven2/com/puppycrawl/tools/checkstyle/6.1.1/checkstyle-6.1.1.jar (1.0 MB at 329 kB/s)
[INFO] Downloaded from central: https://repo.maven.apache.org/maven2/commons-beanutils/commons-beanutils-core/1.8.3/commons-beanutils-core-1.8.3.jar (207 kB at 67 kB/s)
[INFO] Downloaded from central: https://repo.maven.apache.org/maven2/org/codehaus/plexus/plexus-resources/1.0.1/plexus-resources-1.0.1.jar (22 kB at 6.4 kB/s)
[INFO] Downloaded from central: https://repo.maven.apache.org/maven2/com/google/guava/guava/18.0/guava-18.0.jar (2.3 MB at 663 kB/s)
[INFO] There are 10 errors reported by Checkstyle 6.1.1 with config/maven_checks.xml ruleset.
[INFO] Ignored 10 errors, 0 violation remaining.
[INFO] 
[INFO] --- maven-jarsigner-plugin:1.3.2:verify (verify) @ maven-project-info-reports-plugin ---
[WARNING] Picked up JAVA_TOOL_OPTIONS: -Dmaven.ext.class.path="f:\jenkins\jenkins-slave\workspace\nfo-reports-plugin_MPIR-366-S464FI4ATSVOULE3N7MCKV5FYYG6GVHDD7OLISMYBGUEPLQM2UNA@tmp\withMaven75608bd1\pipeline-maven-spy.jar" -Dorg.jenkinsci.plugins.pipeline.maven.reportsFolder="f:\jenkins\jenkins-slave\workspace\nfo-reports-plugin_MPIR-366-S464FI4ATSVOULE3N7MCKV5FYYG6GVHDD7OLISMYBGUEPLQM2UNA@tmp\withMaven75608bd1" 
[INFO] 1 archive(s) processed
[INFO] 
[INFO] --- maven-invoker-plugin:2.0.0:verify (integration-test) @ maven-project-info-reports-plugin ---
[INFO] -------------------------------------------------
[INFO] Build Summary:
[INFO]   Passed: 11, Failed: 0, Errors: 0, Skipped: 0
[INFO] -------------------------------------------------
[INFO] ------------------------------------------------------------------------
[INFO] BUILD SUCCESS
[INFO] ------------------------------------------------------------------------
[INFO] Total time:  15:17 min
[INFO] Finished at: 2019-06-17T02:49:43Z
[INFO] ------------------------------------------------------------------------
[INFO] [jenkins-event-spy] Generated F:\jenkins\jenkins-slave\workspace\nfo-reports-plugin_MPIR-366-S464FI4ATSVOULE3N7MCKV5FYYG6GVHDD7OLISMYBGUEPLQM2UNA@tmp\withMaven75608bd1\maven-spy-20190617-023424-9176240852598341779334.log
Picked up JAVA_TOOL_OPTIONS: -Dmaven.ext.class.path="f:\jenkins\jenkins-slave\workspace\nfo-reports-plugin_MPIR-366-S464FI4ATSVOULE3N7MCKV5FYYG6GVHDD7OLISMYBGUEPLQM2UNA@tmp\withMaven75608bd1\pipeline-maven-spy.jar" -Dorg.jenkinsci.plugins.pipeline.maven.reportsFolder="f:\jenkins\jenkins-slave\workspace\nfo-reports-plugin_MPIR-366-S464FI4ATSVOULE3N7MCKV5FYYG6GVHDD7OLISMYBGUEPLQM2UNA@tmp\withMaven75608bd1" 
[Pipeline] }
[Pipeline] // dir
[Pipeline] }
[withMaven] invokerPublisher - Archive invoker results for Maven artifact MavenArtifact{org.apache.maven.plugins:maven-project-info-reports-plugin:maven-plugin:2.10-SNAPSHOT(version: 2.10-SNAPSHOT, snapshot:false) } generated by PluginInvocation{org.apache.maven.plugins:maven-invoker-plugin:2.0.0@integration-test  integration-test}: m\target\invoker-reports\*.xml
[withMaven] junitPublisher - Archive test results for Maven artifact org.apache.maven.plugins:maven-project-info-reports-plugin:maven-plugin:2.10-SNAPSHOT generated by maven-surefire-plugin:test (default-test): m\target\surefire-reports\*.xml
Recording test results
[withMaven] Publishers: Pipeline Graph Publisher: 2 ms, Invoker Publisher: 23594 ms, Junit Publisher: 4346 ms
[withMaven] Publishers: Pipeline Graph Publisher: 1 ms
[withMaven] Publishers: Pipeline Graph Publisher: 1 ms
[withMaven] Publishers: Pipeline Graph Publisher: 2 ms
[withMaven] Publishers: Pipeline Graph Publisher: 1 ms
[withMaven] Publishers: Pipeline Graph Publisher: 1 ms
[withMaven] Publishers: Pipeline Graph Publisher: 1 ms
[withMaven] Publishers: 
[withMaven] Publishers: 
[withMaven] Publishers: 
[withMaven] Publishers: Pipeline Graph Publisher: 1 ms
[withMaven] Publishers: Pipeline Graph Publisher: 1 ms
[withMaven] junitPublisher - Archive test results for Maven artifact org.apache.maven.plugins.project-info-reports.its:dep:jar:1.0-SNAPSHOT generated by maven-surefire-plugin:test (default-test): m\target\it\multi-module\dep\target\surefire-reports\*.xml
[withMaven] junitPublisher - Archive test results for Maven artifact org.apache.maven.plugins.project-info-reports.its:main:jar:1.0-SNAPSHOT generated by maven-surefire-plugin:test (default-test): m\target\it\multi-module\main\target\surefire-reports\*.xml
Recording test results
None of the test reports contained any result
[withMaven] Publishers: Pipeline Graph Publisher: 2 ms, Junit Publisher: 115 ms, Dependencies Fingerprint Publisher: 195 ms
[withMaven] Publishers: Pipeline Graph Publisher: 1 ms, Dependencies Fingerprint Publisher: 194 ms
[Pipeline] // withMaven
[Pipeline] cleanWs
[WS-CLEANUP] Deleting project workspace...
[WS-CLEANUP] Deferred wipeout is used...
[WS-CLEANUP] done
[Pipeline] }
[Pipeline] // stage
[Pipeline] }
[Pipeline] // node
[Pipeline] }
[Pipeline] // parallel
[Pipeline] echo
[FAILURE-003] AbortException hudson.AbortException: script returned exit code 1
[Pipeline] stage
[Pipeline] { (Notifications)
[Pipeline] echo
Build result: FAILURE
[Pipeline] jiraIssueSelector
[Pipeline] emailext