You are viewing a plain text version of this content. The canonical link for it is here.
Posted to builds@solr.apache.org by Apache Jenkins Server <je...@builds.apache.org> on 2024/07/06 09:09:26 UTC

[JENKINS] Solr » Solr-Check-9.x - Build # 6079 - Unstable!

Build: https://ci-builds.apache.org/job/Solr/job/Solr-Check-9.x/6079/

1 tests failed.
FAILED:  org.apache.solr.cloud.SplitShardWithNodeRoleTest.testSolrClusterWithNodeRoleWithPull

Error Message:
java.lang.AssertionError: Timed out waiting for sub shards to be active. Number of active shards=1
Timeout waiting to see state for collection=coll_NRT_PULL :DocCollection(coll_NRT_PULL//collections/coll_NRT_PULL/state.json/14 {/collections/coll_NRT_PULL/state.json/[28]: [core_node10:2:A, core_node4:1:A, core_node2:2:A:L, core_node8:2:A:L, core_node9:2:A, core_node7:2:A:L]})={
  "pullReplicas":1,
  "configName":"conf",
  "replicationFactor":1,
  "router":{"name":"compositeId"},
  "nrtReplicas":1,
  "tlogReplicas":0,
  "perReplicaState":true,
  "shards":{
    "shard1":{
      "range":"80000000-7fffffff",
      "state":"active",
      "replicas":{
        "core_node2":{
          "core":"coll_NRT_PULL_shard1_replica_n1",
          "node_name":"127.0.0.1:44471_solr",
          "type":"NRT",
          "state":"active",
          "leader":"true",
          "force_set_state":"false",
          "base_url":"https://127.0.0.1:44471/solr"},
        "core_node4":{
          "core":"coll_NRT_PULL_shard1_replica_p3",
          "node_name":"127.0.0.1:41351_solr",
          "type":"PULL",
          "state":"active",
          "force_set_state":"false",
          "base_url":"https://127.0.0.1:41351/solr"}}},
    "shard1_0":{
      "parent":"shard1",
      "stateTimestamp":"1720253748983890391",
      "shard_parent_node":"127.0.0.1:44471_solr",
      "replicas":{
        "core_node7":{
          "core":"coll_NRT_PULL_shard1_0_replica_n5",
          "node_name":"127.0.0.1:44471_solr",
          "type":"NRT",
          "state":"active",
          "leader":"true",
          "force_set_state":"false",
          "base_url":"https://127.0.0.1:44471/solr"},
        "core_node9":{
          "core":"coll_NRT_PULL_shard1_0_replica_p0",
          "node_name":"127.0.0.1:41351_solr",
          "type":"PULL",
          "state":"active",
          "force_set_state":"false",
          "base_url":"https://127.0.0.1:41351/solr"}},
      "range":"80000000-ffffffff",
      "state":"recovery",
      "shard_parent_zk_session":"72084039108132870"},
    "shard1_1":{
      "parent":"shard1",
      "stateTimestamp":"1720253748983863578",
      "shard_parent_node":"127.0.0.1:44471_solr",
      "replicas":{
        "core_node8":{
          "core":"coll_NRT_PULL_shard1_1_replica_n6",
          "node_name":"127.0.0.1:44471_solr",
          "type":"NRT",
          "state":"active",
          "leader":"true",
          "force_set_state":"false",
          "base_url":"https://127.0.0.1:44471/solr"},
        "core_node10":{
          "core":"coll_NRT_PULL_shard1_1_replica_p1",
          "node_name":"127.0.0.1:41351_solr",
          "type":"PULL",
          "state":"active",
          "force_set_state":"false",
          "base_url":"https://127.0.0.1:41351/solr"}},
      "range":"0-7fffffff",
      "state":"recovery",
      "shard_parent_zk_session":"72084039108132870"}}}
Live Nodes: [127.0.0.1:41095_solr, 127.0.0.1:41351_solr, 127.0.0.1:43581_solr, 127.0.0.1:43771_solr, 127.0.0.1:44471_solr, 127.0.0.1:44647_solr]
Last available state: DocCollection(coll_NRT_PULL//collections/coll_NRT_PULL/state.json/14 {/collections/coll_NRT_PULL/state.json/[28]: [core_node10:2:A, core_node4:1:A, core_node2:2:A:L, core_node8:2:A:L, core_node9:2:A, core_node7:2:A:L]})={
  "pullReplicas":1,
  "configName":"conf",
  "replicationFactor":1,
  "router":{"name":"compositeId"},
  "nrtReplicas":1,
  "tlogReplicas":0,
  "perReplicaState":true,
  "shards":{
    "shard1":{
      "range":"80000000-7fffffff",
      "state":"active",
      "replicas":{
        "core_node2":{
          "core":"coll_NRT_PULL_shard1_replica_n1",
          "node_name":"127.0.0.1:44471_solr",
          "type":"NRT",
          "state":"active",
          "leader":"true",
          "force_set_state":"false",
          "base_url":"https://127.0.0.1:44471/solr"},
        "core_node4":{
          "core":"coll_NRT_PULL_shard1_replica_p3",
          "node_name":"127.0.0.1:41351_solr",
          "type":"PULL",
          "state":"active",
          "force_set_state":"false",
          "base_url":"https://127.0.0.1:41351/solr"}}},
    "shard1_0":{
      "parent":"shard1",
      "stateTimestamp":"1720253748983890391",
      "shard_parent_node":"127.0.0.1:44471_solr",
      "replicas":{
        "core_node7":{
          "core":"coll_NRT_PULL_shard1_0_replica_n5",
          "node_name":"127.0.0.1:44471_solr",
          "type":"NRT",
          "state":"active",
          "leader":"true",
          "force_set_state":"false",
          "base_url":"https://127.0.0.1:44471/solr"},
        "core_node9":{
          "core":"coll_NRT_PULL_shard1_0_replica_p0",
          "node_name":"127.0.0.1:41351_solr",
          "type":"PULL",
          "state":"active",
          "force_set_state":"false",
          "base_url":"https://127.0.0.1:41351/solr"}},
      "range":"80000000-ffffffff",
      "state":"recovery",
      "shard_parent_zk_session":"72084039108132870"},
    "shard1_1":{
      "parent":"shard1",
      "stateTimestamp":"1720253748983863578",
      "shard_parent_node":"127.0.0.1:44471_solr",
      "replicas":{
        "core_node8":{
          "core":"coll_NRT_PULL_shard1_1_replica_n6",
          "node_name":"127.0.0.1:44471_solr",
          "type":"NRT",
          "state":"active",
          "leader":"true",
          "force_set_state":"false",
          "base_url":"https://127.0.0.1:44471/solr"},
        "core_node10":{
          "core":"coll_NRT_PULL_shard1_1_replica_p1",
          "node_name":"127.0.0.1:41351_solr",
          "type":"PULL",
          "state":"active",
          "force_set_state":"false",
          "base_url":"https://127.0.0.1:41351/solr"}},
      "range":"0-7fffffff",
      "state":"recovery",
      "shard_parent_zk_session":"72084039108132870"}}}

Stack Trace:
java.lang.AssertionError: Timed out waiting for sub shards to be active. Number of active shards=1
Timeout waiting to see state for collection=coll_NRT_PULL :DocCollection(coll_NRT_PULL//collections/coll_NRT_PULL/state.json/14 {/collections/coll_NRT_PULL/state.json/[28]: [core_node10:2:A, core_node4:1:A, core_node2:2:A:L, core_node8:2:A:L, core_node9:2:A, core_node7:2:A:L]})={
  "pullReplicas":1,
  "configName":"conf",
  "replicationFactor":1,
  "router":{"name":"compositeId"},
  "nrtReplicas":1,
  "tlogReplicas":0,
  "perReplicaState":true,
  "shards":{
    "shard1":{
      "range":"80000000-7fffffff",
      "state":"active",
      "replicas":{
        "core_node2":{
          "core":"coll_NRT_PULL_shard1_replica_n1",
          "node_name":"127.0.0.1:44471_solr",
          "type":"NRT",
          "state":"active",
          "leader":"true",
          "force_set_state":"false",
          "base_url":"https://127.0.0.1:44471/solr"},
        "core_node4":{
          "core":"coll_NRT_PULL_shard1_replica_p3",
          "node_name":"127.0.0.1:41351_solr",
          "type":"PULL",
          "state":"active",
          "force_set_state":"false",
          "base_url":"https://127.0.0.1:41351/solr"}}},
    "shard1_0":{
      "parent":"shard1",
      "stateTimestamp":"1720253748983890391",
      "shard_parent_node":"127.0.0.1:44471_solr",
      "replicas":{
        "core_node7":{
          "core":"coll_NRT_PULL_shard1_0_replica_n5",
          "node_name":"127.0.0.1:44471_solr",
          "type":"NRT",
          "state":"active",
          "leader":"true",
          "force_set_state":"false",
          "base_url":"https://127.0.0.1:44471/solr"},
        "core_node9":{
          "core":"coll_NRT_PULL_shard1_0_replica_p0",
          "node_name":"127.0.0.1:41351_solr",
          "type":"PULL",
          "state":"active",
          "force_set_state":"false",
          "base_url":"https://127.0.0.1:41351/solr"}},
      "range":"80000000-ffffffff",
      "state":"recovery",
      "shard_parent_zk_session":"72084039108132870"},
    "shard1_1":{
      "parent":"shard1",
      "stateTimestamp":"1720253748983863578",
      "shard_parent_node":"127.0.0.1:44471_solr",
      "replicas":{
        "core_node8":{
          "core":"coll_NRT_PULL_shard1_1_replica_n6",
          "node_name":"127.0.0.1:44471_solr",
          "type":"NRT",
          "state":"active",
          "leader":"true",
          "force_set_state":"false",
          "base_url":"https://127.0.0.1:44471/solr"},
        "core_node10":{
          "core":"coll_NRT_PULL_shard1_1_replica_p1",
          "node_name":"127.0.0.1:41351_solr",
          "type":"PULL",
          "state":"active",
          "force_set_state":"false",
          "base_url":"https://127.0.0.1:41351/solr"}},
      "range":"0-7fffffff",
      "state":"recovery",
      "shard_parent_zk_session":"72084039108132870"}}}
Live Nodes: [127.0.0.1:41095_solr, 127.0.0.1:41351_solr, 127.0.0.1:43581_solr, 127.0.0.1:43771_solr, 127.0.0.1:44471_solr, 127.0.0.1:44647_solr]
Last available state: DocCollection(coll_NRT_PULL//collections/coll_NRT_PULL/state.json/14 {/collections/coll_NRT_PULL/state.json/[28]: [core_node10:2:A, core_node4:1:A, core_node2:2:A:L, core_node8:2:A:L, core_node9:2:A, core_node7:2:A:L]})={
  "pullReplicas":1,
  "configName":"conf",
  "replicationFactor":1,
  "router":{"name":"compositeId"},
  "nrtReplicas":1,
  "tlogReplicas":0,
  "perReplicaState":true,
  "shards":{
    "shard1":{
      "range":"80000000-7fffffff",
      "state":"active",
      "replicas":{
        "core_node2":{
          "core":"coll_NRT_PULL_shard1_replica_n1",
          "node_name":"127.0.0.1:44471_solr",
          "type":"NRT",
          "state":"active",
          "leader":"true",
          "force_set_state":"false",
          "base_url":"https://127.0.0.1:44471/solr"},
        "core_node4":{
          "core":"coll_NRT_PULL_shard1_replica_p3",
          "node_name":"127.0.0.1:41351_solr",
          "type":"PULL",
          "state":"active",
          "force_set_state":"false",
          "base_url":"https://127.0.0.1:41351/solr"}}},
    "shard1_0":{
      "parent":"shard1",
      "stateTimestamp":"1720253748983890391",
      "shard_parent_node":"127.0.0.1:44471_solr",
      "replicas":{
        "core_node7":{
          "core":"coll_NRT_PULL_shard1_0_replica_n5",
          "node_name":"127.0.0.1:44471_solr",
          "type":"NRT",
          "state":"active",
          "leader":"true",
          "force_set_state":"false",
          "base_url":"https://127.0.0.1:44471/solr"},
        "core_node9":{
          "core":"coll_NRT_PULL_shard1_0_replica_p0",
          "node_name":"127.0.0.1:41351_solr",
          "type":"PULL",
          "state":"active",
          "force_set_state":"false",
          "base_url":"https://127.0.0.1:41351/solr"}},
      "range":"80000000-ffffffff",
      "state":"recovery",
      "shard_parent_zk_session":"72084039108132870"},
    "shard1_1":{
      "parent":"shard1",
      "stateTimestamp":"1720253748983863578",
      "shard_parent_node":"127.0.0.1:44471_solr",
      "replicas":{
        "core_node8":{
          "core":"coll_NRT_PULL_shard1_1_replica_n6",
          "node_name":"127.0.0.1:44471_solr",
          "type":"NRT",
          "state":"active",
          "leader":"true",
          "force_set_state":"false",
          "base_url":"https://127.0.0.1:44471/solr"},
        "core_node10":{
          "core":"coll_NRT_PULL_shard1_1_replica_p1",
          "node_name":"127.0.0.1:41351_solr",
          "type":"PULL",
          "state":"active",
          "force_set_state":"false",
          "base_url":"https://127.0.0.1:41351/solr"}},
      "range":"0-7fffffff",
      "state":"recovery",
      "shard_parent_zk_session":"72084039108132870"}}}
	at __randomizedtesting.SeedInfo.seed([39F0B1B474DE3253:E3562390D0107F2E]:0)
	at org.junit.Assert.fail(Assert.java:89)
	at org.apache.solr.cloud.SolrCloudTestCase.waitForState(SolrCloudTestCase.java:171)
	at org.apache.solr.cloud.SolrCloudTestCase.waitForState(SolrCloudTestCase.java:137)
	at org.apache.solr.cloud.SplitShardWithNodeRoleTest.doSplit(SplitShardWithNodeRoleTest.java:90)
	at org.apache.solr.cloud.SplitShardWithNodeRoleTest.testSolrClusterWithNodeRoleWithPull(SplitShardWithNodeRoleTest.java:68)
	at java.base/jdk.internal.reflect.NativeMethodAccessorImpl.invoke0(Native Method)
	at java.base/jdk.internal.reflect.NativeMethodAccessorImpl.invoke(NativeMethodAccessorImpl.java:62)
	at java.base/jdk.internal.reflect.DelegatingMethodAccessorImpl.invoke(DelegatingMethodAccessorImpl.java:43)
	at java.base/java.lang.reflect.Method.invoke(Method.java:566)
	at com.carrotsearch.randomizedtesting.RandomizedRunner.invoke(RandomizedRunner.java:1758)
	at com.carrotsearch.randomizedtesting.RandomizedRunner$8.evaluate(RandomizedRunner.java:946)
	at com.carrotsearch.randomizedtesting.RandomizedRunner$9.evaluate(RandomizedRunner.java:982)
	at com.carrotsearch.randomizedtesting.RandomizedRunner$10.evaluate(RandomizedRunner.java:996)
	at com.carrotsearch.randomizedtesting.rules.SystemPropertiesRestoreRule$1.evaluate(SystemPropertiesRestoreRule.java:80)
	at org.junit.rules.RunRules.evaluate(RunRules.java:20)
	at org.apache.lucene.tests.util.TestRuleSetupTeardownChained$1.evaluate(TestRuleSetupTeardownChained.java:48)
	at org.apache.lucene.tests.util.AbstractBeforeAfterRule$1.evaluate(AbstractBeforeAfterRule.java:43)
	at org.apache.lucene.tests.util.TestRuleThreadAndTestName$1.evaluate(TestRuleThreadAndTestName.java:45)
	at org.apache.lucene.tests.util.TestRuleIgnoreAfterMaxFailures$1.evaluate(TestRuleIgnoreAfterMaxFailures.java:60)
	at org.apache.lucene.tests.util.TestRuleMarkFailure$1.evaluate(TestRuleMarkFailure.java:44)
	at org.junit.rules.RunRules.evaluate(RunRules.java:20)
	at com.carrotsearch.randomizedtesting.rules.StatementAdapter.evaluate(StatementAdapter.java:36)
	at com.carrotsearch.randomizedtesting.ThreadLeakControl$StatementRunner.run(ThreadLeakControl.java:390)
	at com.carrotsearch.randomizedtesting.ThreadLeakControl.forkTimeoutingTask(ThreadLeakControl.java:843)
	at com.carrotsearch.randomizedtesting.ThreadLeakControl$3.evaluate(ThreadLeakControl.java:490)
	at com.carrotsearch.randomizedtesting.RandomizedRunner.runSingleTest(RandomizedRunner.java:955)
	at com.carrotsearch.randomizedtesting.RandomizedRunner$5.evaluate(RandomizedRunner.java:840)
	at com.carrotsearch.randomizedtesting.RandomizedRunner$6.evaluate(RandomizedRunner.java:891)
	at com.carrotsearch.randomizedtesting.RandomizedRunner$7.evaluate(RandomizedRunner.java:902)
	at com.carrotsearch.randomizedtesting.rules.StatementAdapter.evaluate(StatementAdapter.java:36)
	at com.carrotsearch.randomizedtesting.rules.StatementAdapter.evaluate(StatementAdapter.java:36)
	at org.apache.lucene.tests.util.AbstractBeforeAfterRule$1.evaluate(AbstractBeforeAfterRule.java:43)
	at org.apache.lucene.tests.util.AbstractBeforeAfterRule$1.evaluate(AbstractBeforeAfterRule.java:43)
	at com.carrotsearch.randomizedtesting.rules.SystemPropertiesRestoreRule$1.evaluate(SystemPropertiesRestoreRule.java:80)
	at org.junit.rules.RunRules.evaluate(RunRules.java:20)
	at org.apache.lucene.tests.util.AbstractBeforeAfterRule$1.evaluate(AbstractBeforeAfterRule.java:43)
	at com.carrotsearch.randomizedtesting.rules.StatementAdapter.evaluate(StatementAdapter.java:36)
	at org.apache.lucene.tests.util.TestRuleStoreClassName$1.evaluate(TestRuleStoreClassName.java:38)
	at com.carrotsearch.randomizedtesting.rules.NoShadowingOrOverridesOnMethodsRule$1.evaluate(NoShadowingOrOverridesOnMethodsRule.java:40)
	at com.carrotsearch.randomizedtesting.rules.NoShadowingOrOverridesOnMethodsRule$1.evaluate(NoShadowingOrOverridesOnMethodsRule.java:40)
	at com.carrotsearch.randomizedtesting.rules.StatementAdapter.evaluate(StatementAdapter.java:36)
	at com.carrotsearch.randomizedtesting.rules.StatementAdapter.evaluate(StatementAdapter.java:36)
	at org.apache.lucene.tests.util.TestRuleAssertionsRequired$1.evaluate(TestRuleAssertionsRequired.java:53)
	at org.apache.lucene.tests.util.AbstractBeforeAfterRule$1.evaluate(AbstractBeforeAfterRule.java:43)
	at org.apache.lucene.tests.util.TestRuleMarkFailure$1.evaluate(TestRuleMarkFailure.java:44)
	at org.apache.lucene.tests.util.TestRuleIgnoreAfterMaxFailures$1.evaluate(TestRuleIgnoreAfterMaxFailures.java:60)
	at org.apache.lucene.tests.util.TestRuleIgnoreTestSuites$1.evaluate(TestRuleIgnoreTestSuites.java:47)
	at org.junit.rules.RunRules.evaluate(RunRules.java:20)
	at com.carrotsearch.randomizedtesting.rules.StatementAdapter.evaluate(StatementAdapter.java:36)
	at com.carrotsearch.randomizedtesting.ThreadLeakControl$StatementRunner.run(ThreadLeakControl.java:390)
	at com.carrotsearch.randomizedtesting.ThreadLeakControl.lambda$forkTimeoutingTask$0(ThreadLeakControl.java:850)
	at java.base/java.lang.Thread.run(Thread.java:829)




Build Log:
[...truncated 7501 lines...]
ERROR: The following test(s) have failed:
  - org.apache.solr.cloud.SplitShardWithNodeRoleTest.testSolrClusterWithNodeRoleWithPull (:solr:core)
    Test history: https://ge.apache.org/scans/tests?search.rootProjectNames=solr-root&tests.container=org.apache.solr.cloud.SplitShardWithNodeRoleTest&tests.test=testSolrClusterWithNodeRoleWithPull http://fucit.org/solr-jenkins-reports/history-trend-of-recent-failures.html#series/org.apache.solr.cloud.SplitShardWithNodeRoleTest.testSolrClusterWithNodeRoleWithPull
    Test output: /home/jenkins/jenkins-slave/workspace/Solr/Solr-Check-9.x/solr/core/build/test-results/test/outputs/OUTPUT-org.apache.solr.cloud.SplitShardWithNodeRoleTest.txt
    Reproduce with: ./gradlew :solr:core:test --tests "org.apache.solr.cloud.SplitShardWithNodeRoleTest.testSolrClusterWithNodeRoleWithPull" -Ptests.jvms=4 -Ptests.haltonfailure=false "-Ptests.jvmargs=-XX:TieredStopAtLevel=1 -XX:+UseParallelGC -XX:ActiveProcessorCount=1 -XX:ReservedCodeCacheSize=120m" -Ptests.seed=39F0B1B474DE3253 -Ptests.multiplier=2 -Ptests.badapples=false -Ptests.file.encoding=US-ASCII


Deprecated Gradle features were used in this build, making it incompatible with Gradle 9.0.

You can use '--warning-mode all' to show the individual deprecation warnings and determine if they come from your own scripts or plugins.

For more on this, please refer to https://docs.gradle.org/8.4/userguide/command_line_interface.html#sec:command_line_warnings in the Gradle documentation.

BUILD SUCCESSFUL in 1h 6m 37s
693 actionable tasks: 693 executed

Publishing build scan...

Publishing failed.

The response from https://ge.apache.org/scans/publish/gradle/3.15.1/token was not from Gradle Enterprise.
The specified server address may be incorrect, or your network environment may be interfering.

Please report this problem to your Gradle Enterprise administrator via https://ge.apache.org/help and include the following via copy/paste:

----------
Gradle version: 8.4
Plugin version: 3.15.1
Request URL: https://ge.apache.org/scans/publish/gradle/3.15.1/token
Request ID: ffe5a9f2-eca7-45ef-ab03-52918be06aa7
Response status code: 502
Response content type: text/html
----------

Build step 'Invoke Gradle script' changed build result to SUCCESS
Archiving artifacts
‘**/*.events’ doesn’t match anything: ‘**’ exists but not ‘**/*.events’
No artifacts found that match the file pattern "**/*.events,heapdumps/**,**/hs_err_pid*". Configuration error?
Recording test results
[Checks API] No suitable checks publisher found.
Build step 'Publish JUnit test result report' changed build result to UNSTABLE
Email was triggered for: Unstable (Test Failures)
Sending email for trigger: Unstable (Test Failures)

[JENKINS] Solr » Solr-Check-9.x - Build # 6080 - Still Unstable!

Posted by Apache Jenkins Server <je...@builds.apache.org>.
Build: https://ci-builds.apache.org/job/Solr/job/Solr-Check-9.x/6080/

1 tests failed.
FAILED:  org.apache.solr.cloud.OverseerTest.testShardLeaderChange

Error Message:
com.carrotsearch.randomizedtesting.UncaughtExceptionError: Captured an uncaught exception in thread: Thread[id=7741, name=OverseerCollectionConfigSetProcessor-72088099893673986-127.0.0.1:45665_solr-n_0000000000, state=RUNNABLE, group=Overseer collection creation process.]

Stack Trace:
com.carrotsearch.randomizedtesting.UncaughtExceptionError: Captured an uncaught exception in thread: Thread[id=7741, name=OverseerCollectionConfigSetProcessor-72088099893673986-127.0.0.1:45665_solr-n_0000000000, state=RUNNABLE, group=Overseer collection creation process.]
	at __randomizedtesting.SeedInfo.seed([1E4D2E45DCDA2C97:C01EA9B2C642D966]:0)
Caused by: org.apache.solr.common.AlreadyClosedException
	at __randomizedtesting.SeedInfo.seed([1E4D2E45DCDA2C97]:0)
	at app//org.apache.solr.common.cloud.ZkCmdExecutor.retryOperation(ZkCmdExecutor.java:68)
	at app//org.apache.solr.common.cloud.SolrZkClient.getData(SolrZkClient.java:448)
	at app//org.apache.solr.cloud.OverseerTaskProcessor.amILeader(OverseerTaskProcessor.java:486)
	at app//org.apache.solr.cloud.OverseerTaskProcessor.run(OverseerTaskProcessor.java:171)
	at java.base@11.0.16.1/java.lang.Thread.run(Thread.java:829)




Build Log:
[...truncated 27489 lines...]
ERROR: The following test(s) have failed:
  - org.apache.solr.cloud.OverseerTest.testShardLeaderChange (:solr:core)
    Test history: https://ge.apache.org/scans/tests?search.rootProjectNames=solr-root&tests.container=org.apache.solr.cloud.OverseerTest&tests.test=testShardLeaderChange http://fucit.org/solr-jenkins-reports/history-trend-of-recent-failures.html#series/org.apache.solr.cloud.OverseerTest.testShardLeaderChange
    Test output: /home/jenkins/jenkins-slave/workspace/Solr/Solr-Check-9.x/solr/core/build/test-results/test/outputs/OUTPUT-org.apache.solr.cloud.OverseerTest.txt
    Reproduce with: ./gradlew :solr:core:test --tests "org.apache.solr.cloud.OverseerTest.testShardLeaderChange" -Ptests.jvms=4 -Ptests.haltonfailure=false "-Ptests.jvmargs=-XX:TieredStopAtLevel=1 -XX:+UseParallelGC -XX:ActiveProcessorCount=1 -XX:ReservedCodeCacheSize=120m" -Ptests.seed=1E4D2E45DCDA2C97 -Ptests.multiplier=2 -Ptests.badapples=false -Ptests.file.encoding=UTF-8


Deprecated Gradle features were used in this build, making it incompatible with Gradle 9.0.

You can use '--warning-mode all' to show the individual deprecation warnings and determine if they come from your own scripts or plugins.

For more on this, please refer to https://docs.gradle.org/8.4/userguide/command_line_interface.html#sec:command_line_warnings in the Gradle documentation.

BUILD SUCCESSFUL in 1h 6m 8s
693 actionable tasks: 693 executed

Publishing build scan...
Publishing build scan failed due to network error 'java.net.SocketTimeoutException: Read timed out' (2 retries remaining)...
Publishing build scan failed due to network error 'java.net.SocketTimeoutException: Read timed out' (1 retry remaining)...

A network error occurred.

If you require assistance with this problem, please report it to your Gradle Enterprise administrator and include the following information via copy/paste.

----------
Gradle version: 8.4
Plugin version: 3.15.1
Request URL: https://ge.apache.org/scans/publish/gradle/3.15.1/token
Request ID: 5dc5270e-d237-4daa-ac81-2ba4155426d5
Exception: java.net.SocketTimeoutException: Read timed out
----------

Build step 'Invoke Gradle script' changed build result to SUCCESS
Archiving artifacts
‘**/*.events’ doesn’t match anything: ‘**’ exists but not ‘**/*.events’
No artifacts found that match the file pattern "**/*.events,heapdumps/**,**/hs_err_pid*". Configuration error?
Recording test results
[Checks API] No suitable checks publisher found.
Build step 'Publish JUnit test result report' changed build result to UNSTABLE
Email was triggered for: Unstable (Test Failures)
Sending email for trigger: Unstable (Test Failures)