You are viewing a plain text version of this content. The canonical link for it is here.
Posted to mapreduce-dev@hadoop.apache.org by "Harsh J (Resolved) (JIRA)" <ji...@apache.org> on 2011/12/31 09:42:31 UTC

[jira] [Resolved] (MAPREDUCE-3611) trunk build failure

     [ https://issues.apache.org/jira/browse/MAPREDUCE-3611?page=com.atlassian.jira.plugin.system.issuetabpanels:all-tabpanel ]

Harsh J resolved MAPREDUCE-3611.
--------------------------------

       Resolution: Duplicate
    Fix Version/s: 0.23.1

This was recently fixed by MAPREDUCE-3608, perhaps the change hasn't propagated to the git mirrors you may be using yet. The SVN build does compile properly at present.
                
> trunk build failure
> -------------------
>
>                 Key: MAPREDUCE-3611
>                 URL: https://issues.apache.org/jira/browse/MAPREDUCE-3611
>             Project: Hadoop Map/Reduce
>          Issue Type: Bug
>            Reporter: Sho Shimauchi
>            Priority: Critical
>             Fix For: 0.23.1
>
>
> https://builds.apache.org/job/Hadoop-Mapreduce-0.23-Build/144/
> {code}
> [INFO] ------------------------------------------------------------------------
> [INFO] BUILD FAILURE
> [INFO] ------------------------------------------------------------------------
> [INFO] Total time: 6:47.415s
> [INFO] Finished at: Thu Dec 29 23:37:00 UTC 2011
> [INFO] Final Memory: 101M/760M
> [INFO] ------------------------------------------------------------------------
> [ERROR] Failed to execute goal org.apache.maven.plugins:maven-compiler-plugin:2.3.2:testCompile (default-testCompile) on project hadoop-yarn-server-resourcemanager: Compilation failure: Compilation failure:
> [ERROR] /home/jenkins/jenkins-slave/workspace/Hadoop-Mapreduce-0.23-Build/trunk/hadoop-mapreduce-project/hadoop-yarn/hadoop-yarn-server/hadoop-yarn-server-resourcemanager/src/test/java/org/apache/hadoop/yarn/server/resourcemanager/webapp/TestRMWebServicesCapacitySched.java:[96,36] cannot find symbol
> [ERROR] symbol  : variable ROOT
> [ERROR] location: class org.apache.hadoop.yarn.server.resourcemanager.scheduler.capacity.CapacityScheduler
> [ERROR] /home/jenkins/jenkins-slave/workspace/Hadoop-Mapreduce-0.23-Build/trunk/hadoop-mapreduce-project/hadoop-yarn/hadoop-yarn-server/hadoop-yarn-server-resourcemanager/src/test/java/org/apache/hadoop/yarn/server/resourcemanager/webapp/TestRMWebServicesCapacitySched.java:[97,38] cannot find symbol
> [ERROR] symbol  : variable ROOT
> [ERROR] location: class org.apache.hadoop.yarn.server.resourcemanager.scheduler.capacity.CapacityScheduler
> [ERROR] /home/jenkins/jenkins-slave/workspace/Hadoop-Mapreduce-0.23-Build/trunk/hadoop-mapreduce-project/hadoop-yarn/hadoop-yarn-server/hadoop-yarn-server-resourcemanager/src/test/java/org/apache/hadoop/yarn/server/resourcemanager/webapp/TestRMWebServicesCapacitySched.java:[99,38] cannot find symbol
> [ERROR] symbol  : variable ROOT
> [ERROR] location: class org.apache.hadoop.yarn.server.resourcemanager.scheduler.capacity.CapacityScheduler
> [ERROR] /home/jenkins/jenkins-slave/workspace/Hadoop-Mapreduce-0.23-Build/trunk/hadoop-mapreduce-project/hadoop-yarn/hadoop-yarn-server/hadoop-yarn-server-resourcemanager/src/test/java/org/apache/hadoop/yarn/server/resourcemanager/webapp/TestRMWebServicesCapacitySched.java:[103,38] cannot find symbol
> [ERROR] symbol  : variable ROOT
> [ERROR] location: class org.apache.hadoop.yarn.server.resourcemanager.scheduler.capacity.CapacityScheduler
> [ERROR] /home/jenkins/jenkins-slave/workspace/Hadoop-Mapreduce-0.23-Build/trunk/hadoop-mapreduce-project/hadoop-yarn/hadoop-yarn-server/hadoop-yarn-server-resourcemanager/src/test/java/org/apache/hadoop/yarn/server/resourcemanager/webapp/TestRMWebServicesCapacitySched.java:[212,36] cannot find symbol
> [ERROR] symbol  : variable ROOT
> [ERROR] location: class org.apache.hadoop.yarn.server.resourcemanager.scheduler.capacity.CapacityScheduler
> [ERROR] /home/jenkins/jenkins-slave/workspace/Hadoop-Mapreduce-0.23-Build/trunk/hadoop-mapreduce-project/hadoop-yarn/hadoop-yarn-server/hadoop-yarn-server-resourcemanager/src/test/java/org/apache/hadoop/yarn/server/resourcemanager/webapp/TestRMWebServicesCapacitySched.java:[256,34] cannot find symbol
> [ERROR] symbol  : variable ROOT
> [ERROR] location: class org.apache.hadoop.yarn.server.resourcemanager.scheduler.capacity.CapacityScheduler
> {code}

--
This message is automatically generated by JIRA.
If you think it was sent incorrectly, please contact your JIRA administrators: https://issues.apache.org/jira/secure/ContactAdministrators!default.jspa
For more information on JIRA, see: http://www.atlassian.com/software/jira