You are viewing a plain text version of this content. The canonical link for it is here.
Posted to commits@phoenix.apache.org by Apache Jenkins Server <je...@builds.apache.org> on 2016/01/02 05:03:18 UTC

Build failed in Jenkins: Phoenix | 4.x-HBase-0.98 #965

See <https://builds.apache.org/job/Phoenix-4.x-HBase-0.98/965/changes>

Changes:

[jtaylor] PHOENIX-2552 Fix hanging Jenkins builds

------------------------------------------
[...truncated 638 lines...]
Tests run: 2, Failures: 0, Errors: 0, Skipped: 0, Time elapsed: 16.467 sec - in org.apache.phoenix.end2end.ExecuteStatementsIT
Running org.apache.phoenix.end2end.SortMergeJoinMoreIT
Tests run: 11, Failures: 0, Errors: 0, Skipped: 0, Time elapsed: 11.479 sec - in org.apache.phoenix.end2end.LastValueFunctionIT
Tests run: 8, Failures: 0, Errors: 0, Skipped: 0, Time elapsed: 16.44 sec - in org.apache.phoenix.end2end.TenantSpecificViewIndexIT
Running org.apache.phoenix.end2end.ReverseFunctionIT
Running org.apache.phoenix.end2end.PowerFunctionEnd2EndIT
Tests run: 5, Failures: 0, Errors: 0, Skipped: 0, Time elapsed: 3.266 sec - in org.apache.phoenix.end2end.ReverseFunctionIT
Running org.apache.phoenix.end2end.InstrFunctionIT
Tests run: 1, Failures: 0, Errors: 0, Skipped: 0, Time elapsed: 5.355 sec - in org.apache.phoenix.end2end.PowerFunctionEnd2EndIT
Running org.apache.phoenix.end2end.QueryMoreIT
Tests run: 8, Failures: 0, Errors: 0, Skipped: 0, Time elapsed: 4.263 sec - in org.apache.phoenix.end2end.InstrFunctionIT
Running org.apache.phoenix.end2end.LikeExpressionIT
Tests run: 2, Failures: 0, Errors: 0, Skipped: 0, Time elapsed: 4.162 sec - in org.apache.phoenix.end2end.LikeExpressionIT
Running org.apache.phoenix.end2end.ArrayConcatFunctionIT
Tests run: 3, Failures: 0, Errors: 0, Skipped: 0, Time elapsed: 17.381 sec - in org.apache.phoenix.end2end.SortMergeJoinMoreIT
Running org.apache.phoenix.end2end.RoundFloorCeilFunctionsEnd2EndIT
Tests run: 31, Failures: 0, Errors: 0, Skipped: 0, Time elapsed: 10.466 sec - in org.apache.phoenix.end2end.RoundFloorCeilFunctionsEnd2EndIT
Running org.apache.phoenix.end2end.CSVCommonsLoaderIT
Tests run: 30, Failures: 0, Errors: 0, Skipped: 0, Time elapsed: 15.092 sec - in org.apache.phoenix.end2end.ArrayConcatFunctionIT
Running org.apache.phoenix.end2end.ArrayAppendFunctionIT
Tests run: 6, Failures: 0, Errors: 0, Skipped: 0, Time elapsed: 24.432 sec - in org.apache.phoenix.end2end.QueryMoreIT
Running org.apache.phoenix.end2end.AlterTableWithViewsIT
Tests run: 34, Failures: 0, Errors: 0, Skipped: 0, Time elapsed: 14.155 sec - in org.apache.phoenix.end2end.ArrayAppendFunctionIT
Running org.apache.phoenix.end2end.salted.SaltedTableUpsertSelectIT
Tests run: 16, Failures: 0, Errors: 0, Skipped: 0, Time elapsed: 17.807 sec - in org.apache.phoenix.end2end.CSVCommonsLoaderIT
Running org.apache.phoenix.end2end.salted.SaltedTableVarLengthRowKeyIT
Tests run: 1, Failures: 0, Errors: 0, Skipped: 0, Time elapsed: 3.151 sec - in org.apache.phoenix.end2end.salted.SaltedTableVarLengthRowKeyIT
Running org.apache.phoenix.end2end.DisableLocalIndexIT
Tests run: 1, Failures: 0, Errors: 0, Skipped: 0, Time elapsed: 3.881 sec - in org.apache.phoenix.end2end.DisableLocalIndexIT
Running org.apache.phoenix.end2end.RTrimFunctionIT
Tests run: 5, Failures: 0, Errors: 0, Skipped: 0, Time elapsed: 10.165 sec - in org.apache.phoenix.end2end.salted.SaltedTableUpsertSelectIT
Running org.apache.phoenix.end2end.UpsertSelectAutoCommitIT
Tests run: 2, Failures: 0, Errors: 0, Skipped: 0, Time elapsed: 2.348 sec - in org.apache.phoenix.end2end.RTrimFunctionIT
Tests run: 96, Failures: 0, Errors: 0, Skipped: 0, Time elapsed: 123.081 sec - in org.apache.phoenix.end2end.HashJoinIT
Running org.apache.phoenix.end2end.CoalesceFunctionIT
Running org.apache.phoenix.end2end.SubqueryIT
Tests run: 10, Failures: 0, Errors: 0, Skipped: 0, Time elapsed: 9.4 sec - in org.apache.phoenix.end2end.CoalesceFunctionIT
Running org.apache.phoenix.end2end.DateTimeIT
Tests run: 3, Failures: 0, Errors: 0, Skipped: 0, Time elapsed: 12.466 sec - in org.apache.phoenix.end2end.UpsertSelectAutoCommitIT
Running org.apache.phoenix.end2end.ServerExceptionIT
Tests run: 1, Failures: 0, Errors: 0, Skipped: 0, Time elapsed: 2.066 sec - in org.apache.phoenix.end2end.ServerExceptionIT
Running org.apache.phoenix.end2end.ModulusExpressionIT
Tests run: 11, Failures: 0, Errors: 0, Skipped: 0, Time elapsed: 5.923 sec - in org.apache.phoenix.end2end.ModulusExpressionIT
Running org.apache.phoenix.end2end.SubqueryUsingSortMergeJoinIT
Tests run: 20, Failures: 1, Errors: 0, Skipped: 0, Time elapsed: 10.066 sec <<< FAILURE! - in org.apache.phoenix.end2end.DateTimeIT
testYearFunctionDate(org.apache.phoenix.end2end.DateTimeIT)  Time elapsed: 0.297 sec  <<< FAILURE!
java.lang.AssertionError: expected:<2015> but was:<2016>
	at org.apache.phoenix.end2end.DateTimeIT.testYearFunctionDate(DateTimeIT.java:416)

Running org.apache.phoenix.end2end.BinaryRowKeyIT
Tests run: 3, Failures: 0, Errors: 0, Skipped: 0, Time elapsed: 2.652 sec - in org.apache.phoenix.end2end.BinaryRowKeyIT
Running org.apache.phoenix.end2end.ReadOnlyIT
Tests run: 1, Failures: 0, Errors: 0, Skipped: 0, Time elapsed: 7.765 sec - in org.apache.phoenix.end2end.ReadOnlyIT
Running org.apache.phoenix.end2end.DeleteIT
Tests run: 21, Failures: 0, Errors: 0, Skipped: 0, Time elapsed: 53.315 sec - in org.apache.phoenix.end2end.SubqueryIT
Running org.apache.phoenix.end2end.HashJoinLocalIndexIT
Tests run: 128, Failures: 0, Errors: 0, Skipped: 0, Time elapsed: 475.289 sec - in org.apache.phoenix.end2end.index.IndexIT
Running org.apache.phoenix.end2end.GroupByCaseIT
Tests run: 15, Failures: 0, Errors: 0, Skipped: 0, Time elapsed: 42.889 sec - in org.apache.phoenix.end2end.SubqueryUsingSortMergeJoinIT
Running org.apache.phoenix.end2end.ArrayFillFunctionIT
Tests run: 22, Failures: 0, Errors: 0, Skipped: 0, Time elapsed: 33.975 sec - in org.apache.phoenix.end2end.DeleteIT
Running org.apache.phoenix.end2end.StatementHintsIT
Tests run: 2, Failures: 0, Errors: 0, Skipped: 0, Time elapsed: 2.805 sec - in org.apache.phoenix.end2end.StatementHintsIT
Running org.apache.phoenix.end2end.DecodeFunctionIT
Tests run: 5, Failures: 0, Errors: 0, Skipped: 0, Time elapsed: 9.781 sec - in org.apache.phoenix.end2end.GroupByCaseIT
Tests run: 1, Failures: 0, Errors: 0, Skipped: 0, Time elapsed: 15.774 sec - in org.apache.phoenix.end2end.HashJoinLocalIndexIT
Running org.apache.phoenix.end2end.SpooledSortMergeJoinIT
Running org.apache.phoenix.end2end.TimezoneOffsetFunctionIT
Tests run: 6, Failures: 0, Errors: 0, Skipped: 0, Time elapsed: 3.616 sec - in org.apache.phoenix.end2end.DecodeFunctionIT
Running org.apache.phoenix.end2end.ArrayPrependFunctionIT
Tests run: 26, Failures: 0, Errors: 0, Skipped: 0, Time elapsed: 13.381 sec - in org.apache.phoenix.end2end.ArrayFillFunctionIT
Running org.apache.phoenix.end2end.ArithmeticQueryIT
Tests run: 7, Failures: 0, Errors: 0, Skipped: 0, Time elapsed: 9.404 sec - in org.apache.phoenix.end2end.TimezoneOffsetFunctionIT
Running org.apache.phoenix.end2end.IsNullIT
Tests run: 3, Failures: 0, Errors: 0, Skipped: 0, Time elapsed: 6.522 sec - in org.apache.phoenix.end2end.IsNullIT
Running org.apache.phoenix.end2end.SpooledTmpFileDeleteIT
Tests run: 34, Failures: 0, Errors: 0, Skipped: 0, Time elapsed: 18.073 sec - in org.apache.phoenix.end2end.ArrayPrependFunctionIT
Running org.apache.phoenix.end2end.AbsFunctionEnd2EndIT
Tests run: 1, Failures: 0, Errors: 0, Skipped: 0, Time elapsed: 4.228 sec - in org.apache.phoenix.end2end.SpooledTmpFileDeleteIT
Running org.apache.phoenix.end2end.FirstValueFunctionIT
Tests run: 1, Failures: 0, Errors: 0, Skipped: 0, Time elapsed: 2.619 sec - in org.apache.phoenix.end2end.AbsFunctionEnd2EndIT
Running org.apache.phoenix.end2end.RegexpSubstrFunctionIT
Tests run: 2, Failures: 0, Errors: 0, Skipped: 0, Time elapsed: 2.951 sec - in org.apache.phoenix.end2end.RegexpSubstrFunctionIT
Running org.apache.phoenix.end2end.QueryExecWithoutSCNIT
Tests run: 7, Failures: 0, Errors: 0, Skipped: 0, Time elapsed: 7.541 sec - in org.apache.phoenix.end2end.FirstValueFunctionIT
Tests run: 1, Failures: 0, Errors: 0, Skipped: 0, Time elapsed: 3.382 sec - in org.apache.phoenix.end2end.QueryExecWithoutSCNIT
Running org.apache.phoenix.end2end.UpgradeIT
Running org.apache.phoenix.end2end.PhoenixRuntimeIT
Tests run: 26, Failures: 0, Errors: 0, Skipped: 0, Time elapsed: 26.611 sec - in org.apache.phoenix.end2end.ArithmeticQueryIT
Running org.apache.phoenix.end2end.InListIT
Tests run: 2, Failures: 0, Errors: 0, Skipped: 0, Time elapsed: 17.549 sec - in org.apache.phoenix.end2end.PhoenixRuntimeIT
Running org.apache.phoenix.end2end.ExpFunctionEnd2EndIT
Tests run: 3, Failures: 0, Errors: 0, Skipped: 0, Time elapsed: 11.019 sec - in org.apache.phoenix.end2end.ExpFunctionEnd2EndIT
Running org.apache.phoenix.end2end.SortMergeJoinIT
Tests run: 16, Failures: 0, Errors: 0, Skipped: 0, Time elapsed: 165.207 sec - in org.apache.phoenix.end2end.AlterTableWithViewsIT
Running org.apache.phoenix.end2end.StoreNullsIT
Tests run: 6, Failures: 0, Errors: 0, Skipped: 0, Time elapsed: 44.832 sec - in org.apache.phoenix.end2end.UpgradeIT
Running org.apache.phoenix.end2end.GetSetByteBitFunctionEnd2EndIT
Tests run: 3, Failures: 0, Errors: 0, Skipped: 0, Time elapsed: 18.049 sec - in org.apache.phoenix.end2end.StoreNullsIT
Running org.apache.phoenix.iterate.RoundRobinResultIteratorIT
Tests run: 28, Failures: 0, Errors: 0, Skipped: 0, Time elapsed: 78.501 sec - in org.apache.phoenix.end2end.InListIT
Running org.apache.phoenix.iterate.PhoenixQueryTimeoutIT
Tests run: 2, Failures: 0, Errors: 0, Skipped: 0, Time elapsed: 3.908 sec - in org.apache.phoenix.iterate.PhoenixQueryTimeoutIT
Tests run: 9, Failures: 0, Errors: 0, Skipped: 0, Time elapsed: 57.817 sec - in org.apache.phoenix.iterate.RoundRobinResultIteratorIT
Tests run: 99, Failures: 0, Errors: 0, Skipped: 0, Time elapsed: 254.847 sec - in org.apache.phoenix.end2end.SpooledSortMergeJoinIT
Tests run: 99, Failures: 0, Errors: 0, Skipped: 0, Time elapsed: 326.831 sec - in org.apache.phoenix.end2end.SortMergeJoinIT
Tests run: 1, Failures: 0, Errors: 1, Skipped: 0, Time elapsed: 6,810.675 sec <<< FAILURE! - in org.apache.phoenix.end2end.GetSetByteBitFunctionEnd2EndIT
test(org.apache.phoenix.end2end.GetSetByteBitFunctionEnd2EndIT)  Time elapsed: 6,810.563 sec  <<< ERROR!
org.apache.phoenix.exception.PhoenixIOException: Only 0 of 1 regions are online; retries exhausted.
	at org.apache.phoenix.end2end.GetSetByteBitFunctionEnd2EndIT.initTable(GetSetByteBitFunctionEnd2EndIT.java:53)
Caused by: org.apache.hadoop.hbase.client.RegionOfflineException: Only 0 of 1 regions are online; retries exhausted.
	at org.apache.phoenix.end2end.GetSetByteBitFunctionEnd2EndIT.initTable(GetSetByteBitFunctionEnd2EndIT.java:53)


Results :

Failed tests: 
  DateTimeIT.testYearFunctionDate:416 expected:<2015> but was:<2016>
Tests in error: 
  GetSetByteBitFunctionEnd2EndIT.initTable:53 ยป PhoenixIO Only 0 of 1 regions ar...

Tests run: 1325, Failures: 1, Errors: 1, Skipped: 3

[INFO] 
[INFO] --- maven-failsafe-plugin:2.19:integration-test (NeedTheirOwnClusterTests) @ phoenix-core ---

-------------------------------------------------------
 T E S T S
-------------------------------------------------------
Running org.apache.hadoop.hbase.regionserver.wal.WALReplayWithIndexWritesAndUncompressedWALInHBase_094_9_IT
Running org.apache.hadoop.hbase.regionserver.wal.WALReplayWithIndexWritesAndCompressedWALIT
Running org.apache.phoenix.hbase.index.covered.EndToEndCoveredColumnsIndexBuilderIT
Tests run: 1, Failures: 0, Errors: 0, Skipped: 0, Time elapsed: 17.793 sec - in org.apache.hadoop.hbase.regionserver.wal.WALReplayWithIndexWritesAndCompressedWALIT
Tests run: 1, Failures: 0, Errors: 0, Skipped: 0, Time elapsed: 18.398 sec - in org.apache.hadoop.hbase.regionserver.wal.WALReplayWithIndexWritesAndUncompressedWALInHBase_094_9_IT
Tests run: 2, Failures: 0, Errors: 0, Skipped: 0, Time elapsed: 8.008 sec - in org.apache.phoenix.hbase.index.covered.EndToEndCoveredColumnsIndexBuilderIT
Running org.apache.phoenix.rpc.PhoenixServerRpcIT
Running org.apache.phoenix.rpc.PhoenixClientRpcIT
Running org.apache.phoenix.hbase.index.covered.example.FailWithoutRetriesIT
Tests run: 2, Failures: 0, Errors: 0, Skipped: 0, Time elapsed: 10.493 sec - in org.apache.phoenix.rpc.PhoenixClientRpcIT
Running org.apache.phoenix.hbase.index.FailForUnsupportedHBaseVersionsIT
Tests run: 1, Failures: 0, Errors: 0, Skipped: 0, Time elapsed: 8.016 sec - in org.apache.phoenix.hbase.index.covered.example.FailWithoutRetriesIT
Running org.apache.phoenix.hbase.index.covered.example.EndtoEndIndexingWithCompressionIT
Running org.apache.phoenix.hbase.index.covered.example.EndToEndCoveredIndexingIT
Running org.apache.phoenix.hbase.index.balancer.IndexLoadBalancerIT
Tests run: 2, Failures: 0, Errors: 0, Skipped: 0, Time elapsed: 21.063 sec - in org.apache.phoenix.rpc.PhoenixServerRpcIT
Tests run: 2, Failures: 0, Errors: 0, Skipped: 0, Time elapsed: 16.504 sec - in org.apache.phoenix.hbase.index.FailForUnsupportedHBaseVersionsIT
Running org.apache.phoenix.coprocessor.StatisticsCollectionRunTrackerIT
Running org.apache.phoenix.end2end.index.MutableIndexReplicationIT
Tests run: 11, Failures: 0, Errors: 0, Skipped: 0, Time elapsed: 54.833 sec - in org.apache.phoenix.hbase.index.covered.example.EndtoEndIndexingWithCompressionIT
Tests run: 4, Failures: 0, Errors: 0, Skipped: 0, Time elapsed: 33.862 sec - in org.apache.phoenix.coprocessor.StatisticsCollectionRunTrackerIT
Tests run: 1, Failures: 0, Errors: 0, Skipped: 0, Time elapsed: 20.19 sec - in org.apache.phoenix.end2end.index.MutableIndexReplicationIT
Tests run: 11, Failures: 0, Errors: 0, Skipped: 0, Time elapsed: 63.775 sec - in org.apache.phoenix.hbase.index.covered.example.EndToEndCoveredIndexingIT
Running org.apache.phoenix.end2end.index.txn.TxWriteFailureIT
Running org.apache.phoenix.end2end.index.MutableIndexFailureIT
Tests run: 8, Failures: 0, Errors: 0, Skipped: 0, Time elapsed: 42.559 sec - in org.apache.phoenix.end2end.index.txn.TxWriteFailureIT
Tests run: 9, Failures: 0, Errors: 0, Skipped: 0, Time elapsed: 131.784 sec - in org.apache.phoenix.hbase.index.balancer.IndexLoadBalancerIT
Running org.apache.phoenix.end2end.StatsCollectorWithSplitsAndMultiCFIT
Running org.apache.phoenix.end2end.TenantSpecificTablesDDLIT
Tests run: 2, Failures: 0, Errors: 0, Skipped: 0, Time elapsed: 32.696 sec - in org.apache.phoenix.end2end.StatsCollectorWithSplitsAndMultiCFIT
Running org.apache.phoenix.end2end.CountDistinctCompressionIT
Tests run: 17, Failures: 0, Errors: 0, Skipped: 0, Time elapsed: 42.84 sec - in org.apache.phoenix.end2end.TenantSpecificTablesDDLIT
Tests run: 1, Failures: 0, Errors: 0, Skipped: 0, Time elapsed: 15.751 sec - in org.apache.phoenix.end2end.CountDistinctCompressionIT
Running org.apache.phoenix.end2end.SpillableGroupByIT
Running org.apache.phoenix.end2end.UnionAllIT
Tests run: 1, Failures: 0, Errors: 0, Skipped: 0, Time elapsed: 15.661 sec - in org.apache.phoenix.end2end.SpillableGroupByIT
Running org.apache.phoenix.end2end.KeyOnlyIT
Tests run: 12, Failures: 0, Errors: 0, Skipped: 0, Time elapsed: 35.521 sec - in org.apache.phoenix.end2end.UnionAllIT
Tests run: 6, Failures: 0, Errors: 0, Skipped: 2, Time elapsed: 180.014 sec - in org.apache.phoenix.end2end.index.MutableIndexFailureIT
Tests run: 3, Failures: 0, Errors: 0, Skipped: 0, Time elapsed: 15.98 sec - in org.apache.phoenix.end2end.KeyOnlyIT
Running org.apache.phoenix.end2end.ViewIT
Running org.apache.phoenix.end2end.MultiCfQueryExecIT
Running org.apache.phoenix.end2end.ContextClassloaderIT
Tests run: 3, Failures: 0, Errors: 0, Skipped: 0, Time elapsed: 9.503 sec - in org.apache.phoenix.end2end.ContextClassloaderIT
Tests run: 8, Failures: 0, Errors: 0, Skipped: 0, Time elapsed: 25.368 sec - in org.apache.phoenix.end2end.MultiCfQueryExecIT
Running org.apache.phoenix.end2end.UserDefinedFunctionsIT
Running org.apache.phoenix.end2end.QueryWithLimitIT
Tests run: 13, Failures: 0, Errors: 0, Skipped: 0, Time elapsed: 14.92 sec - in org.apache.phoenix.end2end.UserDefinedFunctionsIT
Tests run: 2, Failures: 0, Errors: 0, Skipped: 0, Time elapsed: 21.357 sec - in org.apache.phoenix.end2end.QueryWithLimitIT
Running org.apache.phoenix.end2end.ParallelIteratorsIT
Running org.apache.phoenix.end2end.TenantSpecificTablesDMLIT
Tests run: 3, Failures: 0, Errors: 0, Skipped: 0, Time elapsed: 23.268 sec - in org.apache.phoenix.end2end.ParallelIteratorsIT
Running org.apache.phoenix.end2end.AlterTableIT
Tests run: 44, Failures: 0, Errors: 0, Skipped: 0, Time elapsed: 123.613 sec - in org.apache.phoenix.end2end.ViewIT
Running org.apache.phoenix.end2end.SaltedViewIT
Tests run: 16, Failures: 0, Errors: 0, Skipped: 0, Time elapsed: 61.01 sec - in org.apache.phoenix.end2end.TenantSpecificTablesDMLIT
Running org.apache.phoenix.end2end.QueryTimeoutIT
Tests run: 4, Failures: 0, Errors: 0, Skipped: 0, Time elapsed: 35.806 sec - in org.apache.phoenix.end2end.SaltedViewIT
Running org.apache.phoenix.end2end.ConnectionUtilIT
Tests run: 1, Failures: 0, Errors: 0, Skipped: 0, Time elapsed: 23.855 sec - in org.apache.phoenix.end2end.QueryTimeoutIT
Tests run: 1, Failures: 0, Errors: 0, Skipped: 0, Time elapsed: 18.946 sec - in org.apache.phoenix.end2end.ConnectionUtilIT
Running org.apache.phoenix.mapreduce.IndexToolIT
Running org.apache.phoenix.mapreduce.CsvBulkLoadToolIT
Tests run: 8, Failures: 0, Errors: 0, Skipped: 0, Time elapsed: 200.558 sec - in org.apache.phoenix.mapreduce.CsvBulkLoadToolIT
Tests run: 56, Failures: 0, Errors: 0, Skipped: 0, Time elapsed: 312.729 sec - in org.apache.phoenix.end2end.AlterTableIT
Running org.apache.phoenix.monitoring.PhoenixMetricsIT
Running org.apache.phoenix.execute.PartialCommitIT
Tests run: 12, Failures: 0, Errors: 0, Skipped: 0, Time elapsed: 8.168 sec - in org.apache.phoenix.execute.PartialCommitIT
Running org.apache.phoenix.iterate.RoundRobinResultIteratorWithStatsIT
Tests run: 17, Failures: 0, Errors: 0, Skipped: 0, Time elapsed: 45.053 sec - in org.apache.phoenix.monitoring.PhoenixMetricsIT
Tests run: 1, Failures: 0, Errors: 0, Skipped: 0, Time elapsed: 12.926 sec - in org.apache.phoenix.iterate.RoundRobinResultIteratorWithStatsIT
Tests run: 9, Failures: 0, Errors: 0, Skipped: 0, Time elapsed: 363.621 sec - in org.apache.phoenix.mapreduce.IndexToolIT
Running org.apache.phoenix.end2end.index.ImmutableIndexWithStatsIT
Tests run: 1, Failures: 0, Errors: 0, Skipped: 0, Time elapsed: 15.669 sec - in org.apache.phoenix.end2end.index.ImmutableIndexWithStatsIT
Running org.apache.phoenix.end2end.StatsCollectorIT
Tests run: 5, Failures: 0, Errors: 0, Skipped: 0, Time elapsed: 63.339 sec - in org.apache.phoenix.end2end.StatsCollectorIT

Results :

Tests run: 301, Failures: 0, Errors: 0, Skipped: 2

[INFO] 
[INFO] --- maven-failsafe-plugin:2.19:verify (ClientManagedTimeTests) @ phoenix-core ---
[INFO] ------------------------------------------------------------------------
[INFO] Reactor Summary:
[INFO] 
[INFO] Apache Phoenix .................................... SUCCESS [3.665s]
[INFO] Phoenix Core ...................................... FAILURE [2:34:21.721s]
[INFO] Phoenix - Flume ................................... SKIPPED
[INFO] Phoenix - Pig ..................................... SKIPPED
[INFO] Phoenix Query Server Client ....................... SKIPPED
[INFO] Phoenix Query Server .............................. SKIPPED
[INFO] Phoenix - Pherf ................................... SKIPPED
[INFO] Phoenix - Spark ................................... SKIPPED
[INFO] Phoenix Assembly .................................. SKIPPED
[INFO] Phoenix - Tracing Web Application ................. SKIPPED
[INFO] ------------------------------------------------------------------------
[INFO] BUILD FAILURE
[INFO] ------------------------------------------------------------------------
[INFO] Total time: 2:34:26.137s
[INFO] Finished at: Sat Jan 02 03:53:02 UTC 2016
[INFO] Final Memory: 47M/1181M
[INFO] ------------------------------------------------------------------------
[ERROR] Failed to execute goal org.apache.maven.plugins:maven-failsafe-plugin:2.19:verify (ClientManagedTimeTests) on project phoenix-core: There are test failures.
[ERROR] 
[ERROR] Please refer to <https://builds.apache.org/job/Phoenix-4.x-HBase-0.98/ws/phoenix-core/target/failsafe-reports> for the individual test results.
[ERROR] -> [Help 1]
[ERROR] 
[ERROR] To see the full stack trace of the errors, re-run Maven with the -e switch.
[ERROR] Re-run Maven using the -X switch to enable full debug logging.
[ERROR] 
[ERROR] For more information about the errors and possible solutions, please read the following articles:
[ERROR] [Help 1] http://cwiki.apache.org/confluence/display/MAVEN/MojoFailureException
[ERROR] 
[ERROR] After correcting the problems, you can resume the build with the command
[ERROR]   mvn <goals> -rf :phoenix-core
Build step 'Invoke top-level Maven targets' marked build as failure
Archiving artifacts
Compressed 1.08 GB of artifacts by 49.5% relative to #961
Recording test results