You are viewing a plain text version of this content. The canonical link for it is here.
Posted to common-dev@hadoop.apache.org by Apache Jenkins Server <je...@builds.apache.org> on 2016/05/04 14:34:07 UTC
Build failed in Jenkins: Hadoop-common-trunk-Java8 #1429
See <https://builds.apache.org/job/Hadoop-common-trunk-Java8/1429/changes>
Changes:
[aajisaka] HADOOP-12504. Remove metrics v1. (aajisaka)
------------------------------------------
[...truncated 5557 lines...]
Tests run: 4, Failures: 0, Errors: 0, Skipped: 0, Time elapsed: 0.58 sec - in org.apache.hadoop.io.TestDefaultStringifier
Java HotSpot(TM) 64-Bit Server VM warning: ignoring option MaxPermSize=768m; support was removed in 8.0
Running org.apache.hadoop.io.TestBloomMapFile
Tests run: 7, Failures: 0, Errors: 0, Skipped: 0, Time elapsed: 1.974 sec - in org.apache.hadoop.io.TestBloomMapFile
Java HotSpot(TM) 64-Bit Server VM warning: ignoring option MaxPermSize=768m; support was removed in 8.0
Running org.apache.hadoop.io.TestBytesWritable
Tests run: 6, Failures: 0, Errors: 0, Skipped: 0, Time elapsed: 0.31 sec - in org.apache.hadoop.io.TestBytesWritable
Java HotSpot(TM) 64-Bit Server VM warning: ignoring option MaxPermSize=768m; support was removed in 8.0
Running org.apache.hadoop.io.erasurecode.rawcoder.TestDummyRawCoder
Tests run: 3, Failures: 0, Errors: 0, Skipped: 0, Time elapsed: 0.351 sec - in org.apache.hadoop.io.erasurecode.rawcoder.TestDummyRawCoder
Java HotSpot(TM) 64-Bit Server VM warning: ignoring option MaxPermSize=768m; support was removed in 8.0
Running org.apache.hadoop.io.erasurecode.rawcoder.TestRSRawCoderLegacy
Tests run: 16, Failures: 0, Errors: 0, Skipped: 0, Time elapsed: 0.642 sec - in org.apache.hadoop.io.erasurecode.rawcoder.TestRSRawCoderLegacy
Java HotSpot(TM) 64-Bit Server VM warning: ignoring option MaxPermSize=768m; support was removed in 8.0
Running org.apache.hadoop.io.erasurecode.rawcoder.TestXORRawCoder
Tests run: 6, Failures: 0, Errors: 0, Skipped: 0, Time elapsed: 0.499 sec - in org.apache.hadoop.io.erasurecode.rawcoder.TestXORRawCoder
Java HotSpot(TM) 64-Bit Server VM warning: ignoring option MaxPermSize=768m; support was removed in 8.0
Running org.apache.hadoop.io.erasurecode.rawcoder.TestRSRawCoder
Tests run: 16, Failures: 0, Errors: 0, Skipped: 0, Time elapsed: 0.79 sec - in org.apache.hadoop.io.erasurecode.rawcoder.TestRSRawCoder
Java HotSpot(TM) 64-Bit Server VM warning: ignoring option MaxPermSize=768m; support was removed in 8.0
Running org.apache.hadoop.io.erasurecode.TestECSchema
Tests run: 1, Failures: 0, Errors: 0, Skipped: 0, Time elapsed: 0.145 sec - in org.apache.hadoop.io.erasurecode.TestECSchema
Java HotSpot(TM) 64-Bit Server VM warning: ignoring option MaxPermSize=768m; support was removed in 8.0
Running org.apache.hadoop.io.erasurecode.TestCodecRawCoderMapping
Tests run: 2, Failures: 0, Errors: 0, Skipped: 0, Time elapsed: 0.71 sec - in org.apache.hadoop.io.erasurecode.TestCodecRawCoderMapping
Java HotSpot(TM) 64-Bit Server VM warning: ignoring option MaxPermSize=768m; support was removed in 8.0
Running org.apache.hadoop.io.erasurecode.coder.TestXORCoder
Tests run: 2, Failures: 0, Errors: 0, Skipped: 0, Time elapsed: 0.749 sec - in org.apache.hadoop.io.erasurecode.coder.TestXORCoder
Java HotSpot(TM) 64-Bit Server VM warning: ignoring option MaxPermSize=768m; support was removed in 8.0
Running org.apache.hadoop.io.erasurecode.coder.TestHHXORErasureCoder
Tests run: 9, Failures: 0, Errors: 0, Skipped: 0, Time elapsed: 1.928 sec - in org.apache.hadoop.io.erasurecode.coder.TestHHXORErasureCoder
Java HotSpot(TM) 64-Bit Server VM warning: ignoring option MaxPermSize=768m; support was removed in 8.0
Running org.apache.hadoop.io.erasurecode.coder.TestRSErasureCoder
Tests run: 10, Failures: 0, Errors: 0, Skipped: 0, Time elapsed: 1.899 sec - in org.apache.hadoop.io.erasurecode.coder.TestRSErasureCoder
Java HotSpot(TM) 64-Bit Server VM warning: ignoring option MaxPermSize=768m; support was removed in 8.0
Running org.apache.hadoop.io.TestWritableUtils
Tests run: 1, Failures: 0, Errors: 0, Skipped: 0, Time elapsed: 0.246 sec - in org.apache.hadoop.io.TestWritableUtils
Java HotSpot(TM) 64-Bit Server VM warning: ignoring option MaxPermSize=768m; support was removed in 8.0
Running org.apache.hadoop.io.TestBooleanWritable
Tests run: 2, Failures: 0, Errors: 0, Skipped: 0, Time elapsed: 0.269 sec - in org.apache.hadoop.io.TestBooleanWritable
Java HotSpot(TM) 64-Bit Server VM warning: ignoring option MaxPermSize=768m; support was removed in 8.0
Running org.apache.hadoop.io.TestDataByteBuffers
Tests run: 5, Failures: 0, Errors: 0, Skipped: 0, Time elapsed: 0.582 sec - in org.apache.hadoop.io.TestDataByteBuffers
Java HotSpot(TM) 64-Bit Server VM warning: ignoring option MaxPermSize=768m; support was removed in 8.0
Running org.apache.hadoop.io.TestVersionedWritable
Tests run: 3, Failures: 0, Errors: 0, Skipped: 0, Time elapsed: 0.257 sec - in org.apache.hadoop.io.TestVersionedWritable
Java HotSpot(TM) 64-Bit Server VM warning: ignoring option MaxPermSize=768m; support was removed in 8.0
Running org.apache.hadoop.io.TestEnumSetWritable
Tests run: 6, Failures: 0, Errors: 0, Skipped: 0, Time elapsed: 0.724 sec - in org.apache.hadoop.io.TestEnumSetWritable
Java HotSpot(TM) 64-Bit Server VM warning: ignoring option MaxPermSize=768m; support was removed in 8.0
Running org.apache.hadoop.io.TestMapWritable
Tests run: 5, Failures: 0, Errors: 0, Skipped: 0, Time elapsed: 0.35 sec - in org.apache.hadoop.io.TestMapWritable
Java HotSpot(TM) 64-Bit Server VM warning: ignoring option MaxPermSize=768m; support was removed in 8.0
Running org.apache.hadoop.io.TestArrayPrimitiveWritable
Tests run: 3, Failures: 0, Errors: 0, Skipped: 0, Time elapsed: 0.256 sec - in org.apache.hadoop.io.TestArrayPrimitiveWritable
Java HotSpot(TM) 64-Bit Server VM warning: ignoring option MaxPermSize=768m; support was removed in 8.0
Running org.apache.hadoop.io.TestSetFile
Tests run: 2, Failures: 0, Errors: 0, Skipped: 0, Time elapsed: 2.615 sec - in org.apache.hadoop.io.TestSetFile
Java HotSpot(TM) 64-Bit Server VM warning: ignoring option MaxPermSize=768m; support was removed in 8.0
Running org.apache.hadoop.io.TestUTF8
Tests run: 8, Failures: 0, Errors: 0, Skipped: 0, Time elapsed: 0.766 sec - in org.apache.hadoop.io.TestUTF8
Java HotSpot(TM) 64-Bit Server VM warning: ignoring option MaxPermSize=768m; support was removed in 8.0
Running org.apache.hadoop.io.TestBoundedByteArrayOutputStream
Tests run: 2, Failures: 0, Errors: 0, Skipped: 0, Time elapsed: 0.124 sec - in org.apache.hadoop.io.TestBoundedByteArrayOutputStream
Java HotSpot(TM) 64-Bit Server VM warning: ignoring option MaxPermSize=768m; support was removed in 8.0
Running org.apache.hadoop.io.compress.TestCodecPool
Tests run: 6, Failures: 0, Errors: 0, Skipped: 0, Time elapsed: 0.641 sec - in org.apache.hadoop.io.compress.TestCodecPool
Java HotSpot(TM) 64-Bit Server VM warning: ignoring option MaxPermSize=768m; support was removed in 8.0
Running org.apache.hadoop.io.compress.lz4.TestLz4CompressorDecompressor
Tests run: 13, Failures: 0, Errors: 0, Skipped: 0, Time elapsed: 0.533 sec - in org.apache.hadoop.io.compress.lz4.TestLz4CompressorDecompressor
Java HotSpot(TM) 64-Bit Server VM warning: ignoring option MaxPermSize=768m; support was removed in 8.0
Running org.apache.hadoop.io.compress.TestBlockDecompressorStream
Tests run: 2, Failures: 0, Errors: 0, Skipped: 0, Time elapsed: 0.124 sec - in org.apache.hadoop.io.compress.TestBlockDecompressorStream
Java HotSpot(TM) 64-Bit Server VM warning: ignoring option MaxPermSize=768m; support was removed in 8.0
Running org.apache.hadoop.io.compress.TestCodec
Tests run: 25, Failures: 0, Errors: 0, Skipped: 0, Time elapsed: 121.654 sec - in org.apache.hadoop.io.compress.TestCodec
Java HotSpot(TM) 64-Bit Server VM warning: ignoring option MaxPermSize=768m; support was removed in 8.0
Running org.apache.hadoop.io.compress.TestCompressorStream
Tests run: 1, Failures: 0, Errors: 0, Skipped: 0, Time elapsed: 0.135 sec - in org.apache.hadoop.io.compress.TestCompressorStream
Java HotSpot(TM) 64-Bit Server VM warning: ignoring option MaxPermSize=768m; support was removed in 8.0
Running org.apache.hadoop.io.compress.TestCompressorDecompressor
Tests run: 2, Failures: 0, Errors: 0, Skipped: 0, Time elapsed: 0.888 sec - in org.apache.hadoop.io.compress.TestCompressorDecompressor
Java HotSpot(TM) 64-Bit Server VM warning: ignoring option MaxPermSize=768m; support was removed in 8.0
Running org.apache.hadoop.io.compress.zlib.TestZlibCompressorDecompressor
Tests run: 10, Failures: 0, Errors: 0, Skipped: 0, Time elapsed: 1.404 sec - in org.apache.hadoop.io.compress.zlib.TestZlibCompressorDecompressor
Java HotSpot(TM) 64-Bit Server VM warning: ignoring option MaxPermSize=768m; support was removed in 8.0
Running org.apache.hadoop.io.compress.TestCodecFactory
Tests run: 1, Failures: 0, Errors: 0, Skipped: 0, Time elapsed: 0.755 sec - in org.apache.hadoop.io.compress.TestCodecFactory
Java HotSpot(TM) 64-Bit Server VM warning: ignoring option MaxPermSize=768m; support was removed in 8.0
Running org.apache.hadoop.io.compress.TestCompressionStreamReuse
Tests run: 3, Failures: 0, Errors: 0, Skipped: 0, Time elapsed: 5.351 sec - in org.apache.hadoop.io.compress.TestCompressionStreamReuse
Java HotSpot(TM) 64-Bit Server VM warning: ignoring option MaxPermSize=768m; support was removed in 8.0
Running org.apache.hadoop.io.compress.snappy.TestSnappyCompressorDecompressor
Tests run: 14, Failures: 0, Errors: 0, Skipped: 0, Time elapsed: 0.61 sec - in org.apache.hadoop.io.compress.snappy.TestSnappyCompressorDecompressor
Java HotSpot(TM) 64-Bit Server VM warning: ignoring option MaxPermSize=768m; support was removed in 8.0
Running org.apache.hadoop.io.compress.bzip2.TestBzip2CompressorDecompressor
Tests run: 2, Failures: 0, Errors: 0, Skipped: 2, Time elapsed: 0.607 sec - in org.apache.hadoop.io.compress.bzip2.TestBzip2CompressorDecompressor
Java HotSpot(TM) 64-Bit Server VM warning: ignoring option MaxPermSize=768m; support was removed in 8.0
Running org.apache.hadoop.io.serializer.TestSerializationFactory
Tests run: 5, Failures: 0, Errors: 0, Skipped: 0, Time elapsed: 0.645 sec - in org.apache.hadoop.io.serializer.TestSerializationFactory
Java HotSpot(TM) 64-Bit Server VM warning: ignoring option MaxPermSize=768m; support was removed in 8.0
Running org.apache.hadoop.io.serializer.avro.TestAvroSerialization
Tests run: 5, Failures: 0, Errors: 0, Skipped: 0, Time elapsed: 0.98 sec - in org.apache.hadoop.io.serializer.avro.TestAvroSerialization
Java HotSpot(TM) 64-Bit Server VM warning: ignoring option MaxPermSize=768m; support was removed in 8.0
Running org.apache.hadoop.io.serializer.TestWritableSerialization
Tests run: 3, Failures: 0, Errors: 0, Skipped: 0, Time elapsed: 0.522 sec - in org.apache.hadoop.io.serializer.TestWritableSerialization
Java HotSpot(TM) 64-Bit Server VM warning: ignoring option MaxPermSize=768m; support was removed in 8.0
Running org.apache.hadoop.io.TestGenericWritable
Tests run: 5, Failures: 0, Errors: 0, Skipped: 0, Time elapsed: 0.699 sec - in org.apache.hadoop.io.TestGenericWritable
Java HotSpot(TM) 64-Bit Server VM warning: ignoring option MaxPermSize=768m; support was removed in 8.0
Running org.apache.hadoop.io.TestText
Tests run: 18, Failures: 0, Errors: 0, Skipped: 0, Time elapsed: 1.02 sec - in org.apache.hadoop.io.TestText
Java HotSpot(TM) 64-Bit Server VM warning: ignoring option MaxPermSize=768m; support was removed in 8.0
Running org.apache.hadoop.io.file.tfile.TestTFileNoneCodecsStreams
Tests run: 19, Failures: 0, Errors: 0, Skipped: 0, Time elapsed: 1.829 sec - in org.apache.hadoop.io.file.tfile.TestTFileNoneCodecsStreams
Java HotSpot(TM) 64-Bit Server VM warning: ignoring option MaxPermSize=768m; support was removed in 8.0
Running org.apache.hadoop.io.file.tfile.TestTFileLzoCodecsByteArrays
Tests run: 25, Failures: 0, Errors: 0, Skipped: 0, Time elapsed: 0.571 sec - in org.apache.hadoop.io.file.tfile.TestTFileLzoCodecsByteArrays
Java HotSpot(TM) 64-Bit Server VM warning: ignoring option MaxPermSize=768m; support was removed in 8.0
Running org.apache.hadoop.io.file.tfile.TestTFileSeek
Tests run: 1, Failures: 0, Errors: 0, Skipped: 0, Time elapsed: 3.281 sec - in org.apache.hadoop.io.file.tfile.TestTFileSeek
Java HotSpot(TM) 64-Bit Server VM warning: ignoring option MaxPermSize=768m; support was removed in 8.0
Running org.apache.hadoop.io.file.tfile.TestCompression
Tests run: 1, Failures: 0, Errors: 0, Skipped: 0, Time elapsed: 0.514 sec - in org.apache.hadoop.io.file.tfile.TestCompression
Java HotSpot(TM) 64-Bit Server VM warning: ignoring option MaxPermSize=768m; support was removed in 8.0
Running org.apache.hadoop.io.file.tfile.TestTFileSplit
Tests run: 1, Failures: 0, Errors: 0, Skipped: 0, Time elapsed: 4.65 sec - in org.apache.hadoop.io.file.tfile.TestTFileSplit
Java HotSpot(TM) 64-Bit Server VM warning: ignoring option MaxPermSize=768m; support was removed in 8.0
Running org.apache.hadoop.io.file.tfile.TestTFileSeqFileComparison
Tests run: 1, Failures: 0, Errors: 0, Skipped: 0, Time elapsed: 4.248 sec - in org.apache.hadoop.io.file.tfile.TestTFileSeqFileComparison
Java HotSpot(TM) 64-Bit Server VM warning: ignoring option MaxPermSize=768m; support was removed in 8.0
Running org.apache.hadoop.io.file.tfile.TestTFileByteArrays
Tests run: 25, Failures: 0, Errors: 0, Skipped: 0, Time elapsed: 2.953 sec - in org.apache.hadoop.io.file.tfile.TestTFileByteArrays
Java HotSpot(TM) 64-Bit Server VM warning: ignoring option MaxPermSize=768m; support was removed in 8.0
Running org.apache.hadoop.io.file.tfile.TestTFileComparator2
Tests run: 1, Failures: 0, Errors: 0, Skipped: 0, Time elapsed: 1.461 sec - in org.apache.hadoop.io.file.tfile.TestTFileComparator2
Java HotSpot(TM) 64-Bit Server VM warning: ignoring option MaxPermSize=768m; support was removed in 8.0
Running org.apache.hadoop.io.file.tfile.TestTFileNoneCodecsByteArrays
Tests run: 25, Failures: 0, Errors: 0, Skipped: 0, Time elapsed: 1.695 sec - in org.apache.hadoop.io.file.tfile.TestTFileNoneCodecsByteArrays
Java HotSpot(TM) 64-Bit Server VM warning: ignoring option MaxPermSize=768m; support was removed in 8.0
Running org.apache.hadoop.io.file.tfile.TestTFileNoneCodecsJClassComparatorByteArrays
Tests run: 25, Failures: 0, Errors: 0, Skipped: 0, Time elapsed: 1.859 sec - in org.apache.hadoop.io.file.tfile.TestTFileNoneCodecsJClassComparatorByteArrays
Java HotSpot(TM) 64-Bit Server VM warning: ignoring option MaxPermSize=768m; support was removed in 8.0
Running org.apache.hadoop.io.file.tfile.TestTFileJClassComparatorByteArrays
Tests run: 25, Failures: 0, Errors: 0, Skipped: 0, Time elapsed: 2.93 sec - in org.apache.hadoop.io.file.tfile.TestTFileJClassComparatorByteArrays
Java HotSpot(TM) 64-Bit Server VM warning: ignoring option MaxPermSize=768m; support was removed in 8.0
Running org.apache.hadoop.io.file.tfile.TestTFileLzoCodecsStreams
Tests run: 19, Failures: 0, Errors: 0, Skipped: 0, Time elapsed: 0.514 sec - in org.apache.hadoop.io.file.tfile.TestTFileLzoCodecsStreams
Java HotSpot(TM) 64-Bit Server VM warning: ignoring option MaxPermSize=768m; support was removed in 8.0
Running org.apache.hadoop.io.file.tfile.TestTFileComparators
Tests run: 3, Failures: 0, Errors: 0, Skipped: 0, Time elapsed: 1.042 sec - in org.apache.hadoop.io.file.tfile.TestTFileComparators
Java HotSpot(TM) 64-Bit Server VM warning: ignoring option MaxPermSize=768m; support was removed in 8.0
Running org.apache.hadoop.io.file.tfile.TestTFileStreams
Tests run: 19, Failures: 0, Errors: 0, Skipped: 0, Time elapsed: 1.977 sec - in org.apache.hadoop.io.file.tfile.TestTFileStreams
Java HotSpot(TM) 64-Bit Server VM warning: ignoring option MaxPermSize=768m; support was removed in 8.0
Running org.apache.hadoop.io.file.tfile.TestTFileUnsortedByteArrays
Tests run: 4, Failures: 0, Errors: 0, Skipped: 0, Time elapsed: 1.081 sec - in org.apache.hadoop.io.file.tfile.TestTFileUnsortedByteArrays
Java HotSpot(TM) 64-Bit Server VM warning: ignoring option MaxPermSize=768m; support was removed in 8.0
Running org.apache.hadoop.io.file.tfile.TestVLong
Tests run: 9, Failures: 0, Errors: 0, Skipped: 0, Time elapsed: 2.067 sec - in org.apache.hadoop.io.file.tfile.TestVLong
Java HotSpot(TM) 64-Bit Server VM warning: ignoring option MaxPermSize=768m; support was removed in 8.0
Running org.apache.hadoop.io.file.tfile.TestTFile
Tests run: 3, Failures: 0, Errors: 0, Skipped: 0, Time elapsed: 1.551 sec - in org.apache.hadoop.io.file.tfile.TestTFile
Java HotSpot(TM) 64-Bit Server VM warning: ignoring option MaxPermSize=768m; support was removed in 8.0
Running org.apache.hadoop.io.TestObjectWritableProtos
Tests run: 3, Failures: 0, Errors: 0, Skipped: 0, Time elapsed: 0.371 sec - in org.apache.hadoop.io.TestObjectWritableProtos
Java HotSpot(TM) 64-Bit Server VM warning: ignoring option MaxPermSize=768m; support was removed in 8.0
Running org.apache.hadoop.io.TestArrayWritable
Tests run: 4, Failures: 0, Errors: 0, Skipped: 0, Time elapsed: 0.319 sec - in org.apache.hadoop.io.TestArrayWritable
Java HotSpot(TM) 64-Bit Server VM warning: ignoring option MaxPermSize=768m; support was removed in 8.0
Running org.apache.hadoop.io.TestSequenceFileSerialization
Tests run: 1, Failures: 0, Errors: 0, Skipped: 0, Time elapsed: 1.046 sec - in org.apache.hadoop.io.TestSequenceFileSerialization
Java HotSpot(TM) 64-Bit Server VM warning: ignoring option MaxPermSize=768m; support was removed in 8.0
Running org.apache.hadoop.io.TestArrayFile
Tests run: 3, Failures: 0, Errors: 0, Skipped: 0, Time elapsed: 3.583 sec - in org.apache.hadoop.io.TestArrayFile
Results :
Tests in error:
TestZKFailoverController.testGracefulFailoverMultipleZKfcs:586 » ServiceFailed
Tests run: 3380, Failures: 0, Errors: 1, Skipped: 86
[INFO] ------------------------------------------------------------------------
[INFO] Reactor Summary:
[INFO]
[INFO] Apache Hadoop Annotations ......................... SUCCESS [ 10.715 s]
[INFO] Apache Hadoop MiniKDC ............................. SUCCESS [ 29.547 s]
[INFO] Apache Hadoop Auth ................................ SUCCESS [04:23 min]
[INFO] Apache Hadoop Auth Examples ....................... SUCCESS [ 5.402 s]
[INFO] Apache Hadoop Common .............................. FAILURE [29:55 min]
[INFO] Apache Hadoop NFS ................................. SKIPPED
[INFO] Apache Hadoop KMS ................................. SKIPPED
[INFO] Apache Hadoop Common Project ...................... SKIPPED
[INFO] ------------------------------------------------------------------------
[INFO] BUILD FAILURE
[INFO] ------------------------------------------------------------------------
[INFO] Total time: 35:06 min
[INFO] Finished at: 2016-05-04T14:34:03+00:00
[INFO] Final Memory: 62M/274M
[INFO] ------------------------------------------------------------------------
[ERROR] Failed to execute goal org.apache.maven.plugins:maven-surefire-plugin:2.17:test (default-test) on project hadoop-common: There are test failures.
[ERROR]
[ERROR] Please refer to <https://builds.apache.org/job/Hadoop-common-trunk-Java8/ws/hadoop-common-project/hadoop-common/target/surefire-reports> for the individual test results.
[ERROR] -> [Help 1]
org.apache.maven.lifecycle.LifecycleExecutionException: Failed to execute goal org.apache.maven.plugins:maven-surefire-plugin:2.17:test (default-test) on project hadoop-common: There are test failures.
Please refer to <https://builds.apache.org/job/Hadoop-common-trunk-Java8/ws/hadoop-common-project/hadoop-common/target/surefire-reports> for the individual test results.
at org.apache.maven.lifecycle.internal.MojoExecutor.execute(MojoExecutor.java:212)
at org.apache.maven.lifecycle.internal.MojoExecutor.execute(MojoExecutor.java:153)
at org.apache.maven.lifecycle.internal.MojoExecutor.execute(MojoExecutor.java:145)
at org.apache.maven.lifecycle.internal.LifecycleModuleBuilder.buildProject(LifecycleModuleBuilder.java:108)
at org.apache.maven.lifecycle.internal.LifecycleModuleBuilder.buildProject(LifecycleModuleBuilder.java:76)
at org.apache.maven.lifecycle.internal.builder.singlethreaded.SingleThreadedBuilder.build(SingleThreadedBuilder.java:51)
at org.apache.maven.lifecycle.internal.LifecycleStarter.execute(LifecycleStarter.java:116)
at org.apache.maven.DefaultMaven.doExecute(DefaultMaven.java:361)
at org.apache.maven.DefaultMaven.execute(DefaultMaven.java:155)
at org.apache.maven.cli.MavenCli.execute(MavenCli.java:584)
at org.apache.maven.cli.MavenCli.doMain(MavenCli.java:213)
at org.apache.maven.cli.MavenCli.main(MavenCli.java:157)
at sun.reflect.NativeMethodAccessorImpl.invoke0(Native Method)
at sun.reflect.NativeMethodAccessorImpl.invoke(NativeMethodAccessorImpl.java:62)
at sun.reflect.DelegatingMethodAccessorImpl.invoke(DelegatingMethodAccessorImpl.java:43)
at java.lang.reflect.Method.invoke(Method.java:483)
at org.codehaus.plexus.classworlds.launcher.Launcher.launchEnhanced(Launcher.java:289)
at org.codehaus.plexus.classworlds.launcher.Launcher.launch(Launcher.java:229)
at org.codehaus.plexus.classworlds.launcher.Launcher.mainWithExitCode(Launcher.java:415)
at org.codehaus.plexus.classworlds.launcher.Launcher.main(Launcher.java:356)
Caused by: org.apache.maven.plugin.MojoFailureException: There are test failures.
Please refer to <https://builds.apache.org/job/Hadoop-common-trunk-Java8/ws/hadoop-common-project/hadoop-common/target/surefire-reports> for the individual test results.
at org.apache.maven.plugin.surefire.SurefireHelper.reportExecution(SurefireHelper.java:82)
at org.apache.maven.plugin.surefire.SurefirePlugin.handleSummary(SurefirePlugin.java:195)
at org.apache.maven.plugin.surefire.AbstractSurefireMojo.executeAfterPreconditionsChecked(AbstractSurefireMojo.java:861)
at org.apache.maven.plugin.surefire.AbstractSurefireMojo.execute(AbstractSurefireMojo.java:729)
at org.apache.maven.plugin.DefaultBuildPluginManager.executeMojo(DefaultBuildPluginManager.java:133)
at org.apache.maven.lifecycle.internal.MojoExecutor.execute(MojoExecutor.java:208)
... 19 more
[ERROR]
[ERROR] Re-run Maven using the -X switch to enable full debug logging.
[ERROR]
[ERROR] For more information about the errors and possible solutions, please read the following articles:
[ERROR] [Help 1] http://cwiki.apache.org/confluence/display/MAVEN/MojoFailureException
[ERROR]
[ERROR] After correcting the problems, you can resume the build with the command
[ERROR] mvn <goals> -rf :hadoop-common
Build step 'Execute shell' marked build as failure
Archiving artifacts
Recording test results
---------------------------------------------------------------------
To unsubscribe, e-mail: common-dev-unsubscribe@hadoop.apache.org
For additional commands, e-mail: common-dev-help@hadoop.apache.org
Jenkins build is back to normal : Hadoop-common-trunk-Java8 #1436
Posted by Apache Jenkins Server <je...@builds.apache.org>.
See <https://builds.apache.org/job/Hadoop-common-trunk-Java8/1436/changes>
---------------------------------------------------------------------
To unsubscribe, e-mail: common-dev-unsubscribe@hadoop.apache.org
For additional commands, e-mail: common-dev-help@hadoop.apache.org
Build failed in Jenkins: Hadoop-common-trunk-Java8 #1435
Posted by Apache Jenkins Server <je...@builds.apache.org>.
See <https://builds.apache.org/job/Hadoop-common-trunk-Java8/1435/changes>
Changes:
[rkanter] MAPREDUCE-6677. LocalContainerAllocator doesn't specify resource of the
[rkanter] MAPREDUCE-6675. TestJobImpl.testUnusableNode failed (haibochen via
------------------------------------------
[...truncated 5638 lines...]
Java HotSpot(TM) 64-Bit Server VM warning: ignoring option MaxPermSize=768m; support was removed in 8.0
Running org.apache.hadoop.io.compress.bzip2.TestBzip2CompressorDecompressor
Tests run: 2, Failures: 0, Errors: 0, Skipped: 2, Time elapsed: 0.582 sec - in org.apache.hadoop.io.compress.bzip2.TestBzip2CompressorDecompressor
Java HotSpot(TM) 64-Bit Server VM warning: ignoring option MaxPermSize=768m; support was removed in 8.0
Running org.apache.hadoop.io.serializer.TestSerializationFactory
Tests run: 5, Failures: 0, Errors: 0, Skipped: 0, Time elapsed: 0.895 sec - in org.apache.hadoop.io.serializer.TestSerializationFactory
Java HotSpot(TM) 64-Bit Server VM warning: ignoring option MaxPermSize=768m; support was removed in 8.0
Running org.apache.hadoop.io.serializer.avro.TestAvroSerialization
Tests run: 5, Failures: 0, Errors: 0, Skipped: 0, Time elapsed: 0.965 sec - in org.apache.hadoop.io.serializer.avro.TestAvroSerialization
Java HotSpot(TM) 64-Bit Server VM warning: ignoring option MaxPermSize=768m; support was removed in 8.0
Running org.apache.hadoop.io.serializer.TestWritableSerialization
Tests run: 3, Failures: 0, Errors: 0, Skipped: 0, Time elapsed: 0.615 sec - in org.apache.hadoop.io.serializer.TestWritableSerialization
Java HotSpot(TM) 64-Bit Server VM warning: ignoring option MaxPermSize=768m; support was removed in 8.0
Running org.apache.hadoop.io.TestGenericWritable
Tests run: 5, Failures: 0, Errors: 0, Skipped: 0, Time elapsed: 0.722 sec - in org.apache.hadoop.io.TestGenericWritable
Java HotSpot(TM) 64-Bit Server VM warning: ignoring option MaxPermSize=768m; support was removed in 8.0
Running org.apache.hadoop.io.TestText
Tests run: 18, Failures: 0, Errors: 0, Skipped: 0, Time elapsed: 1.235 sec - in org.apache.hadoop.io.TestText
Java HotSpot(TM) 64-Bit Server VM warning: ignoring option MaxPermSize=768m; support was removed in 8.0
Running org.apache.hadoop.io.file.tfile.TestTFileNoneCodecsStreams
Tests run: 19, Failures: 0, Errors: 0, Skipped: 0, Time elapsed: 2.214 sec - in org.apache.hadoop.io.file.tfile.TestTFileNoneCodecsStreams
Java HotSpot(TM) 64-Bit Server VM warning: ignoring option MaxPermSize=768m; support was removed in 8.0
Running org.apache.hadoop.io.file.tfile.TestTFileLzoCodecsByteArrays
Tests run: 25, Failures: 0, Errors: 0, Skipped: 0, Time elapsed: 0.548 sec - in org.apache.hadoop.io.file.tfile.TestTFileLzoCodecsByteArrays
Java HotSpot(TM) 64-Bit Server VM warning: ignoring option MaxPermSize=768m; support was removed in 8.0
Running org.apache.hadoop.io.file.tfile.TestTFileSeek
Tests run: 1, Failures: 0, Errors: 0, Skipped: 0, Time elapsed: 3.615 sec - in org.apache.hadoop.io.file.tfile.TestTFileSeek
Java HotSpot(TM) 64-Bit Server VM warning: ignoring option MaxPermSize=768m; support was removed in 8.0
Running org.apache.hadoop.io.file.tfile.TestCompression
Tests run: 1, Failures: 0, Errors: 0, Skipped: 0, Time elapsed: 0.43 sec - in org.apache.hadoop.io.file.tfile.TestCompression
Java HotSpot(TM) 64-Bit Server VM warning: ignoring option MaxPermSize=768m; support was removed in 8.0
Running org.apache.hadoop.io.file.tfile.TestTFileSplit
Tests run: 1, Failures: 0, Errors: 0, Skipped: 0, Time elapsed: 5.288 sec - in org.apache.hadoop.io.file.tfile.TestTFileSplit
Java HotSpot(TM) 64-Bit Server VM warning: ignoring option MaxPermSize=768m; support was removed in 8.0
Running org.apache.hadoop.io.file.tfile.TestTFileSeqFileComparison
Tests run: 1, Failures: 0, Errors: 0, Skipped: 0, Time elapsed: 4.634 sec - in org.apache.hadoop.io.file.tfile.TestTFileSeqFileComparison
Java HotSpot(TM) 64-Bit Server VM warning: ignoring option MaxPermSize=768m; support was removed in 8.0
Running org.apache.hadoop.io.file.tfile.TestTFileByteArrays
Tests run: 25, Failures: 0, Errors: 0, Skipped: 0, Time elapsed: 2.888 sec - in org.apache.hadoop.io.file.tfile.TestTFileByteArrays
Java HotSpot(TM) 64-Bit Server VM warning: ignoring option MaxPermSize=768m; support was removed in 8.0
Running org.apache.hadoop.io.file.tfile.TestTFileComparator2
Tests run: 1, Failures: 0, Errors: 0, Skipped: 0, Time elapsed: 1.505 sec - in org.apache.hadoop.io.file.tfile.TestTFileComparator2
Java HotSpot(TM) 64-Bit Server VM warning: ignoring option MaxPermSize=768m; support was removed in 8.0
Running org.apache.hadoop.io.file.tfile.TestTFileNoneCodecsByteArrays
Tests run: 25, Failures: 0, Errors: 0, Skipped: 0, Time elapsed: 1.999 sec - in org.apache.hadoop.io.file.tfile.TestTFileNoneCodecsByteArrays
Java HotSpot(TM) 64-Bit Server VM warning: ignoring option MaxPermSize=768m; support was removed in 8.0
Running org.apache.hadoop.io.file.tfile.TestTFileNoneCodecsJClassComparatorByteArrays
Tests run: 25, Failures: 0, Errors: 0, Skipped: 0, Time elapsed: 1.662 sec - in org.apache.hadoop.io.file.tfile.TestTFileNoneCodecsJClassComparatorByteArrays
Java HotSpot(TM) 64-Bit Server VM warning: ignoring option MaxPermSize=768m; support was removed in 8.0
Running org.apache.hadoop.io.file.tfile.TestTFileJClassComparatorByteArrays
Tests run: 25, Failures: 0, Errors: 0, Skipped: 0, Time elapsed: 2.847 sec - in org.apache.hadoop.io.file.tfile.TestTFileJClassComparatorByteArrays
Java HotSpot(TM) 64-Bit Server VM warning: ignoring option MaxPermSize=768m; support was removed in 8.0
Running org.apache.hadoop.io.file.tfile.TestTFileLzoCodecsStreams
Tests run: 19, Failures: 0, Errors: 0, Skipped: 0, Time elapsed: 0.55 sec - in org.apache.hadoop.io.file.tfile.TestTFileLzoCodecsStreams
Java HotSpot(TM) 64-Bit Server VM warning: ignoring option MaxPermSize=768m; support was removed in 8.0
Running org.apache.hadoop.io.file.tfile.TestTFileComparators
Tests run: 3, Failures: 0, Errors: 0, Skipped: 0, Time elapsed: 1.099 sec - in org.apache.hadoop.io.file.tfile.TestTFileComparators
Java HotSpot(TM) 64-Bit Server VM warning: ignoring option MaxPermSize=768m; support was removed in 8.0
Running org.apache.hadoop.io.file.tfile.TestTFileStreams
Tests run: 19, Failures: 0, Errors: 0, Skipped: 0, Time elapsed: 1.937 sec - in org.apache.hadoop.io.file.tfile.TestTFileStreams
Java HotSpot(TM) 64-Bit Server VM warning: ignoring option MaxPermSize=768m; support was removed in 8.0
Running org.apache.hadoop.io.file.tfile.TestTFileUnsortedByteArrays
Tests run: 4, Failures: 0, Errors: 0, Skipped: 0, Time elapsed: 1.173 sec - in org.apache.hadoop.io.file.tfile.TestTFileUnsortedByteArrays
Java HotSpot(TM) 64-Bit Server VM warning: ignoring option MaxPermSize=768m; support was removed in 8.0
Running org.apache.hadoop.io.file.tfile.TestVLong
Tests run: 9, Failures: 0, Errors: 0, Skipped: 0, Time elapsed: 1.947 sec - in org.apache.hadoop.io.file.tfile.TestVLong
Java HotSpot(TM) 64-Bit Server VM warning: ignoring option MaxPermSize=768m; support was removed in 8.0
Running org.apache.hadoop.io.file.tfile.TestTFile
Tests run: 3, Failures: 0, Errors: 0, Skipped: 0, Time elapsed: 1.746 sec - in org.apache.hadoop.io.file.tfile.TestTFile
Java HotSpot(TM) 64-Bit Server VM warning: ignoring option MaxPermSize=768m; support was removed in 8.0
Running org.apache.hadoop.io.TestObjectWritableProtos
Tests run: 3, Failures: 0, Errors: 0, Skipped: 0, Time elapsed: 0.562 sec - in org.apache.hadoop.io.TestObjectWritableProtos
Java HotSpot(TM) 64-Bit Server VM warning: ignoring option MaxPermSize=768m; support was removed in 8.0
Running org.apache.hadoop.io.TestArrayWritable
Tests run: 4, Failures: 0, Errors: 0, Skipped: 0, Time elapsed: 0.379 sec - in org.apache.hadoop.io.TestArrayWritable
Java HotSpot(TM) 64-Bit Server VM warning: ignoring option MaxPermSize=768m; support was removed in 8.0
Running org.apache.hadoop.io.TestSequenceFileSerialization
Tests run: 1, Failures: 0, Errors: 0, Skipped: 0, Time elapsed: 1.497 sec - in org.apache.hadoop.io.TestSequenceFileSerialization
Java HotSpot(TM) 64-Bit Server VM warning: ignoring option MaxPermSize=768m; support was removed in 8.0
Running org.apache.hadoop.io.TestArrayFile
Tests run: 3, Failures: 0, Errors: 0, Skipped: 0, Time elapsed: 3.353 sec - in org.apache.hadoop.io.TestArrayFile
Results :
Tests run: 3380, Failures: 0, Errors: 0, Skipped: 86
[INFO]
[INFO] --- maven-antrun-plugin:1.7:run (common-test-bats-driver) @ hadoop-common ---
[INFO] Executing tasks
main:
[exec]
[exec]
[exec] ERROR: bats not installed. Skipping bash tests.
[exec] ERROR: Please install bats as soon as possible.
[exec]
[exec]
[INFO] Executed tasks
[INFO]
[INFO] --- hadoop-maven-plugins:3.0.0-SNAPSHOT:cmake-test (test_bulk_crc32) @ hadoop-common ---
[INFO] -------------------------------------------------------
[INFO] C M A K E B U I L D E R T E S T
[INFO] -------------------------------------------------------
[INFO] test_bulk_crc32: running <https://builds.apache.org/job/Hadoop-common-trunk-Java8/ws/hadoop-common-project/hadoop-common/target/native/test_bulk_crc32>
[INFO] with extra environment variables {}
[INFO] ------------------------------------------------------------------------
[INFO] Reactor Summary:
[INFO]
[INFO] Apache Hadoop Annotations ......................... SUCCESS [ 9.935 s]
[INFO] Apache Hadoop MiniKDC ............................. SUCCESS [ 30.700 s]
[INFO] Apache Hadoop Auth ................................ SUCCESS [04:23 min]
[INFO] Apache Hadoop Auth Examples ....................... SUCCESS [ 4.882 s]
[INFO] Apache Hadoop Common .............................. FAILURE [30:03 min]
[INFO] Apache Hadoop NFS ................................. SKIPPED
[INFO] Apache Hadoop KMS ................................. SKIPPED
[INFO] Apache Hadoop Common Project ...................... SKIPPED
[INFO] ------------------------------------------------------------------------
[INFO] BUILD FAILURE
[INFO] ------------------------------------------------------------------------
[INFO] Total time: 35:14 min
[INFO] Finished at: 2016-05-05T06:33:55+00:00
[INFO] Final Memory: 63M/354M
[INFO] ------------------------------------------------------------------------
[ERROR] Failed to execute goal org.apache.hadoop:hadoop-maven-plugins:3.0.0-SNAPSHOT:cmake-test (test_bulk_crc32) on project hadoop-common: Execution test_bulk_crc32 of goal org.apache.hadoop:hadoop-maven-plugins:3.0.0-SNAPSHOT:cmake-test failed: A required class was missing while executing org.apache.hadoop:hadoop-maven-plugins:3.0.0-SNAPSHOT:cmake-test: org/apache/hadoop/maven/plugin/cmakebuilder/TestMojo$TestThread
[ERROR] -----------------------------------------------------
[ERROR] realm = plugin>org.apache.hadoop:hadoop-maven-plugins:3.0.0-SNAPSHOT
[ERROR] strategy = org.codehaus.plexus.classworlds.strategy.SelfFirstStrategy
[ERROR] urls[0] = file:/home/jenkins/.m2/repository/org/apache/hadoop/hadoop-maven-plugins/3.0.0-SNAPSHOT/hadoop-maven-plugins-3.0.0-SNAPSHOT.jar
[ERROR] urls[1] = file:/home/jenkins/.m2/repository/org/sonatype/sisu/sisu-inject-bean/1.4.2/sisu-inject-bean-1.4.2.jar
[ERROR] urls[2] = file:/home/jenkins/.m2/repository/org/sonatype/sisu/sisu-guice/2.1.7/sisu-guice-2.1.7-noaop.jar
[ERROR] urls[3] = file:/home/jenkins/.m2/repository/org/sonatype/aether/aether-util/1.7/aether-util-1.7.jar
[ERROR] urls[4] = file:/home/jenkins/.m2/repository/org/codehaus/plexus/plexus-interpolation/1.14/plexus-interpolation-1.14.jar
[ERROR] urls[5] = file:/home/jenkins/.m2/repository/org/codehaus/plexus/plexus-utils/2.0.5/plexus-utils-2.0.5.jar
[ERROR] urls[6] = file:/home/jenkins/.m2/repository/org/codehaus/plexus/plexus-component-annotations/1.5.5/plexus-component-annotations-1.5.5.jar
[ERROR] urls[7] = file:/home/jenkins/.m2/repository/org/sonatype/plexus/plexus-sec-dispatcher/1.3/plexus-sec-dispatcher-1.3.jar
[ERROR] urls[8] = file:/home/jenkins/.m2/repository/org/sonatype/plexus/plexus-cipher/1.4/plexus-cipher-1.4.jar
[ERROR] urls[9] = file:/home/jenkins/.m2/repository/org/codehaus/jackson/jackson-core-asl/1.9.13/jackson-core-asl-1.9.13.jar
[ERROR] urls[10] = file:/home/jenkins/.m2/repository/org/codehaus/jackson/jackson-mapper-asl/1.9.13/jackson-mapper-asl-1.9.13.jar
[ERROR] Number of foreign imports: 1
[ERROR] import: Entry[import from realm ClassRealm[project>org.apache.hadoop:hadoop-common-project:3.0.0-SNAPSHOT, parent: ClassRealm[maven.api, parent: null]]]
[ERROR]
[ERROR] -----------------------------------------------------: org.apache.hadoop.maven.plugin.cmakebuilder.TestMojo$TestThread
[ERROR] -> [Help 1]
org.apache.maven.lifecycle.LifecycleExecutionException: Failed to execute goal org.apache.hadoop:hadoop-maven-plugins:3.0.0-SNAPSHOT:cmake-test (test_bulk_crc32) on project hadoop-common: Execution test_bulk_crc32 of goal org.apache.hadoop:hadoop-maven-plugins:3.0.0-SNAPSHOT:cmake-test failed: A required class was missing while executing org.apache.hadoop:hadoop-maven-plugins:3.0.0-SNAPSHOT:cmake-test: org/apache/hadoop/maven/plugin/cmakebuilder/TestMojo$TestThread
-----------------------------------------------------
realm = plugin>org.apache.hadoop:hadoop-maven-plugins:3.0.0-SNAPSHOT
strategy = org.codehaus.plexus.classworlds.strategy.SelfFirstStrategy
urls[0] = file:/home/jenkins/.m2/repository/org/apache/hadoop/hadoop-maven-plugins/3.0.0-SNAPSHOT/hadoop-maven-plugins-3.0.0-SNAPSHOT.jar
urls[1] = file:/home/jenkins/.m2/repository/org/sonatype/sisu/sisu-inject-bean/1.4.2/sisu-inject-bean-1.4.2.jar
urls[2] = file:/home/jenkins/.m2/repository/org/sonatype/sisu/sisu-guice/2.1.7/sisu-guice-2.1.7-noaop.jar
urls[3] = file:/home/jenkins/.m2/repository/org/sonatype/aether/aether-util/1.7/aether-util-1.7.jar
urls[4] = file:/home/jenkins/.m2/repository/org/codehaus/plexus/plexus-interpolation/1.14/plexus-interpolation-1.14.jar
urls[5] = file:/home/jenkins/.m2/repository/org/codehaus/plexus/plexus-utils/2.0.5/plexus-utils-2.0.5.jar
urls[6] = file:/home/jenkins/.m2/repository/org/codehaus/plexus/plexus-component-annotations/1.5.5/plexus-component-annotations-1.5.5.jar
urls[7] = file:/home/jenkins/.m2/repository/org/sonatype/plexus/plexus-sec-dispatcher/1.3/plexus-sec-dispatcher-1.3.jar
urls[8] = file:/home/jenkins/.m2/repository/org/sonatype/plexus/plexus-cipher/1.4/plexus-cipher-1.4.jar
urls[9] = file:/home/jenkins/.m2/repository/org/codehaus/jackson/jackson-core-asl/1.9.13/jackson-core-asl-1.9.13.jar
urls[10] = file:/home/jenkins/.m2/repository/org/codehaus/jackson/jackson-mapper-asl/1.9.13/jackson-mapper-asl-1.9.13.jar
Number of foreign imports: 1
import: Entry[import from realm ClassRealm[project>org.apache.hadoop:hadoop-common-project:3.0.0-SNAPSHOT, parent: ClassRealm[maven.api, parent: null]]]
-----------------------------------------------------
at org.apache.maven.lifecycle.internal.MojoExecutor.execute(MojoExecutor.java:224)
at org.apache.maven.lifecycle.internal.MojoExecutor.execute(MojoExecutor.java:153)
at org.apache.maven.lifecycle.internal.MojoExecutor.execute(MojoExecutor.java:145)
at org.apache.maven.lifecycle.internal.LifecycleModuleBuilder.buildProject(LifecycleModuleBuilder.java:108)
at org.apache.maven.lifecycle.internal.LifecycleModuleBuilder.buildProject(LifecycleModuleBuilder.java:76)
at org.apache.maven.lifecycle.internal.builder.singlethreaded.SingleThreadedBuilder.build(SingleThreadedBuilder.java:51)
at org.apache.maven.lifecycle.internal.LifecycleStarter.execute(LifecycleStarter.java:116)
at org.apache.maven.DefaultMaven.doExecute(DefaultMaven.java:361)
at org.apache.maven.DefaultMaven.execute(DefaultMaven.java:155)
at org.apache.maven.cli.MavenCli.execute(MavenCli.java:584)
at org.apache.maven.cli.MavenCli.doMain(MavenCli.java:213)
at org.apache.maven.cli.MavenCli.main(MavenCli.java:157)
at sun.reflect.NativeMethodAccessorImpl.invoke0(Native Method)
at sun.reflect.NativeMethodAccessorImpl.invoke(NativeMethodAccessorImpl.java:62)
at sun.reflect.DelegatingMethodAccessorImpl.invoke(DelegatingMethodAccessorImpl.java:43)
at java.lang.reflect.Method.invoke(Method.java:483)
at org.codehaus.plexus.classworlds.launcher.Launcher.launchEnhanced(Launcher.java:289)
at org.codehaus.plexus.classworlds.launcher.Launcher.launch(Launcher.java:229)
at org.codehaus.plexus.classworlds.launcher.Launcher.mainWithExitCode(Launcher.java:415)
at org.codehaus.plexus.classworlds.launcher.Launcher.main(Launcher.java:356)
Caused by: org.apache.maven.plugin.PluginExecutionException: Execution test_bulk_crc32 of goal org.apache.hadoop:hadoop-maven-plugins:3.0.0-SNAPSHOT:cmake-test failed: A required class was missing while executing org.apache.hadoop:hadoop-maven-plugins:3.0.0-SNAPSHOT:cmake-test: org/apache/hadoop/maven/plugin/cmakebuilder/TestMojo$TestThread
-----------------------------------------------------
realm = plugin>org.apache.hadoop:hadoop-maven-plugins:3.0.0-SNAPSHOT
strategy = org.codehaus.plexus.classworlds.strategy.SelfFirstStrategy
urls[0] = file:/home/jenkins/.m2/repository/org/apache/hadoop/hadoop-maven-plugins/3.0.0-SNAPSHOT/hadoop-maven-plugins-3.0.0-SNAPSHOT.jar
urls[1] = file:/home/jenkins/.m2/repository/org/sonatype/sisu/sisu-inject-bean/1.4.2/sisu-inject-bean-1.4.2.jar
urls[2] = file:/home/jenkins/.m2/repository/org/sonatype/sisu/sisu-guice/2.1.7/sisu-guice-2.1.7-noaop.jar
urls[3] = file:/home/jenkins/.m2/repository/org/sonatype/aether/aether-util/1.7/aether-util-1.7.jar
urls[4] = file:/home/jenkins/.m2/repository/org/codehaus/plexus/plexus-interpolation/1.14/plexus-interpolation-1.14.jar
urls[5] = file:/home/jenkins/.m2/repository/org/codehaus/plexus/plexus-utils/2.0.5/plexus-utils-2.0.5.jar
urls[6] = file:/home/jenkins/.m2/repository/org/codehaus/plexus/plexus-component-annotations/1.5.5/plexus-component-annotations-1.5.5.jar
urls[7] = file:/home/jenkins/.m2/repository/org/sonatype/plexus/plexus-sec-dispatcher/1.3/plexus-sec-dispatcher-1.3.jar
urls[8] = file:/home/jenkins/.m2/repository/org/sonatype/plexus/plexus-cipher/1.4/plexus-cipher-1.4.jar
urls[9] = file:/home/jenkins/.m2/repository/org/codehaus/jackson/jackson-core-asl/1.9.13/jackson-core-asl-1.9.13.jar
urls[10] = file:/home/jenkins/.m2/repository/org/codehaus/jackson/jackson-mapper-asl/1.9.13/jackson-mapper-asl-1.9.13.jar
Number of foreign imports: 1
import: Entry[import from realm ClassRealm[project>org.apache.hadoop:hadoop-common-project:3.0.0-SNAPSHOT, parent: ClassRealm[maven.api, parent: null]]]
-----------------------------------------------------
at org.apache.maven.plugin.DefaultBuildPluginManager.executeMojo(DefaultBuildPluginManager.java:167)
at org.apache.maven.lifecycle.internal.MojoExecutor.execute(MojoExecutor.java:208)
... 19 more
Caused by: org.apache.maven.plugin.PluginContainerException: A required class was missing while executing org.apache.hadoop:hadoop-maven-plugins:3.0.0-SNAPSHOT:cmake-test: org/apache/hadoop/maven/plugin/cmakebuilder/TestMojo$TestThread
-----------------------------------------------------
realm = plugin>org.apache.hadoop:hadoop-maven-plugins:3.0.0-SNAPSHOT
strategy = org.codehaus.plexus.classworlds.strategy.SelfFirstStrategy
urls[0] = file:/home/jenkins/.m2/repository/org/apache/hadoop/hadoop-maven-plugins/3.0.0-SNAPSHOT/hadoop-maven-plugins-3.0.0-SNAPSHOT.jar
urls[1] = file:/home/jenkins/.m2/repository/org/sonatype/sisu/sisu-inject-bean/1.4.2/sisu-inject-bean-1.4.2.jar
urls[2] = file:/home/jenkins/.m2/repository/org/sonatype/sisu/sisu-guice/2.1.7/sisu-guice-2.1.7-noaop.jar
urls[3] = file:/home/jenkins/.m2/repository/org/sonatype/aether/aether-util/1.7/aether-util-1.7.jar
urls[4] = file:/home/jenkins/.m2/repository/org/codehaus/plexus/plexus-interpolation/1.14/plexus-interpolation-1.14.jar
urls[5] = file:/home/jenkins/.m2/repository/org/codehaus/plexus/plexus-utils/2.0.5/plexus-utils-2.0.5.jar
urls[6] = file:/home/jenkins/.m2/repository/org/codehaus/plexus/plexus-component-annotations/1.5.5/plexus-component-annotations-1.5.5.jar
urls[7] = file:/home/jenkins/.m2/repository/org/sonatype/plexus/plexus-sec-dispatcher/1.3/plexus-sec-dispatcher-1.3.jar
urls[8] = file:/home/jenkins/.m2/repository/org/sonatype/plexus/plexus-cipher/1.4/plexus-cipher-1.4.jar
urls[9] = file:/home/jenkins/.m2/repository/org/codehaus/jackson/jackson-core-asl/1.9.13/jackson-core-asl-1.9.13.jar
urls[10] = file:/home/jenkins/.m2/repository/org/codehaus/jackson/jackson-mapper-asl/1.9.13/jackson-mapper-asl-1.9.13.jar
Number of foreign imports: 1
import: Entry[import from realm ClassRealm[project>org.apache.hadoop:hadoop-common-project:3.0.0-SNAPSHOT, parent: ClassRealm[maven.api, parent: null]]]
-----------------------------------------------------
at org.apache.maven.plugin.DefaultBuildPluginManager.executeMojo(DefaultBuildPluginManager.java:165)
... 20 more
Caused by: java.lang.NoClassDefFoundError: org/apache/hadoop/maven/plugin/cmakebuilder/TestMojo$TestThread
at org.apache.hadoop.maven.plugin.cmakebuilder.TestMojo.execute(TestMojo.java:334)
at org.apache.maven.plugin.DefaultBuildPluginManager.executeMojo(DefaultBuildPluginManager.java:133)
... 20 more
Caused by: java.lang.ClassNotFoundException: org.apache.hadoop.maven.plugin.cmakebuilder.TestMojo$TestThread
at org.codehaus.plexus.classworlds.strategy.SelfFirstStrategy.loadClass(SelfFirstStrategy.java:50)
at org.codehaus.plexus.classworlds.realm.ClassRealm.unsynchronizedLoadClass(ClassRealm.java:259)
at org.codehaus.plexus.classworlds.realm.ClassRealm.loadClass(ClassRealm.java:235)
at org.codehaus.plexus.classworlds.realm.ClassRealm.loadClass(ClassRealm.java:227)
... 22 more
[ERROR]
[ERROR] Re-run Maven using the -X switch to enable full debug logging.
[ERROR]
[ERROR] For more information about the errors and possible solutions, please read the following articles:
[ERROR] [Help 1] http://cwiki.apache.org/confluence/display/MAVEN/PluginContainerException
[ERROR]
[ERROR] After correcting the problems, you can resume the build with the command
[ERROR] mvn <goals> -rf :hadoop-common
Build step 'Execute shell' marked build as failure
Archiving artifacts
Recording test results
---------------------------------------------------------------------
To unsubscribe, e-mail: common-dev-unsubscribe@hadoop.apache.org
For additional commands, e-mail: common-dev-help@hadoop.apache.org
Build failed in Jenkins: Hadoop-common-trunk-Java8 #1434
Posted by Apache Jenkins Server <je...@builds.apache.org>.
See <https://builds.apache.org/job/Hadoop-common-trunk-Java8/1434/changes>
Changes:
[mingma] HDFS-10320. Rack failures may result in NN terminate. (Xiao Chen via
------------------------------------------
[...truncated 5557 lines...]
Tests run: 4, Failures: 0, Errors: 0, Skipped: 0, Time elapsed: 0.624 sec - in org.apache.hadoop.io.TestDefaultStringifier
Java HotSpot(TM) 64-Bit Server VM warning: ignoring option MaxPermSize=768m; support was removed in 8.0
Running org.apache.hadoop.io.TestBloomMapFile
Tests run: 7, Failures: 0, Errors: 0, Skipped: 0, Time elapsed: 2.288 sec - in org.apache.hadoop.io.TestBloomMapFile
Java HotSpot(TM) 64-Bit Server VM warning: ignoring option MaxPermSize=768m; support was removed in 8.0
Running org.apache.hadoop.io.TestBytesWritable
Tests run: 6, Failures: 0, Errors: 0, Skipped: 0, Time elapsed: 0.32 sec - in org.apache.hadoop.io.TestBytesWritable
Java HotSpot(TM) 64-Bit Server VM warning: ignoring option MaxPermSize=768m; support was removed in 8.0
Running org.apache.hadoop.io.erasurecode.rawcoder.TestDummyRawCoder
Tests run: 3, Failures: 0, Errors: 0, Skipped: 0, Time elapsed: 0.312 sec - in org.apache.hadoop.io.erasurecode.rawcoder.TestDummyRawCoder
Java HotSpot(TM) 64-Bit Server VM warning: ignoring option MaxPermSize=768m; support was removed in 8.0
Running org.apache.hadoop.io.erasurecode.rawcoder.TestRSRawCoderLegacy
Tests run: 16, Failures: 0, Errors: 0, Skipped: 0, Time elapsed: 0.787 sec - in org.apache.hadoop.io.erasurecode.rawcoder.TestRSRawCoderLegacy
Java HotSpot(TM) 64-Bit Server VM warning: ignoring option MaxPermSize=768m; support was removed in 8.0
Running org.apache.hadoop.io.erasurecode.rawcoder.TestXORRawCoder
Tests run: 6, Failures: 0, Errors: 0, Skipped: 0, Time elapsed: 0.539 sec - in org.apache.hadoop.io.erasurecode.rawcoder.TestXORRawCoder
Java HotSpot(TM) 64-Bit Server VM warning: ignoring option MaxPermSize=768m; support was removed in 8.0
Running org.apache.hadoop.io.erasurecode.rawcoder.TestRSRawCoder
Tests run: 16, Failures: 0, Errors: 0, Skipped: 0, Time elapsed: 0.83 sec - in org.apache.hadoop.io.erasurecode.rawcoder.TestRSRawCoder
Java HotSpot(TM) 64-Bit Server VM warning: ignoring option MaxPermSize=768m; support was removed in 8.0
Running org.apache.hadoop.io.erasurecode.TestECSchema
Tests run: 1, Failures: 0, Errors: 0, Skipped: 0, Time elapsed: 0.123 sec - in org.apache.hadoop.io.erasurecode.TestECSchema
Java HotSpot(TM) 64-Bit Server VM warning: ignoring option MaxPermSize=768m; support was removed in 8.0
Running org.apache.hadoop.io.erasurecode.TestCodecRawCoderMapping
Tests run: 2, Failures: 0, Errors: 0, Skipped: 0, Time elapsed: 0.805 sec - in org.apache.hadoop.io.erasurecode.TestCodecRawCoderMapping
Java HotSpot(TM) 64-Bit Server VM warning: ignoring option MaxPermSize=768m; support was removed in 8.0
Running org.apache.hadoop.io.erasurecode.coder.TestXORCoder
Tests run: 2, Failures: 0, Errors: 0, Skipped: 0, Time elapsed: 0.858 sec - in org.apache.hadoop.io.erasurecode.coder.TestXORCoder
Java HotSpot(TM) 64-Bit Server VM warning: ignoring option MaxPermSize=768m; support was removed in 8.0
Running org.apache.hadoop.io.erasurecode.coder.TestHHXORErasureCoder
Tests run: 9, Failures: 0, Errors: 0, Skipped: 0, Time elapsed: 2.106 sec - in org.apache.hadoop.io.erasurecode.coder.TestHHXORErasureCoder
Java HotSpot(TM) 64-Bit Server VM warning: ignoring option MaxPermSize=768m; support was removed in 8.0
Running org.apache.hadoop.io.erasurecode.coder.TestRSErasureCoder
Tests run: 10, Failures: 0, Errors: 0, Skipped: 0, Time elapsed: 2.012 sec - in org.apache.hadoop.io.erasurecode.coder.TestRSErasureCoder
Java HotSpot(TM) 64-Bit Server VM warning: ignoring option MaxPermSize=768m; support was removed in 8.0
Running org.apache.hadoop.io.TestWritableUtils
Tests run: 1, Failures: 0, Errors: 0, Skipped: 0, Time elapsed: 0.29 sec - in org.apache.hadoop.io.TestWritableUtils
Java HotSpot(TM) 64-Bit Server VM warning: ignoring option MaxPermSize=768m; support was removed in 8.0
Running org.apache.hadoop.io.TestBooleanWritable
Tests run: 2, Failures: 0, Errors: 0, Skipped: 0, Time elapsed: 0.377 sec - in org.apache.hadoop.io.TestBooleanWritable
Java HotSpot(TM) 64-Bit Server VM warning: ignoring option MaxPermSize=768m; support was removed in 8.0
Running org.apache.hadoop.io.TestDataByteBuffers
Tests run: 5, Failures: 0, Errors: 0, Skipped: 0, Time elapsed: 0.597 sec - in org.apache.hadoop.io.TestDataByteBuffers
Java HotSpot(TM) 64-Bit Server VM warning: ignoring option MaxPermSize=768m; support was removed in 8.0
Running org.apache.hadoop.io.TestVersionedWritable
Tests run: 3, Failures: 0, Errors: 0, Skipped: 0, Time elapsed: 0.313 sec - in org.apache.hadoop.io.TestVersionedWritable
Java HotSpot(TM) 64-Bit Server VM warning: ignoring option MaxPermSize=768m; support was removed in 8.0
Running org.apache.hadoop.io.TestEnumSetWritable
Tests run: 6, Failures: 0, Errors: 0, Skipped: 0, Time elapsed: 0.696 sec - in org.apache.hadoop.io.TestEnumSetWritable
Java HotSpot(TM) 64-Bit Server VM warning: ignoring option MaxPermSize=768m; support was removed in 8.0
Running org.apache.hadoop.io.TestMapWritable
Tests run: 5, Failures: 0, Errors: 0, Skipped: 0, Time elapsed: 0.296 sec - in org.apache.hadoop.io.TestMapWritable
Java HotSpot(TM) 64-Bit Server VM warning: ignoring option MaxPermSize=768m; support was removed in 8.0
Running org.apache.hadoop.io.TestArrayPrimitiveWritable
Tests run: 3, Failures: 0, Errors: 0, Skipped: 0, Time elapsed: 0.317 sec - in org.apache.hadoop.io.TestArrayPrimitiveWritable
Java HotSpot(TM) 64-Bit Server VM warning: ignoring option MaxPermSize=768m; support was removed in 8.0
Running org.apache.hadoop.io.TestSetFile
Tests run: 2, Failures: 0, Errors: 0, Skipped: 0, Time elapsed: 2.727 sec - in org.apache.hadoop.io.TestSetFile
Java HotSpot(TM) 64-Bit Server VM warning: ignoring option MaxPermSize=768m; support was removed in 8.0
Running org.apache.hadoop.io.TestUTF8
Tests run: 8, Failures: 0, Errors: 0, Skipped: 0, Time elapsed: 0.967 sec - in org.apache.hadoop.io.TestUTF8
Java HotSpot(TM) 64-Bit Server VM warning: ignoring option MaxPermSize=768m; support was removed in 8.0
Running org.apache.hadoop.io.TestBoundedByteArrayOutputStream
Tests run: 2, Failures: 0, Errors: 0, Skipped: 0, Time elapsed: 0.116 sec - in org.apache.hadoop.io.TestBoundedByteArrayOutputStream
Java HotSpot(TM) 64-Bit Server VM warning: ignoring option MaxPermSize=768m; support was removed in 8.0
Running org.apache.hadoop.io.compress.TestCodecPool
Tests run: 6, Failures: 0, Errors: 0, Skipped: 0, Time elapsed: 0.67 sec - in org.apache.hadoop.io.compress.TestCodecPool
Java HotSpot(TM) 64-Bit Server VM warning: ignoring option MaxPermSize=768m; support was removed in 8.0
Running org.apache.hadoop.io.compress.lz4.TestLz4CompressorDecompressor
Tests run: 13, Failures: 0, Errors: 0, Skipped: 0, Time elapsed: 0.541 sec - in org.apache.hadoop.io.compress.lz4.TestLz4CompressorDecompressor
Java HotSpot(TM) 64-Bit Server VM warning: ignoring option MaxPermSize=768m; support was removed in 8.0
Running org.apache.hadoop.io.compress.TestBlockDecompressorStream
Tests run: 2, Failures: 0, Errors: 0, Skipped: 0, Time elapsed: 0.168 sec - in org.apache.hadoop.io.compress.TestBlockDecompressorStream
Java HotSpot(TM) 64-Bit Server VM warning: ignoring option MaxPermSize=768m; support was removed in 8.0
Running org.apache.hadoop.io.compress.TestCodec
Tests run: 25, Failures: 0, Errors: 0, Skipped: 0, Time elapsed: 131.793 sec - in org.apache.hadoop.io.compress.TestCodec
Java HotSpot(TM) 64-Bit Server VM warning: ignoring option MaxPermSize=768m; support was removed in 8.0
Running org.apache.hadoop.io.compress.TestCompressorStream
Tests run: 1, Failures: 0, Errors: 0, Skipped: 0, Time elapsed: 0.15 sec - in org.apache.hadoop.io.compress.TestCompressorStream
Java HotSpot(TM) 64-Bit Server VM warning: ignoring option MaxPermSize=768m; support was removed in 8.0
Running org.apache.hadoop.io.compress.TestCompressorDecompressor
Tests run: 2, Failures: 0, Errors: 0, Skipped: 0, Time elapsed: 1.049 sec - in org.apache.hadoop.io.compress.TestCompressorDecompressor
Java HotSpot(TM) 64-Bit Server VM warning: ignoring option MaxPermSize=768m; support was removed in 8.0
Running org.apache.hadoop.io.compress.zlib.TestZlibCompressorDecompressor
Tests run: 10, Failures: 0, Errors: 0, Skipped: 0, Time elapsed: 1.59 sec - in org.apache.hadoop.io.compress.zlib.TestZlibCompressorDecompressor
Java HotSpot(TM) 64-Bit Server VM warning: ignoring option MaxPermSize=768m; support was removed in 8.0
Running org.apache.hadoop.io.compress.TestCodecFactory
Tests run: 1, Failures: 0, Errors: 0, Skipped: 0, Time elapsed: 0.897 sec - in org.apache.hadoop.io.compress.TestCodecFactory
Java HotSpot(TM) 64-Bit Server VM warning: ignoring option MaxPermSize=768m; support was removed in 8.0
Running org.apache.hadoop.io.compress.TestCompressionStreamReuse
Tests run: 3, Failures: 0, Errors: 0, Skipped: 0, Time elapsed: 5.601 sec - in org.apache.hadoop.io.compress.TestCompressionStreamReuse
Java HotSpot(TM) 64-Bit Server VM warning: ignoring option MaxPermSize=768m; support was removed in 8.0
Running org.apache.hadoop.io.compress.snappy.TestSnappyCompressorDecompressor
Tests run: 14, Failures: 0, Errors: 0, Skipped: 0, Time elapsed: 0.899 sec - in org.apache.hadoop.io.compress.snappy.TestSnappyCompressorDecompressor
Java HotSpot(TM) 64-Bit Server VM warning: ignoring option MaxPermSize=768m; support was removed in 8.0
Running org.apache.hadoop.io.compress.bzip2.TestBzip2CompressorDecompressor
Tests run: 2, Failures: 0, Errors: 0, Skipped: 2, Time elapsed: 0.484 sec - in org.apache.hadoop.io.compress.bzip2.TestBzip2CompressorDecompressor
Java HotSpot(TM) 64-Bit Server VM warning: ignoring option MaxPermSize=768m; support was removed in 8.0
Running org.apache.hadoop.io.serializer.TestSerializationFactory
Tests run: 5, Failures: 0, Errors: 0, Skipped: 0, Time elapsed: 0.88 sec - in org.apache.hadoop.io.serializer.TestSerializationFactory
Java HotSpot(TM) 64-Bit Server VM warning: ignoring option MaxPermSize=768m; support was removed in 8.0
Running org.apache.hadoop.io.serializer.avro.TestAvroSerialization
Tests run: 5, Failures: 0, Errors: 0, Skipped: 0, Time elapsed: 0.947 sec - in org.apache.hadoop.io.serializer.avro.TestAvroSerialization
Java HotSpot(TM) 64-Bit Server VM warning: ignoring option MaxPermSize=768m; support was removed in 8.0
Running org.apache.hadoop.io.serializer.TestWritableSerialization
Tests run: 3, Failures: 0, Errors: 0, Skipped: 0, Time elapsed: 0.534 sec - in org.apache.hadoop.io.serializer.TestWritableSerialization
Java HotSpot(TM) 64-Bit Server VM warning: ignoring option MaxPermSize=768m; support was removed in 8.0
Running org.apache.hadoop.io.TestGenericWritable
Tests run: 5, Failures: 0, Errors: 0, Skipped: 0, Time elapsed: 0.671 sec - in org.apache.hadoop.io.TestGenericWritable
Java HotSpot(TM) 64-Bit Server VM warning: ignoring option MaxPermSize=768m; support was removed in 8.0
Running org.apache.hadoop.io.TestText
Tests run: 18, Failures: 0, Errors: 0, Skipped: 0, Time elapsed: 1.075 sec - in org.apache.hadoop.io.TestText
Java HotSpot(TM) 64-Bit Server VM warning: ignoring option MaxPermSize=768m; support was removed in 8.0
Running org.apache.hadoop.io.file.tfile.TestTFileNoneCodecsStreams
Tests run: 19, Failures: 0, Errors: 0, Skipped: 0, Time elapsed: 2.142 sec - in org.apache.hadoop.io.file.tfile.TestTFileNoneCodecsStreams
Java HotSpot(TM) 64-Bit Server VM warning: ignoring option MaxPermSize=768m; support was removed in 8.0
Running org.apache.hadoop.io.file.tfile.TestTFileLzoCodecsByteArrays
Tests run: 25, Failures: 0, Errors: 0, Skipped: 0, Time elapsed: 0.519 sec - in org.apache.hadoop.io.file.tfile.TestTFileLzoCodecsByteArrays
Java HotSpot(TM) 64-Bit Server VM warning: ignoring option MaxPermSize=768m; support was removed in 8.0
Running org.apache.hadoop.io.file.tfile.TestTFileSeek
Tests run: 1, Failures: 0, Errors: 0, Skipped: 0, Time elapsed: 3.412 sec - in org.apache.hadoop.io.file.tfile.TestTFileSeek
Java HotSpot(TM) 64-Bit Server VM warning: ignoring option MaxPermSize=768m; support was removed in 8.0
Running org.apache.hadoop.io.file.tfile.TestCompression
Tests run: 1, Failures: 0, Errors: 0, Skipped: 0, Time elapsed: 0.533 sec - in org.apache.hadoop.io.file.tfile.TestCompression
Java HotSpot(TM) 64-Bit Server VM warning: ignoring option MaxPermSize=768m; support was removed in 8.0
Running org.apache.hadoop.io.file.tfile.TestTFileSplit
Tests run: 1, Failures: 0, Errors: 0, Skipped: 0, Time elapsed: 5.194 sec - in org.apache.hadoop.io.file.tfile.TestTFileSplit
Java HotSpot(TM) 64-Bit Server VM warning: ignoring option MaxPermSize=768m; support was removed in 8.0
Running org.apache.hadoop.io.file.tfile.TestTFileSeqFileComparison
Tests run: 1, Failures: 0, Errors: 0, Skipped: 0, Time elapsed: 4.439 sec - in org.apache.hadoop.io.file.tfile.TestTFileSeqFileComparison
Java HotSpot(TM) 64-Bit Server VM warning: ignoring option MaxPermSize=768m; support was removed in 8.0
Running org.apache.hadoop.io.file.tfile.TestTFileByteArrays
Tests run: 25, Failures: 0, Errors: 0, Skipped: 0, Time elapsed: 3.185 sec - in org.apache.hadoop.io.file.tfile.TestTFileByteArrays
Java HotSpot(TM) 64-Bit Server VM warning: ignoring option MaxPermSize=768m; support was removed in 8.0
Running org.apache.hadoop.io.file.tfile.TestTFileComparator2
Tests run: 1, Failures: 0, Errors: 0, Skipped: 0, Time elapsed: 1.664 sec - in org.apache.hadoop.io.file.tfile.TestTFileComparator2
Java HotSpot(TM) 64-Bit Server VM warning: ignoring option MaxPermSize=768m; support was removed in 8.0
Running org.apache.hadoop.io.file.tfile.TestTFileNoneCodecsByteArrays
Tests run: 25, Failures: 0, Errors: 0, Skipped: 0, Time elapsed: 1.991 sec - in org.apache.hadoop.io.file.tfile.TestTFileNoneCodecsByteArrays
Java HotSpot(TM) 64-Bit Server VM warning: ignoring option MaxPermSize=768m; support was removed in 8.0
Running org.apache.hadoop.io.file.tfile.TestTFileNoneCodecsJClassComparatorByteArrays
Tests run: 25, Failures: 0, Errors: 0, Skipped: 0, Time elapsed: 2.064 sec - in org.apache.hadoop.io.file.tfile.TestTFileNoneCodecsJClassComparatorByteArrays
Java HotSpot(TM) 64-Bit Server VM warning: ignoring option MaxPermSize=768m; support was removed in 8.0
Running org.apache.hadoop.io.file.tfile.TestTFileJClassComparatorByteArrays
Tests run: 25, Failures: 0, Errors: 0, Skipped: 0, Time elapsed: 2.984 sec - in org.apache.hadoop.io.file.tfile.TestTFileJClassComparatorByteArrays
Java HotSpot(TM) 64-Bit Server VM warning: ignoring option MaxPermSize=768m; support was removed in 8.0
Running org.apache.hadoop.io.file.tfile.TestTFileLzoCodecsStreams
Tests run: 19, Failures: 0, Errors: 0, Skipped: 0, Time elapsed: 0.51 sec - in org.apache.hadoop.io.file.tfile.TestTFileLzoCodecsStreams
Java HotSpot(TM) 64-Bit Server VM warning: ignoring option MaxPermSize=768m; support was removed in 8.0
Running org.apache.hadoop.io.file.tfile.TestTFileComparators
Tests run: 3, Failures: 0, Errors: 0, Skipped: 0, Time elapsed: 1.168 sec - in org.apache.hadoop.io.file.tfile.TestTFileComparators
Java HotSpot(TM) 64-Bit Server VM warning: ignoring option MaxPermSize=768m; support was removed in 8.0
Running org.apache.hadoop.io.file.tfile.TestTFileStreams
Tests run: 19, Failures: 0, Errors: 0, Skipped: 0, Time elapsed: 2.092 sec - in org.apache.hadoop.io.file.tfile.TestTFileStreams
Java HotSpot(TM) 64-Bit Server VM warning: ignoring option MaxPermSize=768m; support was removed in 8.0
Running org.apache.hadoop.io.file.tfile.TestTFileUnsortedByteArrays
Tests run: 4, Failures: 0, Errors: 0, Skipped: 0, Time elapsed: 1.167 sec - in org.apache.hadoop.io.file.tfile.TestTFileUnsortedByteArrays
Java HotSpot(TM) 64-Bit Server VM warning: ignoring option MaxPermSize=768m; support was removed in 8.0
Running org.apache.hadoop.io.file.tfile.TestVLong
Tests run: 9, Failures: 0, Errors: 0, Skipped: 0, Time elapsed: 1.908 sec - in org.apache.hadoop.io.file.tfile.TestVLong
Java HotSpot(TM) 64-Bit Server VM warning: ignoring option MaxPermSize=768m; support was removed in 8.0
Running org.apache.hadoop.io.file.tfile.TestTFile
Tests run: 3, Failures: 0, Errors: 0, Skipped: 0, Time elapsed: 1.65 sec - in org.apache.hadoop.io.file.tfile.TestTFile
Java HotSpot(TM) 64-Bit Server VM warning: ignoring option MaxPermSize=768m; support was removed in 8.0
Running org.apache.hadoop.io.TestObjectWritableProtos
Tests run: 3, Failures: 0, Errors: 0, Skipped: 0, Time elapsed: 0.51 sec - in org.apache.hadoop.io.TestObjectWritableProtos
Java HotSpot(TM) 64-Bit Server VM warning: ignoring option MaxPermSize=768m; support was removed in 8.0
Running org.apache.hadoop.io.TestArrayWritable
Tests run: 4, Failures: 0, Errors: 0, Skipped: 0, Time elapsed: 0.306 sec - in org.apache.hadoop.io.TestArrayWritable
Java HotSpot(TM) 64-Bit Server VM warning: ignoring option MaxPermSize=768m; support was removed in 8.0
Running org.apache.hadoop.io.TestSequenceFileSerialization
Tests run: 1, Failures: 0, Errors: 0, Skipped: 0, Time elapsed: 1.311 sec - in org.apache.hadoop.io.TestSequenceFileSerialization
Java HotSpot(TM) 64-Bit Server VM warning: ignoring option MaxPermSize=768m; support was removed in 8.0
Running org.apache.hadoop.io.TestArrayFile
Tests run: 3, Failures: 0, Errors: 0, Skipped: 0, Time elapsed: 3.339 sec - in org.apache.hadoop.io.TestArrayFile
Results :
Tests in error:
TestZKFailoverController.testGracefulFailoverFailBecomingStandby:510 » ServiceFailed
Tests run: 3380, Failures: 0, Errors: 1, Skipped: 86
[INFO] ------------------------------------------------------------------------
[INFO] Reactor Summary:
[INFO]
[INFO] Apache Hadoop Annotations ......................... SUCCESS [ 10.920 s]
[INFO] Apache Hadoop MiniKDC ............................. SUCCESS [ 32.524 s]
[INFO] Apache Hadoop Auth ................................ SUCCESS [04:29 min]
[INFO] Apache Hadoop Auth Examples ....................... SUCCESS [ 5.535 s]
[INFO] Apache Hadoop Common .............................. FAILURE [31:42 min]
[INFO] Apache Hadoop NFS ................................. SKIPPED
[INFO] Apache Hadoop KMS ................................. SKIPPED
[INFO] Apache Hadoop Common Project ...................... SKIPPED
[INFO] ------------------------------------------------------------------------
[INFO] BUILD FAILURE
[INFO] ------------------------------------------------------------------------
[INFO] Total time: 37:02 min
[INFO] Finished at: 2016-05-05T01:36:43+00:00
[INFO] Final Memory: 62M/354M
[INFO] ------------------------------------------------------------------------
[ERROR] Failed to execute goal org.apache.maven.plugins:maven-surefire-plugin:2.17:test (default-test) on project hadoop-common: There are test failures.
[ERROR]
[ERROR] Please refer to <https://builds.apache.org/job/Hadoop-common-trunk-Java8/ws/hadoop-common-project/hadoop-common/target/surefire-reports> for the individual test results.
[ERROR] -> [Help 1]
org.apache.maven.lifecycle.LifecycleExecutionException: Failed to execute goal org.apache.maven.plugins:maven-surefire-plugin:2.17:test (default-test) on project hadoop-common: There are test failures.
Please refer to <https://builds.apache.org/job/Hadoop-common-trunk-Java8/ws/hadoop-common-project/hadoop-common/target/surefire-reports> for the individual test results.
at org.apache.maven.lifecycle.internal.MojoExecutor.execute(MojoExecutor.java:212)
at org.apache.maven.lifecycle.internal.MojoExecutor.execute(MojoExecutor.java:153)
at org.apache.maven.lifecycle.internal.MojoExecutor.execute(MojoExecutor.java:145)
at org.apache.maven.lifecycle.internal.LifecycleModuleBuilder.buildProject(LifecycleModuleBuilder.java:108)
at org.apache.maven.lifecycle.internal.LifecycleModuleBuilder.buildProject(LifecycleModuleBuilder.java:76)
at org.apache.maven.lifecycle.internal.builder.singlethreaded.SingleThreadedBuilder.build(SingleThreadedBuilder.java:51)
at org.apache.maven.lifecycle.internal.LifecycleStarter.execute(LifecycleStarter.java:116)
at org.apache.maven.DefaultMaven.doExecute(DefaultMaven.java:361)
at org.apache.maven.DefaultMaven.execute(DefaultMaven.java:155)
at org.apache.maven.cli.MavenCli.execute(MavenCli.java:584)
at org.apache.maven.cli.MavenCli.doMain(MavenCli.java:213)
at org.apache.maven.cli.MavenCli.main(MavenCli.java:157)
at sun.reflect.NativeMethodAccessorImpl.invoke0(Native Method)
at sun.reflect.NativeMethodAccessorImpl.invoke(NativeMethodAccessorImpl.java:62)
at sun.reflect.DelegatingMethodAccessorImpl.invoke(DelegatingMethodAccessorImpl.java:43)
at java.lang.reflect.Method.invoke(Method.java:483)
at org.codehaus.plexus.classworlds.launcher.Launcher.launchEnhanced(Launcher.java:289)
at org.codehaus.plexus.classworlds.launcher.Launcher.launch(Launcher.java:229)
at org.codehaus.plexus.classworlds.launcher.Launcher.mainWithExitCode(Launcher.java:415)
at org.codehaus.plexus.classworlds.launcher.Launcher.main(Launcher.java:356)
Caused by: org.apache.maven.plugin.MojoFailureException: There are test failures.
Please refer to <https://builds.apache.org/job/Hadoop-common-trunk-Java8/ws/hadoop-common-project/hadoop-common/target/surefire-reports> for the individual test results.
at org.apache.maven.plugin.surefire.SurefireHelper.reportExecution(SurefireHelper.java:82)
at org.apache.maven.plugin.surefire.SurefirePlugin.handleSummary(SurefirePlugin.java:195)
at org.apache.maven.plugin.surefire.AbstractSurefireMojo.executeAfterPreconditionsChecked(AbstractSurefireMojo.java:861)
at org.apache.maven.plugin.surefire.AbstractSurefireMojo.execute(AbstractSurefireMojo.java:729)
at org.apache.maven.plugin.DefaultBuildPluginManager.executeMojo(DefaultBuildPluginManager.java:133)
at org.apache.maven.lifecycle.internal.MojoExecutor.execute(MojoExecutor.java:208)
... 19 more
[ERROR]
[ERROR] Re-run Maven using the -X switch to enable full debug logging.
[ERROR]
[ERROR] For more information about the errors and possible solutions, please read the following articles:
[ERROR] [Help 1] http://cwiki.apache.org/confluence/display/MAVEN/MojoFailureException
[ERROR]
[ERROR] After correcting the problems, you can resume the build with the command
[ERROR] mvn <goals> -rf :hadoop-common
Build step 'Execute shell' marked build as failure
Archiving artifacts
Recording test results
---------------------------------------------------------------------
To unsubscribe, e-mail: common-dev-unsubscribe@hadoop.apache.org
For additional commands, e-mail: common-dev-help@hadoop.apache.org
Build failed in Jenkins: Hadoop-common-trunk-Java8 #1433
Posted by Apache Jenkins Server <je...@builds.apache.org>.
See <https://builds.apache.org/job/Hadoop-common-trunk-Java8/1433/changes>
Changes:
[vinodkv] YARN-4905. Improved "yarn logs" command-line to optionally show log
------------------------------------------
[...truncated 5555 lines...]
Running org.apache.hadoop.util.TestGenericsUtil
Tests run: 6, Failures: 0, Errors: 0, Skipped: 0, Time elapsed: 0.33 sec - in org.apache.hadoop.util.TestGenericsUtil
Java HotSpot(TM) 64-Bit Server VM warning: ignoring option MaxPermSize=768m; support was removed in 8.0
Running org.apache.hadoop.util.TestChunkedArrayList
Tests run: 5, Failures: 0, Errors: 0, Skipped: 0, Time elapsed: 0.856 sec - in org.apache.hadoop.util.TestChunkedArrayList
Java HotSpot(TM) 64-Bit Server VM warning: ignoring option MaxPermSize=768m; support was removed in 8.0
Running org.apache.hadoop.util.TestVersionUtil
Tests run: 1, Failures: 0, Errors: 0, Skipped: 0, Time elapsed: 0.197 sec - in org.apache.hadoop.util.TestVersionUtil
Java HotSpot(TM) 64-Bit Server VM warning: ignoring option MaxPermSize=768m; support was removed in 8.0
Running org.apache.hadoop.util.TestProtoUtil
Tests run: 2, Failures: 0, Errors: 0, Skipped: 0, Time elapsed: 0.229 sec - in org.apache.hadoop.util.TestProtoUtil
Java HotSpot(TM) 64-Bit Server VM warning: ignoring option MaxPermSize=768m; support was removed in 8.0
Running org.apache.hadoop.util.TestLightWeightGSet
Tests run: 2, Failures: 0, Errors: 0, Skipped: 0, Time elapsed: 0.178 sec - in org.apache.hadoop.util.TestLightWeightGSet
Java HotSpot(TM) 64-Bit Server VM warning: ignoring option MaxPermSize=768m; support was removed in 8.0
Running org.apache.hadoop.util.TestGSet
Tests run: 7, Failures: 0, Errors: 0, Skipped: 0, Time elapsed: 2.007 sec - in org.apache.hadoop.util.TestGSet
Java HotSpot(TM) 64-Bit Server VM warning: ignoring option MaxPermSize=768m; support was removed in 8.0
Running org.apache.hadoop.util.TestStringInterner
Tests run: 3, Failures: 0, Errors: 0, Skipped: 0, Time elapsed: 0.096 sec - in org.apache.hadoop.util.TestStringInterner
Java HotSpot(TM) 64-Bit Server VM warning: ignoring option MaxPermSize=768m; support was removed in 8.0
Running org.apache.hadoop.util.TestZKUtil
Tests run: 9, Failures: 0, Errors: 0, Skipped: 0, Time elapsed: 0.113 sec - in org.apache.hadoop.util.TestZKUtil
Java HotSpot(TM) 64-Bit Server VM warning: ignoring option MaxPermSize=768m; support was removed in 8.0
Running org.apache.hadoop.util.TestStringUtils
Tests run: 14, Failures: 0, Errors: 0, Skipped: 0, Time elapsed: 0.289 sec - in org.apache.hadoop.util.TestStringUtils
Java HotSpot(TM) 64-Bit Server VM warning: ignoring option MaxPermSize=768m; support was removed in 8.0
Running org.apache.hadoop.util.TestFindClass
Tests run: 16, Failures: 0, Errors: 0, Skipped: 0, Time elapsed: 0.544 sec - in org.apache.hadoop.util.TestFindClass
Java HotSpot(TM) 64-Bit Server VM warning: ignoring option MaxPermSize=768m; support was removed in 8.0
Running org.apache.hadoop.util.TestGenericOptionsParser
Tests run: 7, Failures: 0, Errors: 0, Skipped: 0, Time elapsed: 0.762 sec - in org.apache.hadoop.util.TestGenericOptionsParser
Java HotSpot(TM) 64-Bit Server VM warning: ignoring option MaxPermSize=768m; support was removed in 8.0
Running org.apache.hadoop.util.TestRunJar
Tests run: 4, Failures: 0, Errors: 0, Skipped: 0, Time elapsed: 0.456 sec - in org.apache.hadoop.util.TestRunJar
Java HotSpot(TM) 64-Bit Server VM warning: ignoring option MaxPermSize=768m; support was removed in 8.0
Running org.apache.hadoop.util.TestSysInfoLinux
Tests run: 5, Failures: 0, Errors: 0, Skipped: 0, Time elapsed: 0.235 sec - in org.apache.hadoop.util.TestSysInfoLinux
Java HotSpot(TM) 64-Bit Server VM warning: ignoring option MaxPermSize=768m; support was removed in 8.0
Running org.apache.hadoop.util.TestDirectBufferPool
Tests run: 3, Failures: 0, Errors: 0, Skipped: 0, Time elapsed: 0.13 sec - in org.apache.hadoop.util.TestDirectBufferPool
Java HotSpot(TM) 64-Bit Server VM warning: ignoring option MaxPermSize=768m; support was removed in 8.0
Running org.apache.hadoop.util.TestFileBasedIPList
Tests run: 8, Failures: 0, Errors: 0, Skipped: 0, Time elapsed: 0.168 sec - in org.apache.hadoop.util.TestFileBasedIPList
Java HotSpot(TM) 64-Bit Server VM warning: ignoring option MaxPermSize=768m; support was removed in 8.0
Running org.apache.hadoop.util.TestIndexedSort
Tests run: 2, Failures: 0, Errors: 0, Skipped: 0, Time elapsed: 0.684 sec - in org.apache.hadoop.util.TestIndexedSort
Java HotSpot(TM) 64-Bit Server VM warning: ignoring option MaxPermSize=768m; support was removed in 8.0
Running org.apache.hadoop.util.TestIdentityHashStore
Tests run: 3, Failures: 0, Errors: 0, Skipped: 0, Time elapsed: 0.186 sec - in org.apache.hadoop.util.TestIdentityHashStore
Java HotSpot(TM) 64-Bit Server VM warning: ignoring option MaxPermSize=768m; support was removed in 8.0
Running org.apache.hadoop.util.TestMachineList
Tests run: 14, Failures: 0, Errors: 0, Skipped: 0, Time elapsed: 0.761 sec - in org.apache.hadoop.util.TestMachineList
Java HotSpot(TM) 64-Bit Server VM warning: ignoring option MaxPermSize=768m; support was removed in 8.0
Running org.apache.hadoop.util.TestWinUtils
Tests run: 11, Failures: 0, Errors: 0, Skipped: 11, Time elapsed: 0.209 sec - in org.apache.hadoop.util.TestWinUtils
Java HotSpot(TM) 64-Bit Server VM warning: ignoring option MaxPermSize=768m; support was removed in 8.0
Running org.apache.hadoop.util.hash.TestHash
Tests run: 1, Failures: 0, Errors: 0, Skipped: 0, Time elapsed: 0.326 sec - in org.apache.hadoop.util.hash.TestHash
Java HotSpot(TM) 64-Bit Server VM warning: ignoring option MaxPermSize=768m; support was removed in 8.0
Running org.apache.hadoop.util.TestSignalLogger
Tests run: 1, Failures: 0, Errors: 0, Skipped: 0, Time elapsed: 0.168 sec - in org.apache.hadoop.util.TestSignalLogger
Java HotSpot(TM) 64-Bit Server VM warning: ignoring option MaxPermSize=768m; support was removed in 8.0
Running org.apache.hadoop.util.TestApplicationClassLoader
Tests run: 4, Failures: 0, Errors: 0, Skipped: 0, Time elapsed: 0.226 sec - in org.apache.hadoop.util.TestApplicationClassLoader
Java HotSpot(TM) 64-Bit Server VM warning: ignoring option MaxPermSize=768m; support was removed in 8.0
Running org.apache.hadoop.util.TestNodeHealthScriptRunner
Tests run: 2, Failures: 0, Errors: 0, Skipped: 0, Time elapsed: 4.593 sec - in org.apache.hadoop.util.TestNodeHealthScriptRunner
Java HotSpot(TM) 64-Bit Server VM warning: ignoring option MaxPermSize=768m; support was removed in 8.0
Running org.apache.hadoop.util.TestCacheableIPList
Tests run: 4, Failures: 0, Errors: 0, Skipped: 0, Time elapsed: 1.269 sec - in org.apache.hadoop.util.TestCacheableIPList
Java HotSpot(TM) 64-Bit Server VM warning: ignoring option MaxPermSize=768m; support was removed in 8.0
Running org.apache.hadoop.util.TestSysInfoWindows
Tests run: 4, Failures: 0, Errors: 0, Skipped: 0, Time elapsed: 0.168 sec - in org.apache.hadoop.util.TestSysInfoWindows
Java HotSpot(TM) 64-Bit Server VM warning: ignoring option MaxPermSize=768m; support was removed in 8.0
Running org.apache.hadoop.util.TestClassUtil
Tests run: 1, Failures: 0, Errors: 0, Skipped: 0, Time elapsed: 0.082 sec - in org.apache.hadoop.util.TestClassUtil
Java HotSpot(TM) 64-Bit Server VM warning: ignoring option MaxPermSize=768m; support was removed in 8.0
Running org.apache.hadoop.util.TestOptions
Tests run: 2, Failures: 0, Errors: 0, Skipped: 0, Time elapsed: 0.077 sec - in org.apache.hadoop.util.TestOptions
Java HotSpot(TM) 64-Bit Server VM warning: ignoring option MaxPermSize=768m; support was removed in 8.0
Running org.apache.hadoop.util.TestShell
Tests run: 22, Failures: 0, Errors: 0, Skipped: 0, Time elapsed: 5.315 sec - in org.apache.hadoop.util.TestShell
Java HotSpot(TM) 64-Bit Server VM warning: ignoring option MaxPermSize=768m; support was removed in 8.0
Running org.apache.hadoop.util.TestAsyncDiskService
Tests run: 1, Failures: 0, Errors: 0, Skipped: 0, Time elapsed: 0.142 sec - in org.apache.hadoop.util.TestAsyncDiskService
Java HotSpot(TM) 64-Bit Server VM warning: ignoring option MaxPermSize=768m; support was removed in 8.0
Running org.apache.hadoop.util.TestPureJavaCrc32
Tests run: 1, Failures: 0, Errors: 0, Skipped: 0, Time elapsed: 0.582 sec - in org.apache.hadoop.util.TestPureJavaCrc32
Java HotSpot(TM) 64-Bit Server VM warning: ignoring option MaxPermSize=768m; support was removed in 8.0
Running org.apache.hadoop.util.TestDataChecksum
Tests run: 5, Failures: 0, Errors: 0, Skipped: 0, Time elapsed: 31.922 sec - in org.apache.hadoop.util.TestDataChecksum
Java HotSpot(TM) 64-Bit Server VM warning: ignoring option MaxPermSize=768m; support was removed in 8.0
Running org.apache.hadoop.util.TestShutdownThreadsHelper
Tests run: 2, Failures: 0, Errors: 0, Skipped: 0, Time elapsed: 3.175 sec - in org.apache.hadoop.util.TestShutdownThreadsHelper
Java HotSpot(TM) 64-Bit Server VM warning: ignoring option MaxPermSize=768m; support was removed in 8.0
Running org.apache.hadoop.util.TestHttpExceptionUtils
Tests run: 7, Failures: 0, Errors: 0, Skipped: 0, Time elapsed: 0.602 sec - in org.apache.hadoop.util.TestHttpExceptionUtils
Java HotSpot(TM) 64-Bit Server VM warning: ignoring option MaxPermSize=768m; support was removed in 8.0
Running org.apache.hadoop.util.TestNativeCodeLoader
Tests run: 1, Failures: 0, Errors: 0, Skipped: 0, Time elapsed: 0.159 sec - in org.apache.hadoop.util.TestNativeCodeLoader
Java HotSpot(TM) 64-Bit Server VM warning: ignoring option MaxPermSize=768m; support was removed in 8.0
Running org.apache.hadoop.util.TestReflectionUtils
Tests run: 5, Failures: 0, Errors: 0, Skipped: 0, Time elapsed: 0.448 sec - in org.apache.hadoop.util.TestReflectionUtils
Java HotSpot(TM) 64-Bit Server VM warning: ignoring option MaxPermSize=768m; support was removed in 8.0
Running org.apache.hadoop.util.TestNativeLibraryChecker
Tests run: 2, Failures: 0, Errors: 0, Skipped: 0, Time elapsed: 0.397 sec - in org.apache.hadoop.util.TestNativeLibraryChecker
Java HotSpot(TM) 64-Bit Server VM warning: ignoring option MaxPermSize=768m; support was removed in 8.0
Running org.apache.hadoop.util.TestShutdownHookManager
Tests run: 1, Failures: 0, Errors: 0, Skipped: 0, Time elapsed: 0.165 sec - in org.apache.hadoop.util.TestShutdownHookManager
Java HotSpot(TM) 64-Bit Server VM warning: ignoring option MaxPermSize=768m; support was removed in 8.0
Running org.apache.hadoop.util.TestClasspath
Tests run: 7, Failures: 0, Errors: 0, Skipped: 0, Time elapsed: 0.349 sec - in org.apache.hadoop.util.TestClasspath
Java HotSpot(TM) 64-Bit Server VM warning: ignoring option MaxPermSize=768m; support was removed in 8.0
Running org.apache.hadoop.util.TestLightWeightResizableGSet
Tests run: 2, Failures: 0, Errors: 0, Skipped: 0, Time elapsed: 0.408 sec - in org.apache.hadoop.util.TestLightWeightResizableGSet
Java HotSpot(TM) 64-Bit Server VM warning: ignoring option MaxPermSize=768m; support was removed in 8.0
Running org.apache.hadoop.util.bloom.TestBloomFilters
Tests run: 6, Failures: 0, Errors: 0, Skipped: 0, Time elapsed: 0.342 sec - in org.apache.hadoop.util.bloom.TestBloomFilters
Java HotSpot(TM) 64-Bit Server VM warning: ignoring option MaxPermSize=768m; support was removed in 8.0
Running org.apache.hadoop.util.TestConfTest
Tests run: 14, Failures: 0, Errors: 0, Skipped: 0, Time elapsed: 0.287 sec - in org.apache.hadoop.util.TestConfTest
Java HotSpot(TM) 64-Bit Server VM warning: ignoring option MaxPermSize=768m; support was removed in 8.0
Running org.apache.hadoop.util.TestStopWatch
Tests run: 3, Failures: 0, Errors: 0, Skipped: 0, Time elapsed: 0.077 sec - in org.apache.hadoop.util.TestStopWatch
Java HotSpot(TM) 64-Bit Server VM warning: ignoring option MaxPermSize=768m; support was removed in 8.0
Running org.apache.hadoop.util.TestJarFinder
Tests run: 4, Failures: 0, Errors: 0, Skipped: 0, Time elapsed: 0.75 sec - in org.apache.hadoop.util.TestJarFinder
Java HotSpot(TM) 64-Bit Server VM warning: ignoring option MaxPermSize=768m; support was removed in 8.0
Running org.apache.hadoop.util.curator.TestChildReaper
Tests run: 4, Failures: 0, Errors: 0, Skipped: 0, Time elapsed: 54.941 sec - in org.apache.hadoop.util.curator.TestChildReaper
Java HotSpot(TM) 64-Bit Server VM warning: ignoring option MaxPermSize=768m; support was removed in 8.0
Running org.apache.hadoop.util.TestLineReader
Tests run: 1, Failures: 0, Errors: 0, Skipped: 0, Time elapsed: 0.178 sec - in org.apache.hadoop.util.TestLineReader
Java HotSpot(TM) 64-Bit Server VM warning: ignoring option MaxPermSize=768m; support was removed in 8.0
Running org.apache.hadoop.util.TestNativeCrc32
Tests run: 22, Failures: 0, Errors: 0, Skipped: 0, Time elapsed: 0.603 sec - in org.apache.hadoop.util.TestNativeCrc32
Java HotSpot(TM) 64-Bit Server VM warning: ignoring option MaxPermSize=768m; support was removed in 8.0
Running org.apache.hadoop.log.TestLog4Json
Tests run: 5, Failures: 0, Errors: 0, Skipped: 0, Time elapsed: 0.395 sec - in org.apache.hadoop.log.TestLog4Json
Java HotSpot(TM) 64-Bit Server VM warning: ignoring option MaxPermSize=768m; support was removed in 8.0
Running org.apache.hadoop.log.TestLogLevel
Tests run: 1, Failures: 0, Errors: 0, Skipped: 0, Time elapsed: 0.758 sec - in org.apache.hadoop.log.TestLogLevel
Java HotSpot(TM) 64-Bit Server VM warning: ignoring option MaxPermSize=768m; support was removed in 8.0
Running org.apache.hadoop.conf.TestReconfiguration
Tests run: 9, Failures: 0, Errors: 0, Skipped: 0, Time elapsed: 2.988 sec - in org.apache.hadoop.conf.TestReconfiguration
Java HotSpot(TM) 64-Bit Server VM warning: ignoring option MaxPermSize=768m; support was removed in 8.0
Running org.apache.hadoop.conf.TestCommonConfigurationFields
Tests run: 3, Failures: 0, Errors: 0, Skipped: 0, Time elapsed: 0.402 sec - in org.apache.hadoop.conf.TestCommonConfigurationFields
Java HotSpot(TM) 64-Bit Server VM warning: ignoring option MaxPermSize=768m; support was removed in 8.0
Running org.apache.hadoop.conf.TestConfServlet
Tests run: 3, Failures: 0, Errors: 0, Skipped: 0, Time elapsed: 0.461 sec - in org.apache.hadoop.conf.TestConfServlet
Java HotSpot(TM) 64-Bit Server VM warning: ignoring option MaxPermSize=768m; support was removed in 8.0
Running org.apache.hadoop.conf.TestConfiguration
Tests run: 62, Failures: 0, Errors: 0, Skipped: 0, Time elapsed: 3.957 sec - in org.apache.hadoop.conf.TestConfiguration
Java HotSpot(TM) 64-Bit Server VM warning: ignoring option MaxPermSize=768m; support was removed in 8.0
Running org.apache.hadoop.conf.TestConfigurationSubclass
Tests run: 3, Failures: 0, Errors: 0, Skipped: 0, Time elapsed: 0.316 sec - in org.apache.hadoop.conf.TestConfigurationSubclass
Java HotSpot(TM) 64-Bit Server VM warning: ignoring option MaxPermSize=768m; support was removed in 8.0
Running org.apache.hadoop.conf.TestGetInstances
Tests run: 1, Failures: 0, Errors: 0, Skipped: 0, Time elapsed: 0.302 sec - in org.apache.hadoop.conf.TestGetInstances
Java HotSpot(TM) 64-Bit Server VM warning: ignoring option MaxPermSize=768m; support was removed in 8.0
Running org.apache.hadoop.conf.TestConfigurationDeprecation
Tests run: 9, Failures: 0, Errors: 0, Skipped: 0, Time elapsed: 8.829 sec - in org.apache.hadoop.conf.TestConfigurationDeprecation
Java HotSpot(TM) 64-Bit Server VM warning: ignoring option MaxPermSize=768m; support was removed in 8.0
Running org.apache.hadoop.conf.TestDeprecatedKeys
Tests run: 3, Failures: 0, Errors: 0, Skipped: 0, Time elapsed: 0.401 sec - in org.apache.hadoop.conf.TestDeprecatedKeys
Java HotSpot(TM) 64-Bit Server VM warning: ignoring option MaxPermSize=768m; support was removed in 8.0
Running org.apache.hadoop.tracing.TestTraceUtils
Tests run: 3, Failures: 0, Errors: 0, Skipped: 0, Time elapsed: 0.441 sec - in org.apache.hadoop.tracing.TestTraceUtils
Java HotSpot(TM) 64-Bit Server VM warning: ignoring option MaxPermSize=768m; support was removed in 8.0
Running org.apache.hadoop.cli.TestCLI
Tests run: 1, Failures: 0, Errors: 0, Skipped: 0, Time elapsed: 0.551 sec - in org.apache.hadoop.cli.TestCLI
Results :
Failed tests:
TestDNS.testLookupWithoutHostsFallback:231
Expected: is "-DUMMY_HOSTNAME"
but: was "localhost"
Tests run: 3380, Failures: 1, Errors: 0, Skipped: 86
[INFO] ------------------------------------------------------------------------
[INFO] Reactor Summary:
[INFO]
[INFO] Apache Hadoop Annotations ......................... SUCCESS [ 5.668 s]
[INFO] Apache Hadoop MiniKDC ............................. SUCCESS [ 19.463 s]
[INFO] Apache Hadoop Auth ................................ SUCCESS [03:41 min]
[INFO] Apache Hadoop Auth Examples ....................... SUCCESS [ 3.376 s]
[INFO] Apache Hadoop Common .............................. FAILURE [22:47 min]
[INFO] Apache Hadoop NFS ................................. SKIPPED
[INFO] Apache Hadoop KMS ................................. SKIPPED
[INFO] Apache Hadoop Common Project ...................... SKIPPED
[INFO] ------------------------------------------------------------------------
[INFO] BUILD FAILURE
[INFO] ------------------------------------------------------------------------
[INFO] Total time: 26:58 min
[INFO] Finished at: 2016-05-04T22:41:56+00:00
[INFO] Final Memory: 62M/298M
[INFO] ------------------------------------------------------------------------
[ERROR] Failed to execute goal org.apache.maven.plugins:maven-surefire-plugin:2.17:test (default-test) on project hadoop-common: There are test failures.
[ERROR]
[ERROR] Please refer to <https://builds.apache.org/job/Hadoop-common-trunk-Java8/ws/hadoop-common-project/hadoop-common/target/surefire-reports> for the individual test results.
[ERROR] -> [Help 1]
org.apache.maven.lifecycle.LifecycleExecutionException: Failed to execute goal org.apache.maven.plugins:maven-surefire-plugin:2.17:test (default-test) on project hadoop-common: There are test failures.
Please refer to <https://builds.apache.org/job/Hadoop-common-trunk-Java8/ws/hadoop-common-project/hadoop-common/target/surefire-reports> for the individual test results.
at org.apache.maven.lifecycle.internal.MojoExecutor.execute(MojoExecutor.java:212)
at org.apache.maven.lifecycle.internal.MojoExecutor.execute(MojoExecutor.java:153)
at org.apache.maven.lifecycle.internal.MojoExecutor.execute(MojoExecutor.java:145)
at org.apache.maven.lifecycle.internal.LifecycleModuleBuilder.buildProject(LifecycleModuleBuilder.java:108)
at org.apache.maven.lifecycle.internal.LifecycleModuleBuilder.buildProject(LifecycleModuleBuilder.java:76)
at org.apache.maven.lifecycle.internal.builder.singlethreaded.SingleThreadedBuilder.build(SingleThreadedBuilder.java:51)
at org.apache.maven.lifecycle.internal.LifecycleStarter.execute(LifecycleStarter.java:116)
at org.apache.maven.DefaultMaven.doExecute(DefaultMaven.java:361)
at org.apache.maven.DefaultMaven.execute(DefaultMaven.java:155)
at org.apache.maven.cli.MavenCli.execute(MavenCli.java:584)
at org.apache.maven.cli.MavenCli.doMain(MavenCli.java:213)
at org.apache.maven.cli.MavenCli.main(MavenCli.java:157)
at sun.reflect.NativeMethodAccessorImpl.invoke0(Native Method)
at sun.reflect.NativeMethodAccessorImpl.invoke(NativeMethodAccessorImpl.java:62)
at sun.reflect.DelegatingMethodAccessorImpl.invoke(DelegatingMethodAccessorImpl.java:43)
at java.lang.reflect.Method.invoke(Method.java:483)
at org.codehaus.plexus.classworlds.launcher.Launcher.launchEnhanced(Launcher.java:289)
at org.codehaus.plexus.classworlds.launcher.Launcher.launch(Launcher.java:229)
at org.codehaus.plexus.classworlds.launcher.Launcher.mainWithExitCode(Launcher.java:415)
at org.codehaus.plexus.classworlds.launcher.Launcher.main(Launcher.java:356)
Caused by: org.apache.maven.plugin.MojoFailureException: There are test failures.
Please refer to <https://builds.apache.org/job/Hadoop-common-trunk-Java8/ws/hadoop-common-project/hadoop-common/target/surefire-reports> for the individual test results.
at org.apache.maven.plugin.surefire.SurefireHelper.reportExecution(SurefireHelper.java:82)
at org.apache.maven.plugin.surefire.SurefirePlugin.handleSummary(SurefirePlugin.java:195)
at org.apache.maven.plugin.surefire.AbstractSurefireMojo.executeAfterPreconditionsChecked(AbstractSurefireMojo.java:861)
at org.apache.maven.plugin.surefire.AbstractSurefireMojo.execute(AbstractSurefireMojo.java:729)
at org.apache.maven.plugin.DefaultBuildPluginManager.executeMojo(DefaultBuildPluginManager.java:133)
at org.apache.maven.lifecycle.internal.MojoExecutor.execute(MojoExecutor.java:208)
... 19 more
[ERROR]
[ERROR] Re-run Maven using the -X switch to enable full debug logging.
[ERROR]
[ERROR] For more information about the errors and possible solutions, please read the following articles:
[ERROR] [Help 1] http://cwiki.apache.org/confluence/display/MAVEN/MojoFailureException
[ERROR]
[ERROR] After correcting the problems, you can resume the build with the command
[ERROR] mvn <goals> -rf :hadoop-common
Build step 'Execute shell' marked build as failure
Archiving artifacts
Recording test results
---------------------------------------------------------------------
To unsubscribe, e-mail: common-dev-unsubscribe@hadoop.apache.org
For additional commands, e-mail: common-dev-help@hadoop.apache.org
Build failed in Jenkins: Hadoop-common-trunk-Java8 #1432
Posted by Apache Jenkins Server <je...@builds.apache.org>.
See <https://builds.apache.org/job/Hadoop-common-trunk-Java8/1432/changes>
Changes:
[wangda] YARN-4984. LogAggregationService shouldn't swallow exception in handling
------------------------------------------
[...truncated 5555 lines...]
Running org.apache.hadoop.util.TestNativeLibraryChecker
Tests run: 2, Failures: 0, Errors: 0, Skipped: 0, Time elapsed: 0.497 sec - in org.apache.hadoop.util.TestNativeLibraryChecker
Java HotSpot(TM) 64-Bit Server VM warning: ignoring option MaxPermSize=768m; support was removed in 8.0
Running org.apache.hadoop.util.TestProtoUtil
Tests run: 2, Failures: 0, Errors: 0, Skipped: 0, Time elapsed: 0.268 sec - in org.apache.hadoop.util.TestProtoUtil
Java HotSpot(TM) 64-Bit Server VM warning: ignoring option MaxPermSize=768m; support was removed in 8.0
Running org.apache.hadoop.util.TestStringUtils
Tests run: 14, Failures: 0, Errors: 0, Skipped: 0, Time elapsed: 0.312 sec - in org.apache.hadoop.util.TestStringUtils
Java HotSpot(TM) 64-Bit Server VM warning: ignoring option MaxPermSize=768m; support was removed in 8.0
Running org.apache.hadoop.util.TestSignalLogger
Tests run: 1, Failures: 0, Errors: 0, Skipped: 0, Time elapsed: 0.189 sec - in org.apache.hadoop.util.TestSignalLogger
Java HotSpot(TM) 64-Bit Server VM warning: ignoring option MaxPermSize=768m; support was removed in 8.0
Running org.apache.hadoop.util.TestStringInterner
Tests run: 3, Failures: 0, Errors: 0, Skipped: 0, Time elapsed: 0.138 sec - in org.apache.hadoop.util.TestStringInterner
Java HotSpot(TM) 64-Bit Server VM warning: ignoring option MaxPermSize=768m; support was removed in 8.0
Running org.apache.hadoop.util.TestRunJar
Tests run: 4, Failures: 0, Errors: 0, Skipped: 0, Time elapsed: 0.496 sec - in org.apache.hadoop.util.TestRunJar
Java HotSpot(TM) 64-Bit Server VM warning: ignoring option MaxPermSize=768m; support was removed in 8.0
Running org.apache.hadoop.util.TestProgress
Tests run: 1, Failures: 0, Errors: 0, Skipped: 0, Time elapsed: 0.169 sec - in org.apache.hadoop.util.TestProgress
Java HotSpot(TM) 64-Bit Server VM warning: ignoring option MaxPermSize=768m; support was removed in 8.0
Running org.apache.hadoop.util.TestReflectionUtils
Tests run: 5, Failures: 0, Errors: 0, Skipped: 0, Time elapsed: 0.552 sec - in org.apache.hadoop.util.TestReflectionUtils
Java HotSpot(TM) 64-Bit Server VM warning: ignoring option MaxPermSize=768m; support was removed in 8.0
Running org.apache.hadoop.util.TestVersionUtil
Tests run: 1, Failures: 0, Errors: 0, Skipped: 0, Time elapsed: 0.194 sec - in org.apache.hadoop.util.TestVersionUtil
Java HotSpot(TM) 64-Bit Server VM warning: ignoring option MaxPermSize=768m; support was removed in 8.0
Running org.apache.hadoop.util.TestWinUtils
Tests run: 11, Failures: 0, Errors: 0, Skipped: 11, Time elapsed: 0.249 sec - in org.apache.hadoop.util.TestWinUtils
Java HotSpot(TM) 64-Bit Server VM warning: ignoring option MaxPermSize=768m; support was removed in 8.0
Running org.apache.hadoop.util.TestIndexedSort
Tests run: 2, Failures: 0, Errors: 0, Skipped: 0, Time elapsed: 0.896 sec - in org.apache.hadoop.util.TestIndexedSort
Java HotSpot(TM) 64-Bit Server VM warning: ignoring option MaxPermSize=768m; support was removed in 8.0
Running org.apache.hadoop.util.TestGSet
Tests run: 7, Failures: 0, Errors: 0, Skipped: 0, Time elapsed: 2.126 sec - in org.apache.hadoop.util.TestGSet
Java HotSpot(TM) 64-Bit Server VM warning: ignoring option MaxPermSize=768m; support was removed in 8.0
Running org.apache.hadoop.util.TestHttpExceptionUtils
Tests run: 7, Failures: 0, Errors: 0, Skipped: 0, Time elapsed: 0.715 sec - in org.apache.hadoop.util.TestHttpExceptionUtils
Java HotSpot(TM) 64-Bit Server VM warning: ignoring option MaxPermSize=768m; support was removed in 8.0
Running org.apache.hadoop.util.TestAsyncDiskService
Tests run: 1, Failures: 0, Errors: 0, Skipped: 0, Time elapsed: 0.169 sec - in org.apache.hadoop.util.TestAsyncDiskService
Java HotSpot(TM) 64-Bit Server VM warning: ignoring option MaxPermSize=768m; support was removed in 8.0
Running org.apache.hadoop.util.TestNodeHealthScriptRunner
Tests run: 2, Failures: 0, Errors: 0, Skipped: 0, Time elapsed: 4.824 sec - in org.apache.hadoop.util.TestNodeHealthScriptRunner
Java HotSpot(TM) 64-Bit Server VM warning: ignoring option MaxPermSize=768m; support was removed in 8.0
Running org.apache.hadoop.util.bloom.TestBloomFilters
Tests run: 6, Failures: 0, Errors: 0, Skipped: 0, Time elapsed: 0.76 sec - in org.apache.hadoop.util.bloom.TestBloomFilters
Java HotSpot(TM) 64-Bit Server VM warning: ignoring option MaxPermSize=768m; support was removed in 8.0
Running org.apache.hadoop.util.TestShutdownHookManager
Tests run: 1, Failures: 0, Errors: 0, Skipped: 0, Time elapsed: 0.182 sec - in org.apache.hadoop.util.TestShutdownHookManager
Java HotSpot(TM) 64-Bit Server VM warning: ignoring option MaxPermSize=768m; support was removed in 8.0
Running org.apache.hadoop.util.TestStopWatch
Tests run: 3, Failures: 0, Errors: 0, Skipped: 0, Time elapsed: 0.066 sec - in org.apache.hadoop.util.TestStopWatch
Java HotSpot(TM) 64-Bit Server VM warning: ignoring option MaxPermSize=768m; support was removed in 8.0
Running org.apache.hadoop.util.curator.TestChildReaper
Tests run: 4, Failures: 0, Errors: 0, Skipped: 0, Time elapsed: 54.757 sec - in org.apache.hadoop.util.curator.TestChildReaper
Java HotSpot(TM) 64-Bit Server VM warning: ignoring option MaxPermSize=768m; support was removed in 8.0
Running org.apache.hadoop.util.TestIdentityHashStore
Tests run: 3, Failures: 0, Errors: 0, Skipped: 0, Time elapsed: 0.176 sec - in org.apache.hadoop.util.TestIdentityHashStore
Java HotSpot(TM) 64-Bit Server VM warning: ignoring option MaxPermSize=768m; support was removed in 8.0
Running org.apache.hadoop.util.TestLightWeightCache
Tests run: 1, Failures: 0, Errors: 0, Skipped: 0, Time elapsed: 13.256 sec - in org.apache.hadoop.util.TestLightWeightCache
Java HotSpot(TM) 64-Bit Server VM warning: ignoring option MaxPermSize=768m; support was removed in 8.0
Running org.apache.hadoop.util.TestSysInfoWindows
Tests run: 4, Failures: 0, Errors: 0, Skipped: 0, Time elapsed: 0.15 sec - in org.apache.hadoop.util.TestSysInfoWindows
Java HotSpot(TM) 64-Bit Server VM warning: ignoring option MaxPermSize=768m; support was removed in 8.0
Running org.apache.hadoop.util.TestDataChecksum
Tests run: 5, Failures: 0, Errors: 0, Skipped: 0, Time elapsed: 34.728 sec - in org.apache.hadoop.util.TestDataChecksum
Java HotSpot(TM) 64-Bit Server VM warning: ignoring option MaxPermSize=768m; support was removed in 8.0
Running org.apache.hadoop.util.TestLightWeightResizableGSet
Tests run: 2, Failures: 0, Errors: 0, Skipped: 0, Time elapsed: 0.449 sec - in org.apache.hadoop.util.TestLightWeightResizableGSet
Java HotSpot(TM) 64-Bit Server VM warning: ignoring option MaxPermSize=768m; support was removed in 8.0
Running org.apache.hadoop.util.TestLineReader
Tests run: 1, Failures: 0, Errors: 0, Skipped: 0, Time elapsed: 0.185 sec - in org.apache.hadoop.util.TestLineReader
Java HotSpot(TM) 64-Bit Server VM warning: ignoring option MaxPermSize=768m; support was removed in 8.0
Running org.apache.hadoop.util.TestFindClass
Tests run: 16, Failures: 0, Errors: 0, Skipped: 0, Time elapsed: 0.617 sec - in org.apache.hadoop.util.TestFindClass
Java HotSpot(TM) 64-Bit Server VM warning: ignoring option MaxPermSize=768m; support was removed in 8.0
Running org.apache.hadoop.util.TestClasspath
Tests run: 7, Failures: 0, Errors: 0, Skipped: 0, Time elapsed: 0.378 sec - in org.apache.hadoop.util.TestClasspath
Java HotSpot(TM) 64-Bit Server VM warning: ignoring option MaxPermSize=768m; support was removed in 8.0
Running org.apache.hadoop.util.TestCacheableIPList
Tests run: 4, Failures: 0, Errors: 0, Skipped: 0, Time elapsed: 1.327 sec - in org.apache.hadoop.util.TestCacheableIPList
Java HotSpot(TM) 64-Bit Server VM warning: ignoring option MaxPermSize=768m; support was removed in 8.0
Running org.apache.hadoop.util.TestZKUtil
Tests run: 9, Failures: 0, Errors: 0, Skipped: 0, Time elapsed: 0.131 sec - in org.apache.hadoop.util.TestZKUtil
Java HotSpot(TM) 64-Bit Server VM warning: ignoring option MaxPermSize=768m; support was removed in 8.0
Running org.apache.hadoop.util.TestOptions
Tests run: 2, Failures: 0, Errors: 0, Skipped: 0, Time elapsed: 0.067 sec - in org.apache.hadoop.util.TestOptions
Java HotSpot(TM) 64-Bit Server VM warning: ignoring option MaxPermSize=768m; support was removed in 8.0
Running org.apache.hadoop.util.TestShell
Tests run: 22, Failures: 0, Errors: 0, Skipped: 0, Time elapsed: 5.325 sec - in org.apache.hadoop.util.TestShell
Java HotSpot(TM) 64-Bit Server VM warning: ignoring option MaxPermSize=768m; support was removed in 8.0
Running org.apache.hadoop.util.TestGenericsUtil
Tests run: 6, Failures: 0, Errors: 0, Skipped: 0, Time elapsed: 0.318 sec - in org.apache.hadoop.util.TestGenericsUtil
Java HotSpot(TM) 64-Bit Server VM warning: ignoring option MaxPermSize=768m; support was removed in 8.0
Running org.apache.hadoop.util.TestDiskChecker
Tests run: 15, Failures: 0, Errors: 0, Skipped: 0, Time elapsed: 0.983 sec - in org.apache.hadoop.util.TestDiskChecker
Java HotSpot(TM) 64-Bit Server VM warning: ignoring option MaxPermSize=768m; support was removed in 8.0
Running org.apache.hadoop.util.TestClassUtil
Tests run: 1, Failures: 0, Errors: 0, Skipped: 0, Time elapsed: 0.079 sec - in org.apache.hadoop.util.TestClassUtil
Java HotSpot(TM) 64-Bit Server VM warning: ignoring option MaxPermSize=768m; support was removed in 8.0
Running org.apache.hadoop.util.TestNativeCodeLoader
Tests run: 1, Failures: 0, Errors: 0, Skipped: 0, Time elapsed: 0.164 sec - in org.apache.hadoop.util.TestNativeCodeLoader
Java HotSpot(TM) 64-Bit Server VM warning: ignoring option MaxPermSize=768m; support was removed in 8.0
Running org.apache.hadoop.util.TestJarFinder
Tests run: 4, Failures: 0, Errors: 0, Skipped: 0, Time elapsed: 0.801 sec - in org.apache.hadoop.util.TestJarFinder
Java HotSpot(TM) 64-Bit Server VM warning: ignoring option MaxPermSize=768m; support was removed in 8.0
Running org.apache.hadoop.util.TestNativeCrc32
Tests run: 22, Failures: 0, Errors: 0, Skipped: 0, Time elapsed: 0.58 sec - in org.apache.hadoop.util.TestNativeCrc32
Java HotSpot(TM) 64-Bit Server VM warning: ignoring option MaxPermSize=768m; support was removed in 8.0
Running org.apache.hadoop.util.TestChunkedArrayList
Tests run: 5, Failures: 0, Errors: 0, Skipped: 0, Time elapsed: 0.586 sec - in org.apache.hadoop.util.TestChunkedArrayList
Java HotSpot(TM) 64-Bit Server VM warning: ignoring option MaxPermSize=768m; support was removed in 8.0
Running org.apache.hadoop.util.TestMachineList
Tests run: 14, Failures: 0, Errors: 0, Skipped: 0, Time elapsed: 0.825 sec - in org.apache.hadoop.util.TestMachineList
Java HotSpot(TM) 64-Bit Server VM warning: ignoring option MaxPermSize=768m; support was removed in 8.0
Running org.apache.hadoop.util.TestShutdownThreadsHelper
Tests run: 2, Failures: 0, Errors: 0, Skipped: 0, Time elapsed: 3.179 sec - in org.apache.hadoop.util.TestShutdownThreadsHelper
Java HotSpot(TM) 64-Bit Server VM warning: ignoring option MaxPermSize=768m; support was removed in 8.0
Running org.apache.hadoop.util.TestConfTest
Tests run: 14, Failures: 0, Errors: 0, Skipped: 0, Time elapsed: 0.206 sec - in org.apache.hadoop.util.TestConfTest
Java HotSpot(TM) 64-Bit Server VM warning: ignoring option MaxPermSize=768m; support was removed in 8.0
Running org.apache.hadoop.util.TestApplicationClassLoader
Tests run: 4, Failures: 0, Errors: 0, Skipped: 0, Time elapsed: 0.258 sec - in org.apache.hadoop.util.TestApplicationClassLoader
Java HotSpot(TM) 64-Bit Server VM warning: ignoring option MaxPermSize=768m; support was removed in 8.0
Running org.apache.hadoop.util.TestFileBasedIPList
Tests run: 8, Failures: 0, Errors: 0, Skipped: 0, Time elapsed: 0.179 sec - in org.apache.hadoop.util.TestFileBasedIPList
Java HotSpot(TM) 64-Bit Server VM warning: ignoring option MaxPermSize=768m; support was removed in 8.0
Running org.apache.hadoop.util.TestGenericOptionsParser
Tests run: 7, Failures: 0, Errors: 0, Skipped: 0, Time elapsed: 0.826 sec - in org.apache.hadoop.util.TestGenericOptionsParser
Java HotSpot(TM) 64-Bit Server VM warning: ignoring option MaxPermSize=768m; support was removed in 8.0
Running org.apache.hadoop.http.TestGlobalFilter
Tests run: 1, Failures: 0, Errors: 0, Skipped: 0, Time elapsed: 0.914 sec - in org.apache.hadoop.http.TestGlobalFilter
Java HotSpot(TM) 64-Bit Server VM warning: ignoring option MaxPermSize=768m; support was removed in 8.0
Running org.apache.hadoop.http.TestPathFilter
Tests run: 1, Failures: 0, Errors: 0, Skipped: 0, Time elapsed: 0.869 sec - in org.apache.hadoop.http.TestPathFilter
Java HotSpot(TM) 64-Bit Server VM warning: ignoring option MaxPermSize=768m; support was removed in 8.0
Running org.apache.hadoop.http.TestHttpCookieFlag
Tests run: 2, Failures: 0, Errors: 0, Skipped: 0, Time elapsed: 1.421 sec - in org.apache.hadoop.http.TestHttpCookieFlag
Java HotSpot(TM) 64-Bit Server VM warning: ignoring option MaxPermSize=768m; support was removed in 8.0
Running org.apache.hadoop.http.TestHttpServerLogs
Tests run: 2, Failures: 0, Errors: 0, Skipped: 0, Time elapsed: 0.923 sec - in org.apache.hadoop.http.TestHttpServerLogs
Java HotSpot(TM) 64-Bit Server VM warning: ignoring option MaxPermSize=768m; support was removed in 8.0
Running org.apache.hadoop.http.TestServletFilter
Tests run: 3, Failures: 0, Errors: 0, Skipped: 0, Time elapsed: 1.28 sec - in org.apache.hadoop.http.TestServletFilter
Java HotSpot(TM) 64-Bit Server VM warning: ignoring option MaxPermSize=768m; support was removed in 8.0
Running org.apache.hadoop.http.TestHttpRequestLogAppender
Tests run: 1, Failures: 0, Errors: 0, Skipped: 0, Time elapsed: 0.089 sec - in org.apache.hadoop.http.TestHttpRequestLogAppender
Java HotSpot(TM) 64-Bit Server VM warning: ignoring option MaxPermSize=768m; support was removed in 8.0
Running org.apache.hadoop.http.TestHttpServerLifecycle
Tests run: 7, Failures: 0, Errors: 0, Skipped: 0, Time elapsed: 1.358 sec - in org.apache.hadoop.http.TestHttpServerLifecycle
Java HotSpot(TM) 64-Bit Server VM warning: ignoring option MaxPermSize=768m; support was removed in 8.0
Running org.apache.hadoop.http.TestAuthenticationSessionCookie
Tests run: 2, Failures: 0, Errors: 0, Skipped: 0, Time elapsed: 1.777 sec - in org.apache.hadoop.http.TestAuthenticationSessionCookie
Java HotSpot(TM) 64-Bit Server VM warning: ignoring option MaxPermSize=768m; support was removed in 8.0
Running org.apache.hadoop.http.TestSSLHttpServer
Tests run: 5, Failures: 0, Errors: 0, Skipped: 0, Time elapsed: 1.444 sec - in org.apache.hadoop.http.TestSSLHttpServer
Java HotSpot(TM) 64-Bit Server VM warning: ignoring option MaxPermSize=768m; support was removed in 8.0
Running org.apache.hadoop.http.lib.TestStaticUserWebFilter
Tests run: 3, Failures: 0, Errors: 0, Skipped: 0, Time elapsed: 0.521 sec - in org.apache.hadoop.http.lib.TestStaticUserWebFilter
Java HotSpot(TM) 64-Bit Server VM warning: ignoring option MaxPermSize=768m; support was removed in 8.0
Running org.apache.hadoop.http.TestHttpRequestLog
Tests run: 2, Failures: 0, Errors: 0, Skipped: 0, Time elapsed: 0.191 sec - in org.apache.hadoop.http.TestHttpRequestLog
Java HotSpot(TM) 64-Bit Server VM warning: ignoring option MaxPermSize=768m; support was removed in 8.0
Running org.apache.hadoop.http.TestHtmlQuoting
Tests run: 4, Failures: 0, Errors: 0, Skipped: 0, Time elapsed: 0.315 sec - in org.apache.hadoop.http.TestHtmlQuoting
Java HotSpot(TM) 64-Bit Server VM warning: ignoring option MaxPermSize=768m; support was removed in 8.0
Running org.apache.hadoop.http.TestHttpServerWebapps
Tests run: 2, Failures: 0, Errors: 0, Skipped: 0, Time elapsed: 0.517 sec - in org.apache.hadoop.http.TestHttpServerWebapps
Java HotSpot(TM) 64-Bit Server VM warning: ignoring option MaxPermSize=768m; support was removed in 8.0
Running org.apache.hadoop.http.TestHttpServer
Tests run: 15, Failures: 0, Errors: 0, Skipped: 0, Time elapsed: 3.008 sec - in org.apache.hadoop.http.TestHttpServer
Results :
Failed tests:
TestDNS.testDefaultDnsServer:134
Expected: is "localhost"
but: was "asf905.gq1.ygridcore.net"
Tests run: 3380, Failures: 1, Errors: 0, Skipped: 86
[INFO] ------------------------------------------------------------------------
[INFO] Reactor Summary:
[INFO]
[INFO] Apache Hadoop Annotations ......................... SUCCESS [ 5.907 s]
[INFO] Apache Hadoop MiniKDC ............................. SUCCESS [01:40 min]
[INFO] Apache Hadoop Auth ................................ SUCCESS [12:46 min]
[INFO] Apache Hadoop Auth Examples ....................... SUCCESS [ 3.078 s]
[INFO] Apache Hadoop Common .............................. FAILURE [24:05 min]
[INFO] Apache Hadoop NFS ................................. SKIPPED
[INFO] Apache Hadoop KMS ................................. SKIPPED
[INFO] Apache Hadoop Common Project ...................... SKIPPED
[INFO] ------------------------------------------------------------------------
[INFO] BUILD FAILURE
[INFO] ------------------------------------------------------------------------
[INFO] Total time: 38:43 min
[INFO] Finished at: 2016-05-04T20:06:19+00:00
[INFO] Final Memory: 62M/336M
[INFO] ------------------------------------------------------------------------
[ERROR] Failed to execute goal org.apache.maven.plugins:maven-surefire-plugin:2.17:test (default-test) on project hadoop-common: There are test failures.
[ERROR]
[ERROR] Please refer to <https://builds.apache.org/job/Hadoop-common-trunk-Java8/ws/hadoop-common-project/hadoop-common/target/surefire-reports> for the individual test results.
[ERROR] -> [Help 1]
org.apache.maven.lifecycle.LifecycleExecutionException: Failed to execute goal org.apache.maven.plugins:maven-surefire-plugin:2.17:test (default-test) on project hadoop-common: There are test failures.
Please refer to <https://builds.apache.org/job/Hadoop-common-trunk-Java8/ws/hadoop-common-project/hadoop-common/target/surefire-reports> for the individual test results.
at org.apache.maven.lifecycle.internal.MojoExecutor.execute(MojoExecutor.java:212)
at org.apache.maven.lifecycle.internal.MojoExecutor.execute(MojoExecutor.java:153)
at org.apache.maven.lifecycle.internal.MojoExecutor.execute(MojoExecutor.java:145)
at org.apache.maven.lifecycle.internal.LifecycleModuleBuilder.buildProject(LifecycleModuleBuilder.java:108)
at org.apache.maven.lifecycle.internal.LifecycleModuleBuilder.buildProject(LifecycleModuleBuilder.java:76)
at org.apache.maven.lifecycle.internal.builder.singlethreaded.SingleThreadedBuilder.build(SingleThreadedBuilder.java:51)
at org.apache.maven.lifecycle.internal.LifecycleStarter.execute(LifecycleStarter.java:116)
at org.apache.maven.DefaultMaven.doExecute(DefaultMaven.java:361)
at org.apache.maven.DefaultMaven.execute(DefaultMaven.java:155)
at org.apache.maven.cli.MavenCli.execute(MavenCli.java:584)
at org.apache.maven.cli.MavenCli.doMain(MavenCli.java:213)
at org.apache.maven.cli.MavenCli.main(MavenCli.java:157)
at sun.reflect.NativeMethodAccessorImpl.invoke0(Native Method)
at sun.reflect.NativeMethodAccessorImpl.invoke(NativeMethodAccessorImpl.java:62)
at sun.reflect.DelegatingMethodAccessorImpl.invoke(DelegatingMethodAccessorImpl.java:43)
at java.lang.reflect.Method.invoke(Method.java:483)
at org.codehaus.plexus.classworlds.launcher.Launcher.launchEnhanced(Launcher.java:289)
at org.codehaus.plexus.classworlds.launcher.Launcher.launch(Launcher.java:229)
at org.codehaus.plexus.classworlds.launcher.Launcher.mainWithExitCode(Launcher.java:415)
at org.codehaus.plexus.classworlds.launcher.Launcher.main(Launcher.java:356)
Caused by: org.apache.maven.plugin.MojoFailureException: There are test failures.
Please refer to <https://builds.apache.org/job/Hadoop-common-trunk-Java8/ws/hadoop-common-project/hadoop-common/target/surefire-reports> for the individual test results.
at org.apache.maven.plugin.surefire.SurefireHelper.reportExecution(SurefireHelper.java:82)
at org.apache.maven.plugin.surefire.SurefirePlugin.handleSummary(SurefirePlugin.java:195)
at org.apache.maven.plugin.surefire.AbstractSurefireMojo.executeAfterPreconditionsChecked(AbstractSurefireMojo.java:861)
at org.apache.maven.plugin.surefire.AbstractSurefireMojo.execute(AbstractSurefireMojo.java:729)
at org.apache.maven.plugin.DefaultBuildPluginManager.executeMojo(DefaultBuildPluginManager.java:133)
at org.apache.maven.lifecycle.internal.MojoExecutor.execute(MojoExecutor.java:208)
... 19 more
[ERROR]
[ERROR] Re-run Maven using the -X switch to enable full debug logging.
[ERROR]
[ERROR] For more information about the errors and possible solutions, please read the following articles:
[ERROR] [Help 1] http://cwiki.apache.org/confluence/display/MAVEN/MojoFailureException
[ERROR]
[ERROR] After correcting the problems, you can resume the build with the command
[ERROR] mvn <goals> -rf :hadoop-common
Build step 'Execute shell' marked build as failure
Archiving artifacts
Recording test results
---------------------------------------------------------------------
To unsubscribe, e-mail: common-dev-unsubscribe@hadoop.apache.org
For additional commands, e-mail: common-dev-help@hadoop.apache.org
Build failed in Jenkins: Hadoop-common-trunk-Java8 #1431
Posted by Apache Jenkins Server <je...@builds.apache.org>.
See <https://builds.apache.org/job/Hadoop-common-trunk-Java8/1431/changes>
Changes:
[jing9] HADOOP-12469. distcp should not ignore the ignoreFailures option.
[junping_du] YARN-4920. ATS/NM should support a link to dowload/get the logs in text
------------------------------------------
[...truncated 5555 lines...]
Running org.apache.hadoop.util.TestNativeLibraryChecker
Tests run: 2, Failures: 0, Errors: 0, Skipped: 0, Time elapsed: 0.385 sec - in org.apache.hadoop.util.TestNativeLibraryChecker
Java HotSpot(TM) 64-Bit Server VM warning: ignoring option MaxPermSize=768m; support was removed in 8.0
Running org.apache.hadoop.util.TestProtoUtil
Tests run: 2, Failures: 0, Errors: 0, Skipped: 0, Time elapsed: 0.244 sec - in org.apache.hadoop.util.TestProtoUtil
Java HotSpot(TM) 64-Bit Server VM warning: ignoring option MaxPermSize=768m; support was removed in 8.0
Running org.apache.hadoop.util.TestStringUtils
Tests run: 14, Failures: 0, Errors: 0, Skipped: 0, Time elapsed: 0.31 sec - in org.apache.hadoop.util.TestStringUtils
Java HotSpot(TM) 64-Bit Server VM warning: ignoring option MaxPermSize=768m; support was removed in 8.0
Running org.apache.hadoop.util.TestSignalLogger
Tests run: 1, Failures: 0, Errors: 0, Skipped: 0, Time elapsed: 0.173 sec - in org.apache.hadoop.util.TestSignalLogger
Java HotSpot(TM) 64-Bit Server VM warning: ignoring option MaxPermSize=768m; support was removed in 8.0
Running org.apache.hadoop.util.TestStringInterner
Tests run: 3, Failures: 0, Errors: 0, Skipped: 0, Time elapsed: 0.114 sec - in org.apache.hadoop.util.TestStringInterner
Java HotSpot(TM) 64-Bit Server VM warning: ignoring option MaxPermSize=768m; support was removed in 8.0
Running org.apache.hadoop.util.TestRunJar
Tests run: 4, Failures: 0, Errors: 0, Skipped: 0, Time elapsed: 0.447 sec - in org.apache.hadoop.util.TestRunJar
Java HotSpot(TM) 64-Bit Server VM warning: ignoring option MaxPermSize=768m; support was removed in 8.0
Running org.apache.hadoop.util.TestProgress
Tests run: 1, Failures: 0, Errors: 0, Skipped: 0, Time elapsed: 0.172 sec - in org.apache.hadoop.util.TestProgress
Java HotSpot(TM) 64-Bit Server VM warning: ignoring option MaxPermSize=768m; support was removed in 8.0
Running org.apache.hadoop.util.TestReflectionUtils
Tests run: 5, Failures: 0, Errors: 0, Skipped: 0, Time elapsed: 0.438 sec - in org.apache.hadoop.util.TestReflectionUtils
Java HotSpot(TM) 64-Bit Server VM warning: ignoring option MaxPermSize=768m; support was removed in 8.0
Running org.apache.hadoop.util.TestVersionUtil
Tests run: 1, Failures: 0, Errors: 0, Skipped: 0, Time elapsed: 0.166 sec - in org.apache.hadoop.util.TestVersionUtil
Java HotSpot(TM) 64-Bit Server VM warning: ignoring option MaxPermSize=768m; support was removed in 8.0
Running org.apache.hadoop.util.TestWinUtils
Tests run: 11, Failures: 0, Errors: 0, Skipped: 11, Time elapsed: 0.212 sec - in org.apache.hadoop.util.TestWinUtils
Java HotSpot(TM) 64-Bit Server VM warning: ignoring option MaxPermSize=768m; support was removed in 8.0
Running org.apache.hadoop.util.TestIndexedSort
Tests run: 2, Failures: 0, Errors: 0, Skipped: 0, Time elapsed: 0.693 sec - in org.apache.hadoop.util.TestIndexedSort
Java HotSpot(TM) 64-Bit Server VM warning: ignoring option MaxPermSize=768m; support was removed in 8.0
Running org.apache.hadoop.util.TestGSet
Tests run: 7, Failures: 0, Errors: 0, Skipped: 0, Time elapsed: 1.632 sec - in org.apache.hadoop.util.TestGSet
Java HotSpot(TM) 64-Bit Server VM warning: ignoring option MaxPermSize=768m; support was removed in 8.0
Running org.apache.hadoop.util.TestHttpExceptionUtils
Tests run: 7, Failures: 0, Errors: 0, Skipped: 0, Time elapsed: 0.594 sec - in org.apache.hadoop.util.TestHttpExceptionUtils
Java HotSpot(TM) 64-Bit Server VM warning: ignoring option MaxPermSize=768m; support was removed in 8.0
Running org.apache.hadoop.util.TestAsyncDiskService
Tests run: 1, Failures: 0, Errors: 0, Skipped: 0, Time elapsed: 0.139 sec - in org.apache.hadoop.util.TestAsyncDiskService
Java HotSpot(TM) 64-Bit Server VM warning: ignoring option MaxPermSize=768m; support was removed in 8.0
Running org.apache.hadoop.util.TestNodeHealthScriptRunner
Tests run: 2, Failures: 0, Errors: 0, Skipped: 0, Time elapsed: 4.627 sec - in org.apache.hadoop.util.TestNodeHealthScriptRunner
Java HotSpot(TM) 64-Bit Server VM warning: ignoring option MaxPermSize=768m; support was removed in 8.0
Running org.apache.hadoop.util.bloom.TestBloomFilters
Tests run: 6, Failures: 0, Errors: 0, Skipped: 0, Time elapsed: 0.341 sec - in org.apache.hadoop.util.bloom.TestBloomFilters
Java HotSpot(TM) 64-Bit Server VM warning: ignoring option MaxPermSize=768m; support was removed in 8.0
Running org.apache.hadoop.util.TestShutdownHookManager
Tests run: 1, Failures: 0, Errors: 0, Skipped: 0, Time elapsed: 0.181 sec - in org.apache.hadoop.util.TestShutdownHookManager
Java HotSpot(TM) 64-Bit Server VM warning: ignoring option MaxPermSize=768m; support was removed in 8.0
Running org.apache.hadoop.util.TestStopWatch
Tests run: 3, Failures: 0, Errors: 0, Skipped: 0, Time elapsed: 0.07 sec - in org.apache.hadoop.util.TestStopWatch
Java HotSpot(TM) 64-Bit Server VM warning: ignoring option MaxPermSize=768m; support was removed in 8.0
Running org.apache.hadoop.util.curator.TestChildReaper
Tests run: 4, Failures: 0, Errors: 0, Skipped: 0, Time elapsed: 54.732 sec - in org.apache.hadoop.util.curator.TestChildReaper
Java HotSpot(TM) 64-Bit Server VM warning: ignoring option MaxPermSize=768m; support was removed in 8.0
Running org.apache.hadoop.util.TestIdentityHashStore
Tests run: 3, Failures: 0, Errors: 0, Skipped: 0, Time elapsed: 0.181 sec - in org.apache.hadoop.util.TestIdentityHashStore
Java HotSpot(TM) 64-Bit Server VM warning: ignoring option MaxPermSize=768m; support was removed in 8.0
Running org.apache.hadoop.util.TestLightWeightCache
Tests run: 1, Failures: 0, Errors: 0, Skipped: 0, Time elapsed: 11.878 sec - in org.apache.hadoop.util.TestLightWeightCache
Java HotSpot(TM) 64-Bit Server VM warning: ignoring option MaxPermSize=768m; support was removed in 8.0
Running org.apache.hadoop.util.TestSysInfoWindows
Tests run: 4, Failures: 0, Errors: 0, Skipped: 0, Time elapsed: 0.175 sec - in org.apache.hadoop.util.TestSysInfoWindows
Java HotSpot(TM) 64-Bit Server VM warning: ignoring option MaxPermSize=768m; support was removed in 8.0
Running org.apache.hadoop.util.TestDataChecksum
Tests run: 5, Failures: 0, Errors: 0, Skipped: 0, Time elapsed: 34.795 sec - in org.apache.hadoop.util.TestDataChecksum
Java HotSpot(TM) 64-Bit Server VM warning: ignoring option MaxPermSize=768m; support was removed in 8.0
Running org.apache.hadoop.util.TestLightWeightResizableGSet
Tests run: 2, Failures: 0, Errors: 0, Skipped: 0, Time elapsed: 0.371 sec - in org.apache.hadoop.util.TestLightWeightResizableGSet
Java HotSpot(TM) 64-Bit Server VM warning: ignoring option MaxPermSize=768m; support was removed in 8.0
Running org.apache.hadoop.util.TestLineReader
Tests run: 1, Failures: 0, Errors: 0, Skipped: 0, Time elapsed: 0.18 sec - in org.apache.hadoop.util.TestLineReader
Java HotSpot(TM) 64-Bit Server VM warning: ignoring option MaxPermSize=768m; support was removed in 8.0
Running org.apache.hadoop.util.TestFindClass
Tests run: 16, Failures: 0, Errors: 0, Skipped: 0, Time elapsed: 0.578 sec - in org.apache.hadoop.util.TestFindClass
Java HotSpot(TM) 64-Bit Server VM warning: ignoring option MaxPermSize=768m; support was removed in 8.0
Running org.apache.hadoop.util.TestClasspath
Tests run: 7, Failures: 0, Errors: 0, Skipped: 0, Time elapsed: 0.31 sec - in org.apache.hadoop.util.TestClasspath
Java HotSpot(TM) 64-Bit Server VM warning: ignoring option MaxPermSize=768m; support was removed in 8.0
Running org.apache.hadoop.util.TestCacheableIPList
Tests run: 4, Failures: 0, Errors: 0, Skipped: 0, Time elapsed: 1.277 sec - in org.apache.hadoop.util.TestCacheableIPList
Java HotSpot(TM) 64-Bit Server VM warning: ignoring option MaxPermSize=768m; support was removed in 8.0
Running org.apache.hadoop.util.TestZKUtil
Tests run: 9, Failures: 0, Errors: 0, Skipped: 0, Time elapsed: 0.11 sec - in org.apache.hadoop.util.TestZKUtil
Java HotSpot(TM) 64-Bit Server VM warning: ignoring option MaxPermSize=768m; support was removed in 8.0
Running org.apache.hadoop.util.TestOptions
Tests run: 2, Failures: 0, Errors: 0, Skipped: 0, Time elapsed: 0.079 sec - in org.apache.hadoop.util.TestOptions
Java HotSpot(TM) 64-Bit Server VM warning: ignoring option MaxPermSize=768m; support was removed in 8.0
Running org.apache.hadoop.util.TestShell
Tests run: 22, Failures: 0, Errors: 0, Skipped: 0, Time elapsed: 5.341 sec - in org.apache.hadoop.util.TestShell
Java HotSpot(TM) 64-Bit Server VM warning: ignoring option MaxPermSize=768m; support was removed in 8.0
Running org.apache.hadoop.util.TestGenericsUtil
Tests run: 6, Failures: 0, Errors: 0, Skipped: 0, Time elapsed: 0.328 sec - in org.apache.hadoop.util.TestGenericsUtil
Java HotSpot(TM) 64-Bit Server VM warning: ignoring option MaxPermSize=768m; support was removed in 8.0
Running org.apache.hadoop.util.TestDiskChecker
Tests run: 15, Failures: 0, Errors: 0, Skipped: 0, Time elapsed: 0.995 sec - in org.apache.hadoop.util.TestDiskChecker
Java HotSpot(TM) 64-Bit Server VM warning: ignoring option MaxPermSize=768m; support was removed in 8.0
Running org.apache.hadoop.util.TestClassUtil
Tests run: 1, Failures: 0, Errors: 0, Skipped: 0, Time elapsed: 0.074 sec - in org.apache.hadoop.util.TestClassUtil
Java HotSpot(TM) 64-Bit Server VM warning: ignoring option MaxPermSize=768m; support was removed in 8.0
Running org.apache.hadoop.util.TestNativeCodeLoader
Tests run: 1, Failures: 0, Errors: 0, Skipped: 0, Time elapsed: 0.146 sec - in org.apache.hadoop.util.TestNativeCodeLoader
Java HotSpot(TM) 64-Bit Server VM warning: ignoring option MaxPermSize=768m; support was removed in 8.0
Running org.apache.hadoop.util.TestJarFinder
Tests run: 4, Failures: 0, Errors: 0, Skipped: 0, Time elapsed: 0.756 sec - in org.apache.hadoop.util.TestJarFinder
Java HotSpot(TM) 64-Bit Server VM warning: ignoring option MaxPermSize=768m; support was removed in 8.0
Running org.apache.hadoop.util.TestNativeCrc32
Tests run: 22, Failures: 0, Errors: 0, Skipped: 0, Time elapsed: 0.545 sec - in org.apache.hadoop.util.TestNativeCrc32
Java HotSpot(TM) 64-Bit Server VM warning: ignoring option MaxPermSize=768m; support was removed in 8.0
Running org.apache.hadoop.util.TestChunkedArrayList
Tests run: 5, Failures: 0, Errors: 0, Skipped: 0, Time elapsed: 0.606 sec - in org.apache.hadoop.util.TestChunkedArrayList
Java HotSpot(TM) 64-Bit Server VM warning: ignoring option MaxPermSize=768m; support was removed in 8.0
Running org.apache.hadoop.util.TestMachineList
Tests run: 14, Failures: 0, Errors: 0, Skipped: 0, Time elapsed: 0.67 sec - in org.apache.hadoop.util.TestMachineList
Java HotSpot(TM) 64-Bit Server VM warning: ignoring option MaxPermSize=768m; support was removed in 8.0
Running org.apache.hadoop.util.TestShutdownThreadsHelper
Tests run: 2, Failures: 0, Errors: 0, Skipped: 0, Time elapsed: 3.173 sec - in org.apache.hadoop.util.TestShutdownThreadsHelper
Java HotSpot(TM) 64-Bit Server VM warning: ignoring option MaxPermSize=768m; support was removed in 8.0
Running org.apache.hadoop.util.TestConfTest
Tests run: 14, Failures: 0, Errors: 0, Skipped: 0, Time elapsed: 0.246 sec - in org.apache.hadoop.util.TestConfTest
Java HotSpot(TM) 64-Bit Server VM warning: ignoring option MaxPermSize=768m; support was removed in 8.0
Running org.apache.hadoop.util.TestApplicationClassLoader
Tests run: 4, Failures: 0, Errors: 0, Skipped: 0, Time elapsed: 0.229 sec - in org.apache.hadoop.util.TestApplicationClassLoader
Java HotSpot(TM) 64-Bit Server VM warning: ignoring option MaxPermSize=768m; support was removed in 8.0
Running org.apache.hadoop.util.TestFileBasedIPList
Tests run: 8, Failures: 0, Errors: 0, Skipped: 0, Time elapsed: 0.171 sec - in org.apache.hadoop.util.TestFileBasedIPList
Java HotSpot(TM) 64-Bit Server VM warning: ignoring option MaxPermSize=768m; support was removed in 8.0
Running org.apache.hadoop.util.TestGenericOptionsParser
Tests run: 7, Failures: 0, Errors: 0, Skipped: 0, Time elapsed: 0.792 sec - in org.apache.hadoop.util.TestGenericOptionsParser
Java HotSpot(TM) 64-Bit Server VM warning: ignoring option MaxPermSize=768m; support was removed in 8.0
Running org.apache.hadoop.http.TestGlobalFilter
Tests run: 1, Failures: 0, Errors: 0, Skipped: 0, Time elapsed: 0.873 sec - in org.apache.hadoop.http.TestGlobalFilter
Java HotSpot(TM) 64-Bit Server VM warning: ignoring option MaxPermSize=768m; support was removed in 8.0
Running org.apache.hadoop.http.TestPathFilter
Tests run: 1, Failures: 0, Errors: 0, Skipped: 0, Time elapsed: 0.862 sec - in org.apache.hadoop.http.TestPathFilter
Java HotSpot(TM) 64-Bit Server VM warning: ignoring option MaxPermSize=768m; support was removed in 8.0
Running org.apache.hadoop.http.TestHttpCookieFlag
Tests run: 2, Failures: 0, Errors: 0, Skipped: 0, Time elapsed: 1.522 sec - in org.apache.hadoop.http.TestHttpCookieFlag
Java HotSpot(TM) 64-Bit Server VM warning: ignoring option MaxPermSize=768m; support was removed in 8.0
Running org.apache.hadoop.http.TestHttpServerLogs
Tests run: 2, Failures: 0, Errors: 0, Skipped: 0, Time elapsed: 0.909 sec - in org.apache.hadoop.http.TestHttpServerLogs
Java HotSpot(TM) 64-Bit Server VM warning: ignoring option MaxPermSize=768m; support was removed in 8.0
Running org.apache.hadoop.http.TestServletFilter
Tests run: 3, Failures: 0, Errors: 0, Skipped: 0, Time elapsed: 1.253 sec - in org.apache.hadoop.http.TestServletFilter
Java HotSpot(TM) 64-Bit Server VM warning: ignoring option MaxPermSize=768m; support was removed in 8.0
Running org.apache.hadoop.http.TestHttpRequestLogAppender
Tests run: 1, Failures: 0, Errors: 0, Skipped: 0, Time elapsed: 0.071 sec - in org.apache.hadoop.http.TestHttpRequestLogAppender
Java HotSpot(TM) 64-Bit Server VM warning: ignoring option MaxPermSize=768m; support was removed in 8.0
Running org.apache.hadoop.http.TestHttpServerLifecycle
Tests run: 7, Failures: 0, Errors: 0, Skipped: 0, Time elapsed: 1.354 sec - in org.apache.hadoop.http.TestHttpServerLifecycle
Java HotSpot(TM) 64-Bit Server VM warning: ignoring option MaxPermSize=768m; support was removed in 8.0
Running org.apache.hadoop.http.TestAuthenticationSessionCookie
Tests run: 2, Failures: 0, Errors: 0, Skipped: 0, Time elapsed: 1.59 sec - in org.apache.hadoop.http.TestAuthenticationSessionCookie
Java HotSpot(TM) 64-Bit Server VM warning: ignoring option MaxPermSize=768m; support was removed in 8.0
Running org.apache.hadoop.http.TestSSLHttpServer
Tests run: 5, Failures: 0, Errors: 0, Skipped: 0, Time elapsed: 1.56 sec - in org.apache.hadoop.http.TestSSLHttpServer
Java HotSpot(TM) 64-Bit Server VM warning: ignoring option MaxPermSize=768m; support was removed in 8.0
Running org.apache.hadoop.http.lib.TestStaticUserWebFilter
Tests run: 3, Failures: 0, Errors: 0, Skipped: 0, Time elapsed: 0.524 sec - in org.apache.hadoop.http.lib.TestStaticUserWebFilter
Java HotSpot(TM) 64-Bit Server VM warning: ignoring option MaxPermSize=768m; support was removed in 8.0
Running org.apache.hadoop.http.TestHttpRequestLog
Tests run: 2, Failures: 0, Errors: 0, Skipped: 0, Time elapsed: 0.168 sec - in org.apache.hadoop.http.TestHttpRequestLog
Java HotSpot(TM) 64-Bit Server VM warning: ignoring option MaxPermSize=768m; support was removed in 8.0
Running org.apache.hadoop.http.TestHtmlQuoting
Tests run: 4, Failures: 0, Errors: 0, Skipped: 0, Time elapsed: 0.26 sec - in org.apache.hadoop.http.TestHtmlQuoting
Java HotSpot(TM) 64-Bit Server VM warning: ignoring option MaxPermSize=768m; support was removed in 8.0
Running org.apache.hadoop.http.TestHttpServerWebapps
Tests run: 2, Failures: 0, Errors: 0, Skipped: 0, Time elapsed: 0.511 sec - in org.apache.hadoop.http.TestHttpServerWebapps
Java HotSpot(TM) 64-Bit Server VM warning: ignoring option MaxPermSize=768m; support was removed in 8.0
Running org.apache.hadoop.http.TestHttpServer
Tests run: 15, Failures: 0, Errors: 0, Skipped: 0, Time elapsed: 3.033 sec - in org.apache.hadoop.http.TestHttpServer
Results :
Failed tests:
TestDNS.testNullDnsServer:124
Expected: is "asf905.gq1.ygridcore.net"
but: was "localhost"
Tests run: 3380, Failures: 1, Errors: 0, Skipped: 86
[INFO] ------------------------------------------------------------------------
[INFO] Reactor Summary:
[INFO]
[INFO] Apache Hadoop Annotations ......................... SUCCESS [ 5.629 s]
[INFO] Apache Hadoop MiniKDC ............................. SUCCESS [01:32 min]
[INFO] Apache Hadoop Auth ................................ SUCCESS [12:24 min]
[INFO] Apache Hadoop Auth Examples ....................... SUCCESS [ 3.277 s]
[INFO] Apache Hadoop Common .............................. FAILURE [23:57 min]
[INFO] Apache Hadoop NFS ................................. SKIPPED
[INFO] Apache Hadoop KMS ................................. SKIPPED
[INFO] Apache Hadoop Common Project ...................... SKIPPED
[INFO] ------------------------------------------------------------------------
[INFO] BUILD FAILURE
[INFO] ------------------------------------------------------------------------
[INFO] Total time: 38:03 min
[INFO] Finished at: 2016-05-04T18:36:45+00:00
[INFO] Final Memory: 62M/351M
[INFO] ------------------------------------------------------------------------
[ERROR] Failed to execute goal org.apache.maven.plugins:maven-surefire-plugin:2.17:test (default-test) on project hadoop-common: There are test failures.
[ERROR]
[ERROR] Please refer to <https://builds.apache.org/job/Hadoop-common-trunk-Java8/ws/hadoop-common-project/hadoop-common/target/surefire-reports> for the individual test results.
[ERROR] -> [Help 1]
org.apache.maven.lifecycle.LifecycleExecutionException: Failed to execute goal org.apache.maven.plugins:maven-surefire-plugin:2.17:test (default-test) on project hadoop-common: There are test failures.
Please refer to <https://builds.apache.org/job/Hadoop-common-trunk-Java8/ws/hadoop-common-project/hadoop-common/target/surefire-reports> for the individual test results.
at org.apache.maven.lifecycle.internal.MojoExecutor.execute(MojoExecutor.java:212)
at org.apache.maven.lifecycle.internal.MojoExecutor.execute(MojoExecutor.java:153)
at org.apache.maven.lifecycle.internal.MojoExecutor.execute(MojoExecutor.java:145)
at org.apache.maven.lifecycle.internal.LifecycleModuleBuilder.buildProject(LifecycleModuleBuilder.java:108)
at org.apache.maven.lifecycle.internal.LifecycleModuleBuilder.buildProject(LifecycleModuleBuilder.java:76)
at org.apache.maven.lifecycle.internal.builder.singlethreaded.SingleThreadedBuilder.build(SingleThreadedBuilder.java:51)
at org.apache.maven.lifecycle.internal.LifecycleStarter.execute(LifecycleStarter.java:116)
at org.apache.maven.DefaultMaven.doExecute(DefaultMaven.java:361)
at org.apache.maven.DefaultMaven.execute(DefaultMaven.java:155)
at org.apache.maven.cli.MavenCli.execute(MavenCli.java:584)
at org.apache.maven.cli.MavenCli.doMain(MavenCli.java:213)
at org.apache.maven.cli.MavenCli.main(MavenCli.java:157)
at sun.reflect.NativeMethodAccessorImpl.invoke0(Native Method)
at sun.reflect.NativeMethodAccessorImpl.invoke(NativeMethodAccessorImpl.java:62)
at sun.reflect.DelegatingMethodAccessorImpl.invoke(DelegatingMethodAccessorImpl.java:43)
at java.lang.reflect.Method.invoke(Method.java:483)
at org.codehaus.plexus.classworlds.launcher.Launcher.launchEnhanced(Launcher.java:289)
at org.codehaus.plexus.classworlds.launcher.Launcher.launch(Launcher.java:229)
at org.codehaus.plexus.classworlds.launcher.Launcher.mainWithExitCode(Launcher.java:415)
at org.codehaus.plexus.classworlds.launcher.Launcher.main(Launcher.java:356)
Caused by: org.apache.maven.plugin.MojoFailureException: There are test failures.
Please refer to <https://builds.apache.org/job/Hadoop-common-trunk-Java8/ws/hadoop-common-project/hadoop-common/target/surefire-reports> for the individual test results.
at org.apache.maven.plugin.surefire.SurefireHelper.reportExecution(SurefireHelper.java:82)
at org.apache.maven.plugin.surefire.SurefirePlugin.handleSummary(SurefirePlugin.java:195)
at org.apache.maven.plugin.surefire.AbstractSurefireMojo.executeAfterPreconditionsChecked(AbstractSurefireMojo.java:861)
at org.apache.maven.plugin.surefire.AbstractSurefireMojo.execute(AbstractSurefireMojo.java:729)
at org.apache.maven.plugin.DefaultBuildPluginManager.executeMojo(DefaultBuildPluginManager.java:133)
at org.apache.maven.lifecycle.internal.MojoExecutor.execute(MojoExecutor.java:208)
... 19 more
[ERROR]
[ERROR] Re-run Maven using the -X switch to enable full debug logging.
[ERROR]
[ERROR] For more information about the errors and possible solutions, please read the following articles:
[ERROR] [Help 1] http://cwiki.apache.org/confluence/display/MAVEN/MojoFailureException
[ERROR]
[ERROR] After correcting the problems, you can resume the build with the command
[ERROR] mvn <goals> -rf :hadoop-common
Build step 'Execute shell' marked build as failure
Archiving artifacts
Recording test results
---------------------------------------------------------------------
To unsubscribe, e-mail: common-dev-unsubscribe@hadoop.apache.org
For additional commands, e-mail: common-dev-help@hadoop.apache.org
Build failed in Jenkins: Hadoop-common-trunk-Java8 #1430
Posted by Apache Jenkins Server <je...@builds.apache.org>.
See <https://builds.apache.org/job/Hadoop-common-trunk-Java8/1430/changes>
Changes:
[arp] HADOOP-13068. Clean up RunJar and related test class. (Contributed by
------------------------------------------
[...truncated 5567 lines...]
Running org.apache.hadoop.io.TestBytesWritable
Tests run: 6, Failures: 0, Errors: 0, Skipped: 0, Time elapsed: 0.264 sec - in org.apache.hadoop.io.TestBytesWritable
Java HotSpot(TM) 64-Bit Server VM warning: ignoring option MaxPermSize=768m; support was removed in 8.0
Running org.apache.hadoop.io.erasurecode.rawcoder.TestDummyRawCoder
Tests run: 3, Failures: 0, Errors: 0, Skipped: 0, Time elapsed: 0.32 sec - in org.apache.hadoop.io.erasurecode.rawcoder.TestDummyRawCoder
Java HotSpot(TM) 64-Bit Server VM warning: ignoring option MaxPermSize=768m; support was removed in 8.0
Running org.apache.hadoop.io.erasurecode.rawcoder.TestRSRawCoderLegacy
Tests run: 16, Failures: 0, Errors: 0, Skipped: 0, Time elapsed: 0.748 sec - in org.apache.hadoop.io.erasurecode.rawcoder.TestRSRawCoderLegacy
Java HotSpot(TM) 64-Bit Server VM warning: ignoring option MaxPermSize=768m; support was removed in 8.0
Running org.apache.hadoop.io.erasurecode.rawcoder.TestXORRawCoder
Tests run: 6, Failures: 0, Errors: 0, Skipped: 0, Time elapsed: 0.452 sec - in org.apache.hadoop.io.erasurecode.rawcoder.TestXORRawCoder
Java HotSpot(TM) 64-Bit Server VM warning: ignoring option MaxPermSize=768m; support was removed in 8.0
Running org.apache.hadoop.io.erasurecode.rawcoder.TestRSRawCoder
Tests run: 16, Failures: 0, Errors: 0, Skipped: 0, Time elapsed: 0.789 sec - in org.apache.hadoop.io.erasurecode.rawcoder.TestRSRawCoder
Java HotSpot(TM) 64-Bit Server VM warning: ignoring option MaxPermSize=768m; support was removed in 8.0
Running org.apache.hadoop.io.erasurecode.TestECSchema
Tests run: 1, Failures: 0, Errors: 0, Skipped: 0, Time elapsed: 0.144 sec - in org.apache.hadoop.io.erasurecode.TestECSchema
Java HotSpot(TM) 64-Bit Server VM warning: ignoring option MaxPermSize=768m; support was removed in 8.0
Running org.apache.hadoop.io.erasurecode.TestCodecRawCoderMapping
Tests run: 2, Failures: 0, Errors: 0, Skipped: 0, Time elapsed: 0.725 sec - in org.apache.hadoop.io.erasurecode.TestCodecRawCoderMapping
Java HotSpot(TM) 64-Bit Server VM warning: ignoring option MaxPermSize=768m; support was removed in 8.0
Running org.apache.hadoop.io.erasurecode.coder.TestXORCoder
Tests run: 2, Failures: 0, Errors: 0, Skipped: 0, Time elapsed: 0.859 sec - in org.apache.hadoop.io.erasurecode.coder.TestXORCoder
Java HotSpot(TM) 64-Bit Server VM warning: ignoring option MaxPermSize=768m; support was removed in 8.0
Running org.apache.hadoop.io.erasurecode.coder.TestHHXORErasureCoder
Tests run: 9, Failures: 0, Errors: 0, Skipped: 0, Time elapsed: 2.131 sec - in org.apache.hadoop.io.erasurecode.coder.TestHHXORErasureCoder
Java HotSpot(TM) 64-Bit Server VM warning: ignoring option MaxPermSize=768m; support was removed in 8.0
Running org.apache.hadoop.io.erasurecode.coder.TestRSErasureCoder
Tests run: 10, Failures: 0, Errors: 0, Skipped: 0, Time elapsed: 1.786 sec - in org.apache.hadoop.io.erasurecode.coder.TestRSErasureCoder
Java HotSpot(TM) 64-Bit Server VM warning: ignoring option MaxPermSize=768m; support was removed in 8.0
Running org.apache.hadoop.io.TestWritableUtils
Tests run: 1, Failures: 0, Errors: 0, Skipped: 0, Time elapsed: 0.256 sec - in org.apache.hadoop.io.TestWritableUtils
Java HotSpot(TM) 64-Bit Server VM warning: ignoring option MaxPermSize=768m; support was removed in 8.0
Running org.apache.hadoop.io.TestBooleanWritable
Tests run: 2, Failures: 0, Errors: 0, Skipped: 0, Time elapsed: 0.265 sec - in org.apache.hadoop.io.TestBooleanWritable
Java HotSpot(TM) 64-Bit Server VM warning: ignoring option MaxPermSize=768m; support was removed in 8.0
Running org.apache.hadoop.io.TestDataByteBuffers
Tests run: 5, Failures: 0, Errors: 0, Skipped: 0, Time elapsed: 0.593 sec - in org.apache.hadoop.io.TestDataByteBuffers
Java HotSpot(TM) 64-Bit Server VM warning: ignoring option MaxPermSize=768m; support was removed in 8.0
Running org.apache.hadoop.io.TestVersionedWritable
Tests run: 3, Failures: 0, Errors: 0, Skipped: 0, Time elapsed: 0.266 sec - in org.apache.hadoop.io.TestVersionedWritable
Java HotSpot(TM) 64-Bit Server VM warning: ignoring option MaxPermSize=768m; support was removed in 8.0
Running org.apache.hadoop.io.TestEnumSetWritable
Tests run: 6, Failures: 0, Errors: 0, Skipped: 0, Time elapsed: 0.744 sec - in org.apache.hadoop.io.TestEnumSetWritable
Java HotSpot(TM) 64-Bit Server VM warning: ignoring option MaxPermSize=768m; support was removed in 8.0
Running org.apache.hadoop.io.TestMapWritable
Tests run: 5, Failures: 0, Errors: 0, Skipped: 0, Time elapsed: 0.41 sec - in org.apache.hadoop.io.TestMapWritable
Java HotSpot(TM) 64-Bit Server VM warning: ignoring option MaxPermSize=768m; support was removed in 8.0
Running org.apache.hadoop.io.TestArrayPrimitiveWritable
Tests run: 3, Failures: 0, Errors: 0, Skipped: 0, Time elapsed: 0.305 sec - in org.apache.hadoop.io.TestArrayPrimitiveWritable
Java HotSpot(TM) 64-Bit Server VM warning: ignoring option MaxPermSize=768m; support was removed in 8.0
Running org.apache.hadoop.io.TestSetFile
Tests run: 2, Failures: 0, Errors: 0, Skipped: 0, Time elapsed: 2.688 sec - in org.apache.hadoop.io.TestSetFile
Java HotSpot(TM) 64-Bit Server VM warning: ignoring option MaxPermSize=768m; support was removed in 8.0
Running org.apache.hadoop.io.TestUTF8
Tests run: 8, Failures: 0, Errors: 0, Skipped: 0, Time elapsed: 0.936 sec - in org.apache.hadoop.io.TestUTF8
Java HotSpot(TM) 64-Bit Server VM warning: ignoring option MaxPermSize=768m; support was removed in 8.0
Running org.apache.hadoop.io.TestBoundedByteArrayOutputStream
Tests run: 2, Failures: 0, Errors: 0, Skipped: 0, Time elapsed: 0.134 sec - in org.apache.hadoop.io.TestBoundedByteArrayOutputStream
Java HotSpot(TM) 64-Bit Server VM warning: ignoring option MaxPermSize=768m; support was removed in 8.0
Running org.apache.hadoop.io.compress.TestCodecPool
Tests run: 6, Failures: 0, Errors: 0, Skipped: 0, Time elapsed: 0.682 sec - in org.apache.hadoop.io.compress.TestCodecPool
Java HotSpot(TM) 64-Bit Server VM warning: ignoring option MaxPermSize=768m; support was removed in 8.0
Running org.apache.hadoop.io.compress.lz4.TestLz4CompressorDecompressor
Tests run: 13, Failures: 0, Errors: 0, Skipped: 0, Time elapsed: 0.633 sec - in org.apache.hadoop.io.compress.lz4.TestLz4CompressorDecompressor
Java HotSpot(TM) 64-Bit Server VM warning: ignoring option MaxPermSize=768m; support was removed in 8.0
Running org.apache.hadoop.io.compress.TestBlockDecompressorStream
Tests run: 2, Failures: 0, Errors: 0, Skipped: 0, Time elapsed: 0.172 sec - in org.apache.hadoop.io.compress.TestBlockDecompressorStream
Java HotSpot(TM) 64-Bit Server VM warning: ignoring option MaxPermSize=768m; support was removed in 8.0
Running org.apache.hadoop.io.compress.TestCodec
Tests run: 25, Failures: 0, Errors: 0, Skipped: 0, Time elapsed: 134.771 sec - in org.apache.hadoop.io.compress.TestCodec
Java HotSpot(TM) 64-Bit Server VM warning: ignoring option MaxPermSize=768m; support was removed in 8.0
Running org.apache.hadoop.io.compress.TestCompressorStream
Tests run: 1, Failures: 0, Errors: 0, Skipped: 0, Time elapsed: 0.193 sec - in org.apache.hadoop.io.compress.TestCompressorStream
Java HotSpot(TM) 64-Bit Server VM warning: ignoring option MaxPermSize=768m; support was removed in 8.0
Running org.apache.hadoop.io.compress.TestCompressorDecompressor
Tests run: 2, Failures: 0, Errors: 0, Skipped: 0, Time elapsed: 0.864 sec - in org.apache.hadoop.io.compress.TestCompressorDecompressor
Java HotSpot(TM) 64-Bit Server VM warning: ignoring option MaxPermSize=768m; support was removed in 8.0
Running org.apache.hadoop.io.compress.zlib.TestZlibCompressorDecompressor
Tests run: 10, Failures: 0, Errors: 0, Skipped: 0, Time elapsed: 1.685 sec - in org.apache.hadoop.io.compress.zlib.TestZlibCompressorDecompressor
Java HotSpot(TM) 64-Bit Server VM warning: ignoring option MaxPermSize=768m; support was removed in 8.0
Running org.apache.hadoop.io.compress.TestCodecFactory
Tests run: 1, Failures: 0, Errors: 0, Skipped: 0, Time elapsed: 0.744 sec - in org.apache.hadoop.io.compress.TestCodecFactory
Java HotSpot(TM) 64-Bit Server VM warning: ignoring option MaxPermSize=768m; support was removed in 8.0
Running org.apache.hadoop.io.compress.TestCompressionStreamReuse
Tests run: 3, Failures: 0, Errors: 0, Skipped: 0, Time elapsed: 5.532 sec - in org.apache.hadoop.io.compress.TestCompressionStreamReuse
Java HotSpot(TM) 64-Bit Server VM warning: ignoring option MaxPermSize=768m; support was removed in 8.0
Running org.apache.hadoop.io.compress.snappy.TestSnappyCompressorDecompressor
Tests run: 14, Failures: 0, Errors: 0, Skipped: 0, Time elapsed: 0.659 sec - in org.apache.hadoop.io.compress.snappy.TestSnappyCompressorDecompressor
Java HotSpot(TM) 64-Bit Server VM warning: ignoring option MaxPermSize=768m; support was removed in 8.0
Running org.apache.hadoop.io.compress.bzip2.TestBzip2CompressorDecompressor
Tests run: 2, Failures: 0, Errors: 0, Skipped: 2, Time elapsed: 0.601 sec - in org.apache.hadoop.io.compress.bzip2.TestBzip2CompressorDecompressor
Java HotSpot(TM) 64-Bit Server VM warning: ignoring option MaxPermSize=768m; support was removed in 8.0
Running org.apache.hadoop.io.serializer.TestSerializationFactory
Tests run: 5, Failures: 0, Errors: 0, Skipped: 0, Time elapsed: 0.753 sec - in org.apache.hadoop.io.serializer.TestSerializationFactory
Java HotSpot(TM) 64-Bit Server VM warning: ignoring option MaxPermSize=768m; support was removed in 8.0
Running org.apache.hadoop.io.serializer.avro.TestAvroSerialization
Tests run: 5, Failures: 0, Errors: 0, Skipped: 0, Time elapsed: 1.063 sec - in org.apache.hadoop.io.serializer.avro.TestAvroSerialization
Java HotSpot(TM) 64-Bit Server VM warning: ignoring option MaxPermSize=768m; support was removed in 8.0
Running org.apache.hadoop.io.serializer.TestWritableSerialization
Tests run: 3, Failures: 0, Errors: 0, Skipped: 0, Time elapsed: 0.618 sec - in org.apache.hadoop.io.serializer.TestWritableSerialization
Java HotSpot(TM) 64-Bit Server VM warning: ignoring option MaxPermSize=768m; support was removed in 8.0
Running org.apache.hadoop.io.TestGenericWritable
Tests run: 5, Failures: 0, Errors: 0, Skipped: 0, Time elapsed: 0.732 sec - in org.apache.hadoop.io.TestGenericWritable
Java HotSpot(TM) 64-Bit Server VM warning: ignoring option MaxPermSize=768m; support was removed in 8.0
Running org.apache.hadoop.io.TestText
Tests run: 18, Failures: 0, Errors: 0, Skipped: 0, Time elapsed: 1.221 sec - in org.apache.hadoop.io.TestText
Java HotSpot(TM) 64-Bit Server VM warning: ignoring option MaxPermSize=768m; support was removed in 8.0
Running org.apache.hadoop.io.file.tfile.TestTFileNoneCodecsStreams
Tests run: 19, Failures: 0, Errors: 0, Skipped: 0, Time elapsed: 2.032 sec - in org.apache.hadoop.io.file.tfile.TestTFileNoneCodecsStreams
Java HotSpot(TM) 64-Bit Server VM warning: ignoring option MaxPermSize=768m; support was removed in 8.0
Running org.apache.hadoop.io.file.tfile.TestTFileLzoCodecsByteArrays
Tests run: 25, Failures: 0, Errors: 0, Skipped: 0, Time elapsed: 0.511 sec - in org.apache.hadoop.io.file.tfile.TestTFileLzoCodecsByteArrays
Java HotSpot(TM) 64-Bit Server VM warning: ignoring option MaxPermSize=768m; support was removed in 8.0
Running org.apache.hadoop.io.file.tfile.TestTFileSeek
Tests run: 1, Failures: 0, Errors: 0, Skipped: 0, Time elapsed: 3.598 sec - in org.apache.hadoop.io.file.tfile.TestTFileSeek
Java HotSpot(TM) 64-Bit Server VM warning: ignoring option MaxPermSize=768m; support was removed in 8.0
Running org.apache.hadoop.io.file.tfile.TestCompression
Tests run: 1, Failures: 0, Errors: 0, Skipped: 0, Time elapsed: 0.531 sec - in org.apache.hadoop.io.file.tfile.TestCompression
Java HotSpot(TM) 64-Bit Server VM warning: ignoring option MaxPermSize=768m; support was removed in 8.0
Running org.apache.hadoop.io.file.tfile.TestTFileSplit
Tests run: 1, Failures: 0, Errors: 0, Skipped: 0, Time elapsed: 5.233 sec - in org.apache.hadoop.io.file.tfile.TestTFileSplit
Java HotSpot(TM) 64-Bit Server VM warning: ignoring option MaxPermSize=768m; support was removed in 8.0
Running org.apache.hadoop.io.file.tfile.TestTFileSeqFileComparison
Tests run: 1, Failures: 0, Errors: 0, Skipped: 0, Time elapsed: 4.843 sec - in org.apache.hadoop.io.file.tfile.TestTFileSeqFileComparison
Java HotSpot(TM) 64-Bit Server VM warning: ignoring option MaxPermSize=768m; support was removed in 8.0
Running org.apache.hadoop.io.file.tfile.TestTFileByteArrays
Tests run: 25, Failures: 0, Errors: 0, Skipped: 0, Time elapsed: 3.139 sec - in org.apache.hadoop.io.file.tfile.TestTFileByteArrays
Java HotSpot(TM) 64-Bit Server VM warning: ignoring option MaxPermSize=768m; support was removed in 8.0
Running org.apache.hadoop.io.file.tfile.TestTFileComparator2
Tests run: 1, Failures: 0, Errors: 0, Skipped: 0, Time elapsed: 1.675 sec - in org.apache.hadoop.io.file.tfile.TestTFileComparator2
Java HotSpot(TM) 64-Bit Server VM warning: ignoring option MaxPermSize=768m; support was removed in 8.0
Running org.apache.hadoop.io.file.tfile.TestTFileNoneCodecsByteArrays
Tests run: 25, Failures: 0, Errors: 0, Skipped: 0, Time elapsed: 2.117 sec - in org.apache.hadoop.io.file.tfile.TestTFileNoneCodecsByteArrays
Java HotSpot(TM) 64-Bit Server VM warning: ignoring option MaxPermSize=768m; support was removed in 8.0
Running org.apache.hadoop.io.file.tfile.TestTFileNoneCodecsJClassComparatorByteArrays
Tests run: 25, Failures: 0, Errors: 0, Skipped: 0, Time elapsed: 1.942 sec - in org.apache.hadoop.io.file.tfile.TestTFileNoneCodecsJClassComparatorByteArrays
Java HotSpot(TM) 64-Bit Server VM warning: ignoring option MaxPermSize=768m; support was removed in 8.0
Running org.apache.hadoop.io.file.tfile.TestTFileJClassComparatorByteArrays
Tests run: 25, Failures: 0, Errors: 0, Skipped: 0, Time elapsed: 3.148 sec - in org.apache.hadoop.io.file.tfile.TestTFileJClassComparatorByteArrays
Java HotSpot(TM) 64-Bit Server VM warning: ignoring option MaxPermSize=768m; support was removed in 8.0
Running org.apache.hadoop.io.file.tfile.TestTFileLzoCodecsStreams
Tests run: 19, Failures: 0, Errors: 0, Skipped: 0, Time elapsed: 0.555 sec - in org.apache.hadoop.io.file.tfile.TestTFileLzoCodecsStreams
Java HotSpot(TM) 64-Bit Server VM warning: ignoring option MaxPermSize=768m; support was removed in 8.0
Running org.apache.hadoop.io.file.tfile.TestTFileComparators
Tests run: 3, Failures: 0, Errors: 0, Skipped: 0, Time elapsed: 1.202 sec - in org.apache.hadoop.io.file.tfile.TestTFileComparators
Java HotSpot(TM) 64-Bit Server VM warning: ignoring option MaxPermSize=768m; support was removed in 8.0
Running org.apache.hadoop.io.file.tfile.TestTFileStreams
Tests run: 19, Failures: 0, Errors: 0, Skipped: 0, Time elapsed: 2.08 sec - in org.apache.hadoop.io.file.tfile.TestTFileStreams
Java HotSpot(TM) 64-Bit Server VM warning: ignoring option MaxPermSize=768m; support was removed in 8.0
Running org.apache.hadoop.io.file.tfile.TestTFileUnsortedByteArrays
Tests run: 4, Failures: 0, Errors: 0, Skipped: 0, Time elapsed: 1.28 sec - in org.apache.hadoop.io.file.tfile.TestTFileUnsortedByteArrays
Java HotSpot(TM) 64-Bit Server VM warning: ignoring option MaxPermSize=768m; support was removed in 8.0
Running org.apache.hadoop.io.file.tfile.TestVLong
Tests run: 9, Failures: 0, Errors: 0, Skipped: 0, Time elapsed: 2.185 sec - in org.apache.hadoop.io.file.tfile.TestVLong
Java HotSpot(TM) 64-Bit Server VM warning: ignoring option MaxPermSize=768m; support was removed in 8.0
Running org.apache.hadoop.io.file.tfile.TestTFile
Tests run: 3, Failures: 0, Errors: 0, Skipped: 0, Time elapsed: 1.865 sec - in org.apache.hadoop.io.file.tfile.TestTFile
Java HotSpot(TM) 64-Bit Server VM warning: ignoring option MaxPermSize=768m; support was removed in 8.0
Running org.apache.hadoop.io.TestObjectWritableProtos
Tests run: 3, Failures: 0, Errors: 0, Skipped: 0, Time elapsed: 0.48 sec - in org.apache.hadoop.io.TestObjectWritableProtos
Java HotSpot(TM) 64-Bit Server VM warning: ignoring option MaxPermSize=768m; support was removed in 8.0
Running org.apache.hadoop.io.TestArrayWritable
Tests run: 4, Failures: 0, Errors: 0, Skipped: 0, Time elapsed: 0.399 sec - in org.apache.hadoop.io.TestArrayWritable
Java HotSpot(TM) 64-Bit Server VM warning: ignoring option MaxPermSize=768m; support was removed in 8.0
Running org.apache.hadoop.io.TestSequenceFileSerialization
Tests run: 1, Failures: 0, Errors: 0, Skipped: 0, Time elapsed: 1.431 sec - in org.apache.hadoop.io.TestSequenceFileSerialization
Java HotSpot(TM) 64-Bit Server VM warning: ignoring option MaxPermSize=768m; support was removed in 8.0
Running org.apache.hadoop.io.TestArrayFile
Tests run: 3, Failures: 0, Errors: 0, Skipped: 0, Time elapsed: 3.978 sec - in org.apache.hadoop.io.TestArrayFile
Results :
Failed tests:
TestDNS.testNullDnsServer:124
Expected: is "asf903.gq1.ygridcore.net"
but: was "localhost"
TestDNS.testDefaultDnsServer:134
Expected: is "asf903.gq1.ygridcore.net"
but: was "localhost"
Tests run: 3380, Failures: 2, Errors: 0, Skipped: 86
[INFO] ------------------------------------------------------------------------
[INFO] Reactor Summary:
[INFO]
[INFO] Apache Hadoop Annotations ......................... SUCCESS [ 8.914 s]
[INFO] Apache Hadoop MiniKDC ............................. SUCCESS [ 28.482 s]
[INFO] Apache Hadoop Auth ................................ SUCCESS [04:16 min]
[INFO] Apache Hadoop Auth Examples ....................... SUCCESS [ 4.549 s]
[INFO] Apache Hadoop Common .............................. FAILURE [29:20 min]
[INFO] Apache Hadoop NFS ................................. SKIPPED
[INFO] Apache Hadoop KMS ................................. SKIPPED
[INFO] Apache Hadoop Common Project ...................... SKIPPED
[INFO] ------------------------------------------------------------------------
[INFO] BUILD FAILURE
[INFO] ------------------------------------------------------------------------
[INFO] Total time: 34:19 min
[INFO] Finished at: 2016-05-04T17:33:40+00:00
[INFO] Final Memory: 62M/326M
[INFO] ------------------------------------------------------------------------
[ERROR] Failed to execute goal org.apache.maven.plugins:maven-surefire-plugin:2.17:test (default-test) on project hadoop-common: There are test failures.
[ERROR]
[ERROR] Please refer to <https://builds.apache.org/job/Hadoop-common-trunk-Java8/ws/hadoop-common-project/hadoop-common/target/surefire-reports> for the individual test results.
[ERROR] -> [Help 1]
org.apache.maven.lifecycle.LifecycleExecutionException: Failed to execute goal org.apache.maven.plugins:maven-surefire-plugin:2.17:test (default-test) on project hadoop-common: There are test failures.
Please refer to <https://builds.apache.org/job/Hadoop-common-trunk-Java8/ws/hadoop-common-project/hadoop-common/target/surefire-reports> for the individual test results.
at org.apache.maven.lifecycle.internal.MojoExecutor.execute(MojoExecutor.java:212)
at org.apache.maven.lifecycle.internal.MojoExecutor.execute(MojoExecutor.java:153)
at org.apache.maven.lifecycle.internal.MojoExecutor.execute(MojoExecutor.java:145)
at org.apache.maven.lifecycle.internal.LifecycleModuleBuilder.buildProject(LifecycleModuleBuilder.java:108)
at org.apache.maven.lifecycle.internal.LifecycleModuleBuilder.buildProject(LifecycleModuleBuilder.java:76)
at org.apache.maven.lifecycle.internal.builder.singlethreaded.SingleThreadedBuilder.build(SingleThreadedBuilder.java:51)
at org.apache.maven.lifecycle.internal.LifecycleStarter.execute(LifecycleStarter.java:116)
at org.apache.maven.DefaultMaven.doExecute(DefaultMaven.java:361)
at org.apache.maven.DefaultMaven.execute(DefaultMaven.java:155)
at org.apache.maven.cli.MavenCli.execute(MavenCli.java:584)
at org.apache.maven.cli.MavenCli.doMain(MavenCli.java:213)
at org.apache.maven.cli.MavenCli.main(MavenCli.java:157)
at sun.reflect.NativeMethodAccessorImpl.invoke0(Native Method)
at sun.reflect.NativeMethodAccessorImpl.invoke(NativeMethodAccessorImpl.java:62)
at sun.reflect.DelegatingMethodAccessorImpl.invoke(DelegatingMethodAccessorImpl.java:43)
at java.lang.reflect.Method.invoke(Method.java:483)
at org.codehaus.plexus.classworlds.launcher.Launcher.launchEnhanced(Launcher.java:289)
at org.codehaus.plexus.classworlds.launcher.Launcher.launch(Launcher.java:229)
at org.codehaus.plexus.classworlds.launcher.Launcher.mainWithExitCode(Launcher.java:415)
at org.codehaus.plexus.classworlds.launcher.Launcher.main(Launcher.java:356)
Caused by: org.apache.maven.plugin.MojoFailureException: There are test failures.
Please refer to <https://builds.apache.org/job/Hadoop-common-trunk-Java8/ws/hadoop-common-project/hadoop-common/target/surefire-reports> for the individual test results.
at org.apache.maven.plugin.surefire.SurefireHelper.reportExecution(SurefireHelper.java:82)
at org.apache.maven.plugin.surefire.SurefirePlugin.handleSummary(SurefirePlugin.java:195)
at org.apache.maven.plugin.surefire.AbstractSurefireMojo.executeAfterPreconditionsChecked(AbstractSurefireMojo.java:861)
at org.apache.maven.plugin.surefire.AbstractSurefireMojo.execute(AbstractSurefireMojo.java:729)
at org.apache.maven.plugin.DefaultBuildPluginManager.executeMojo(DefaultBuildPluginManager.java:133)
at org.apache.maven.lifecycle.internal.MojoExecutor.execute(MojoExecutor.java:208)
... 19 more
[ERROR]
[ERROR] Re-run Maven using the -X switch to enable full debug logging.
[ERROR]
[ERROR] For more information about the errors and possible solutions, please read the following articles:
[ERROR] [Help 1] http://cwiki.apache.org/confluence/display/MAVEN/MojoFailureException
[ERROR]
[ERROR] After correcting the problems, you can resume the build with the command
[ERROR] mvn <goals> -rf :hadoop-common
Build step 'Execute shell' marked build as failure
Archiving artifacts
Recording test results
---------------------------------------------------------------------
To unsubscribe, e-mail: common-dev-unsubscribe@hadoop.apache.org
For additional commands, e-mail: common-dev-help@hadoop.apache.org