You are viewing a plain text version of this content. The canonical link for it is here.
Posted to builds@beam.apache.org by Apache Jenkins Server <je...@builds.apache.org> on 2023/11/20 00:47:21 UTC

Build failed in Jenkins: beam_PostCommit_Python311 #903

See <https://ci-beam.apache.org/job/beam_PostCommit_Python311/903/display/redirect>

Changes:


------------------------------------------
[...truncated 12.22 MB...]
[gw3] SKIPPED apache_beam/ml/inference/xgboost_inference_it_test.py::XGBoostInference::test_iris_classification_scipy_single_batch 
[gw7] PASSED apache_beam/io/gcp/bigquery_test.py::BigQueryStreamingInsertTransformIntegrationTests::test_value_provider_transform 
apache_beam/io/gcp/bigquery_test.py::PubSubBigQueryIT::test_file_loads 
[gw6] PASSED apache_beam/transforms/external_it_test.py::ExternalTransformIT::test_job_python_from_python_it 
apache_beam/transforms/periodicsequence_it_test.py::PeriodicSequenceIT::test_periodicsequence_outputs_valid_watermarks_it 
[gw6] SKIPPED apache_beam/transforms/periodicsequence_it_test.py::PeriodicSequenceIT::test_periodicsequence_outputs_valid_watermarks_it 
[gw2] PASSED apache_beam/io/gcp/datastore/v1new/datastore_write_it_test.py::DatastoreWriteIT::test_datastore_write_limit 
apache_beam/io/gcp/healthcare/dicomio_integration_test.py::DICOMIoIntegrationTest::test_dicom_search_instances 
[gw5] PASSED apache_beam/ml/inference/sklearn_inference_it_test.py::SklearnInference::test_sklearn_mnist_classification 
apache_beam/ml/inference/sklearn_inference_it_test.py::SklearnInference::test_sklearn_mnist_classification_large_model 
[gw0] PASSED apache_beam/io/gcp/bigquery_read_it_test.py::ReadUsingStorageApiTests::test_iobase_source_with_column_selection_and_row_restriction 
apache_beam/io/gcp/bigquery_read_it_test.py::ReadUsingStorageApiTests::test_iobase_source_with_column_selection_and_row_restriction_rows 
[gw2] PASSED apache_beam/io/gcp/healthcare/dicomio_integration_test.py::DICOMIoIntegrationTest::test_dicom_search_instances 
apache_beam/io/gcp/healthcare/dicomio_integration_test.py::DICOMIoIntegrationTest::test_dicom_store_instance_from_gcs 
[gw1] PASSED apache_beam/io/gcp/pubsub_integration_test.py::PubSubIntegrationTest::test_streaming_with_attributes 
apache_beam/ml/gcp/videointelligenceml_test_it.py::VideoIntelligenceMlTestIT::test_label_detection_with_video_context 
[gw1] SKIPPED apache_beam/ml/gcp/videointelligenceml_test_it.py::VideoIntelligenceMlTestIT::test_label_detection_with_video_context 
[gw5] PASSED apache_beam/ml/inference/sklearn_inference_it_test.py::SklearnInference::test_sklearn_mnist_classification_large_model 
apache_beam/ml/inference/sklearn_inference_it_test.py::SklearnInference::test_sklearn_regression 
[gw5] SKIPPED apache_beam/ml/inference/sklearn_inference_it_test.py::SklearnInference::test_sklearn_regression 
[gw0] PASSED apache_beam/io/gcp/bigquery_read_it_test.py::ReadUsingStorageApiTests::test_iobase_source_with_column_selection_and_row_restriction_rows 
apache_beam/io/gcp/bigquery_read_it_test.py::ReadUsingStorageApiTests::test_iobase_source_with_native_datetime 
[gw2] PASSED apache_beam/io/gcp/healthcare/dicomio_integration_test.py::DICOMIoIntegrationTest::test_dicom_store_instance_from_gcs 
[gw0] PASSED apache_beam/io/gcp/bigquery_read_it_test.py::ReadUsingStorageApiTests::test_iobase_source_with_native_datetime 
apache_beam/io/gcp/bigquery_read_it_test.py::ReadUsingStorageApiTests::test_iobase_source_with_query 
[gw7] PASSED apache_beam/io/gcp/bigquery_test.py::PubSubBigQueryIT::test_file_loads 
apache_beam/io/gcp/bigquery_test.py::PubSubBigQueryIT::test_streaming_inserts 
[gw0] PASSED apache_beam/io/gcp/bigquery_read_it_test.py::ReadUsingStorageApiTests::test_iobase_source_with_query 
apache_beam/io/gcp/bigquery_read_it_test.py::ReadUsingStorageApiTests::test_iobase_source_with_query_and_filters 
[gw0] PASSED apache_beam/io/gcp/bigquery_read_it_test.py::ReadUsingStorageApiTests::test_iobase_source_with_query_and_filters 
apache_beam/io/gcp/bigquery_read_it_test.py::ReadUsingStorageApiTests::test_iobase_source_with_row_restriction 
[gw0] PASSED apache_beam/io/gcp/bigquery_read_it_test.py::ReadUsingStorageApiTests::test_iobase_source_with_row_restriction 
apache_beam/io/gcp/bigquery_read_it_test.py::ReadUsingStorageApiTests::test_iobase_source_with_very_selective_filters 
[gw7] PASSED apache_beam/io/gcp/bigquery_test.py::PubSubBigQueryIT::test_streaming_inserts 
apache_beam/io/gcp/bigquery_test.py::BigQueryFileLoadsIntegrationTests::test_avro_file_load 
[gw0] PASSED apache_beam/io/gcp/bigquery_read_it_test.py::ReadUsingStorageApiTests::test_iobase_source_with_very_selective_filters 
apache_beam/io/gcp/bigquery_read_it_test.py::ReadNewTypesTests::test_iobase_source 
[gw7] PASSED apache_beam/io/gcp/bigquery_test.py::BigQueryFileLoadsIntegrationTests::test_avro_file_load 
[gw0] PASSED apache_beam/io/gcp/bigquery_read_it_test.py::ReadNewTypesTests::test_iobase_source 
apache_beam/io/gcp/bigquery_read_it_test.py::ReadNewTypesTests::test_native_source 
[gw0] PASSED apache_beam/io/gcp/bigquery_read_it_test.py::ReadNewTypesTests::test_native_source 
apache_beam/io/gcp/bigquery_read_it_test.py::ReadAllBQTests::test_read_queries 
[gw0] PASSED apache_beam/io/gcp/bigquery_read_it_test.py::ReadAllBQTests::test_read_queries 
apache_beam/io/gcp/bigquery_read_it_test.py::ReadInteractiveRunnerTests::test_read_in_interactive_runner 
[gw0] PASSED apache_beam/io/gcp/bigquery_read_it_test.py::ReadInteractiveRunnerTests::test_read_in_interactive_runner 

=================================== FAILURES ===================================
_________________________ TaxirideIT.test_aggregation __________________________
[gw7] linux -- Python 3.11.2 <https://ci-beam.apache.org/job/beam_PostCommit_Python311/ws/src/build/gradleenv/2050596099/bin/python3.11>

self = <apache_beam.examples.dataframe.taxiride_it_test.TaxirideIT testMethod=test_aggregation>

    @pytest.mark.it_postcommit
    def test_aggregation(self):
      taxiride.run_aggregation_pipeline(
          self.test_pipeline,
          'gs://apache-beam-samples/nyc_taxi/2018/*.csv',
          self.output_path)
    
      # Verify
      expected = pd.read_csv(
          os.path.join(
              os.path.dirname(__file__),
              'data',
              'taxiride_2018_aggregation_truth.csv'),
          comment='#')
      expected = expected.sort_values('DOLocationID').reset_index(drop=True)
    
      def read_csv(path):
        with FileSystems.open(path) as fp:
          return pd.read_csv(fp)
    
      result = pd.concat(
          read_csv(metadata.path) for metadata in FileSystems.match(
              [f'{self.output_path}*'])[0].metadata_list)
      result = result.sort_values('DOLocationID').reset_index(drop=True)
    
>     pd.testing.assert_frame_equal(expected, result)
E     AssertionError: DataFrame are different
E     
E     DataFrame shape mismatch
E     [left]:  (264, 2)
E     [right]: (471, 2)

apache_beam/examples/dataframe/taxiride_it_test.py:72: AssertionError
------------------------------ Captured log call -------------------------------
INFO     root:transforms.py:182 Computing dataframe stage <ComputeStage(PTransform) label=[[ComputedExpression[set_index_DataFrame_139713776494992], ComputedExpression[pre_combine_sum_Series_139713776772112]]:139713776778192]> for Stage[inputs={PlaceholderExpression[placeholder_DataFrame_139713778052816]}, partitioning=Arbitrary, ops=[ComputedExpression[set_index_DataFrame_139713776494992], ComputedExpression[pre_combine_sum_Series_139713776772112]], outputs={ComputedExpression[pre_combine_sum_Series_139713776772112], PlaceholderExpression[placeholder_DataFrame_139713778052816]}]
INFO     root:transforms.py:182 Computing dataframe stage <ComputeStage(PTransform) label=[[ComputedExpression[post_combine_sum_Series_139713776488528]]:139713776650384]> for Stage[inputs={ComputedExpression[pre_combine_sum_Series_139713776772112]}, partitioning=Index, ops=[ComputedExpression[post_combine_sum_Series_139713776488528]], outputs={ComputedExpression[post_combine_sum_Series_139713776488528]}]
INFO     apache_beam.io.fileio:fileio.py:611 Added temporary directory gs://temp-storage-for-end-to-end-tests/temp-it/.temp172ad7db-7817-43fb-a2d0-961c084dd202
INFO     apache_beam.runners.portability.stager:stager.py:761 Executing command: ['<https://ci-beam.apache.org/job/beam_PostCommit_Python311/ws/src/build/gradleenv/2050596099/bin/python3.11',> '-m', 'pip', 'download', '--dest', '/tmp/dataflow-requirements-cache', '-r', '/tmp/tmp6cndaxz8/tmp_requirements.txt', '--exists-action', 'i', '--no-deps', '--implementation', 'cp', '--abi', 'cp311', '--platform', 'manylinux2014_x86_64']
INFO     apache_beam.runners.portability.stager:stager.py:322 Copying Beam SDK "<https://ci-beam.apache.org/job/beam_PostCommit_Python311/ws/src/sdks/python/build/apache_beam-2.53.0.dev0-cp311-cp311-manylinux_2_17_x86_64.manylinux2014_x86_64.whl"> to staging location.
INFO     apache_beam.runners.dataflow.dataflow_runner:dataflow_runner.py:395 Pipeline has additional dependencies to be installed in SDK worker container, consider using the SDK container image pre-building workflow to avoid repetitive installations. Learn more on https://cloud.google.com/dataflow/docs/guides/using-custom-containers#prebuild
INFO     root:environments.py:313 Using provided Python SDK container image: gcr.io/cloud-dataflow/v1beta3/beam_python3.11_sdk:beam-master-20231116
INFO     root:environments.py:320 Python SDK container image set to "gcr.io/cloud-dataflow/v1beta3/beam_python3.11_sdk:beam-master-20231116" for Docker environment
INFO     apache_beam.runners.portability.fn_api_runner.translations:translations.py:712 ==================== <function pack_combiners at 0x7f11d70b5620> ====================
INFO     apache_beam.runners.portability.fn_api_runner.translations:translations.py:712 ==================== <function sort_stages at 0x7f11d70b5ee0> ====================
INFO     apache_beam.runners.dataflow.internal.apiclient:apiclient.py:673 Starting GCS upload to gs://temp-storage-for-end-to-end-tests/staging-it/beamapp-jenkins-1119230957-610190-39d3hhnd.1700435397.610341/requirements.txt...
INFO     apache_beam.runners.dataflow.internal.apiclient:apiclient.py:683 Completed GCS upload to gs://temp-storage-for-end-to-end-tests/staging-it/beamapp-jenkins-1119230957-610190-39d3hhnd.1700435397.610341/requirements.txt in 0 seconds.
INFO     apache_beam.runners.dataflow.internal.apiclient:apiclient.py:673 Starting GCS upload to gs://temp-storage-for-end-to-end-tests/staging-it/beamapp-jenkins-1119230957-610190-39d3hhnd.1700435397.610341/mock-2.0.0-py2.py3-none-any.whl...
INFO     apache_beam.runners.dataflow.internal.apiclient:apiclient.py:683 Completed GCS upload to gs://temp-storage-for-end-to-end-tests/staging-it/beamapp-jenkins-1119230957-610190-39d3hhnd.1700435397.610341/mock-2.0.0-py2.py3-none-any.whl in 0 seconds.
INFO     apache_beam.runners.dataflow.internal.apiclient:apiclient.py:673 Starting GCS upload to gs://temp-storage-for-end-to-end-tests/staging-it/beamapp-jenkins-1119230957-610190-39d3hhnd.1700435397.610341/seaborn-0.13.0-py3-none-any.whl...
INFO     apache_beam.runners.dataflow.internal.apiclient:apiclient.py:683 Completed GCS upload to gs://temp-storage-for-end-to-end-tests/staging-it/beamapp-jenkins-1119230957-610190-39d3hhnd.1700435397.610341/seaborn-0.13.0-py3-none-any.whl in 0 seconds.
INFO     apache_beam.runners.dataflow.internal.apiclient:apiclient.py:673 Starting GCS upload to gs://temp-storage-for-end-to-end-tests/staging-it/beamapp-jenkins-1119230957-610190-39d3hhnd.1700435397.610341/PyHamcrest-1.10.1-py3-none-any.whl...
INFO     apache_beam.runners.dataflow.internal.apiclient:apiclient.py:683 Completed GCS upload to gs://temp-storage-for-end-to-end-tests/staging-it/beamapp-jenkins-1119230957-610190-39d3hhnd.1700435397.610341/PyHamcrest-1.10.1-py3-none-any.whl in 0 seconds.
INFO     apache_beam.runners.dataflow.internal.apiclient:apiclient.py:673 Starting GCS upload to gs://temp-storage-for-end-to-end-tests/staging-it/beamapp-jenkins-1119230957-610190-39d3hhnd.1700435397.610341/beautifulsoup4-4.12.2-py3-none-any.whl...
INFO     apache_beam.runners.dataflow.internal.apiclient:apiclient.py:683 Completed GCS upload to gs://temp-storage-for-end-to-end-tests/staging-it/beamapp-jenkins-1119230957-610190-39d3hhnd.1700435397.610341/beautifulsoup4-4.12.2-py3-none-any.whl in 0 seconds.
INFO     apache_beam.runners.dataflow.internal.apiclient:apiclient.py:673 Starting GCS upload to gs://temp-storage-for-end-to-end-tests/staging-it/beamapp-jenkins-1119230957-610190-39d3hhnd.1700435397.610341/parameterized-0.7.5-py2.py3-none-any.whl...
INFO     apache_beam.runners.dataflow.internal.apiclient:apiclient.py:683 Completed GCS upload to gs://temp-storage-for-end-to-end-tests/staging-it/beamapp-jenkins-1119230957-610190-39d3hhnd.1700435397.610341/parameterized-0.7.5-py2.py3-none-any.whl in 0 seconds.
INFO     apache_beam.runners.dataflow.internal.apiclient:apiclient.py:673 Starting GCS upload to gs://temp-storage-for-end-to-end-tests/staging-it/beamapp-jenkins-1119230957-610190-39d3hhnd.1700435397.610341/matplotlib-3.8.1-cp310-cp310-manylinux_2_17_x86_64.manylinux2014_x86_64.whl...
INFO     apache_beam.runners.dataflow.internal.apiclient:apiclient.py:683 Completed GCS upload to gs://temp-storage-for-end-to-end-tests/staging-it/beamapp-jenkins-1119230957-610190-39d3hhnd.1700435397.610341/matplotlib-3.8.1-cp310-cp310-manylinux_2_17_x86_64.manylinux2014_x86_64.whl in 0 seconds.
INFO     apache_beam.runners.dataflow.internal.apiclient:apiclient.py:673 Starting GCS upload to gs://temp-storage-for-end-to-end-tests/staging-it/beamapp-jenkins-1119230957-610190-39d3hhnd.1700435397.610341/matplotlib-3.8.1-cp311-cp311-manylinux_2_17_x86_64.manylinux2014_x86_64.whl...
INFO     apache_beam.runners.dataflow.internal.apiclient:apiclient.py:683 Completed GCS upload to gs://temp-storage-for-end-to-end-tests/staging-it/beamapp-jenkins-1119230957-610190-39d3hhnd.1700435397.610341/matplotlib-3.8.1-cp311-cp311-manylinux_2_17_x86_64.manylinux2014_x86_64.whl in 0 seconds.
INFO     apache_beam.runners.dataflow.internal.apiclient:apiclient.py:673 Starting GCS upload to gs://temp-storage-for-end-to-end-tests/staging-it/beamapp-jenkins-1119230957-610190-39d3hhnd.1700435397.610341/matplotlib-3.8.2-cp311-cp311-manylinux_2_17_x86_64.manylinux2014_x86_64.whl...
INFO     apache_beam.runners.dataflow.internal.apiclient:apiclient.py:683 Completed GCS upload to gs://temp-storage-for-end-to-end-tests/staging-it/beamapp-jenkins-1119230957-610190-39d3hhnd.1700435397.610341/matplotlib-3.8.2-cp311-cp311-manylinux_2_17_x86_64.manylinux2014_x86_64.whl in 1 seconds.
INFO     apache_beam.runners.dataflow.internal.apiclient:apiclient.py:673 Starting GCS upload to gs://temp-storage-for-end-to-end-tests/staging-it/beamapp-jenkins-1119230957-610190-39d3hhnd.1700435397.610341/scikit_learn-1.0.2-cp310-cp310-manylinux_2_17_x86_64.manylinux2014_x86_64.whl...
INFO     apache_beam.runners.dataflow.internal.apiclient:apiclient.py:683 Completed GCS upload to gs://temp-storage-for-end-to-end-tests/staging-it/beamapp-jenkins-1119230957-610190-39d3hhnd.1700435397.610341/scikit_learn-1.0.2-cp310-cp310-manylinux_2_17_x86_64.manylinux2014_x86_64.whl in 0 seconds.
INFO     apache_beam.runners.dataflow.internal.apiclient:apiclient.py:673 Starting GCS upload to gs://temp-storage-for-end-to-end-tests/staging-it/beamapp-jenkins-1119230957-610190-39d3hhnd.1700435397.610341/scikit_learn-1.2.2-cp311-cp311-manylinux_2_17_x86_64.manylinux2014_x86_64.whl...
INFO     apache_beam.runners.dataflow.internal.apiclient:apiclient.py:683 Completed GCS upload to gs://temp-storage-for-end-to-end-tests/staging-it/beamapp-jenkins-1119230957-610190-39d3hhnd.1700435397.610341/scikit_learn-1.2.2-cp311-cp311-manylinux_2_17_x86_64.manylinux2014_x86_64.whl in 0 seconds.
INFO     apache_beam.runners.dataflow.internal.apiclient:apiclient.py:673 Starting GCS upload to gs://temp-storage-for-end-to-end-tests/staging-it/beamapp-jenkins-1119230957-610190-39d3hhnd.1700435397.610341/apache_beam-2.53.0.dev0-cp311-cp311-manylinux_2_17_x86_64.manylinux2014_x86_64.whl...
INFO     apache_beam.runners.dataflow.internal.apiclient:apiclient.py:683 Completed GCS upload to gs://temp-storage-for-end-to-end-tests/staging-it/beamapp-jenkins-1119230957-610190-39d3hhnd.1700435397.610341/apache_beam-2.53.0.dev0-cp311-cp311-manylinux_2_17_x86_64.manylinux2014_x86_64.whl in 0 seconds.
INFO     apache_beam.runners.dataflow.internal.apiclient:apiclient.py:673 Starting GCS upload to gs://temp-storage-for-end-to-end-tests/staging-it/beamapp-jenkins-1119230957-610190-39d3hhnd.1700435397.610341/pipeline.pb...
INFO     apache_beam.runners.dataflow.internal.apiclient:apiclient.py:683 Completed GCS upload to gs://temp-storage-for-end-to-end-tests/staging-it/beamapp-jenkins-1119230957-610190-39d3hhnd.1700435397.610341/pipeline.pb in 0 seconds.
INFO     apache_beam.runners.dataflow.internal.apiclient:apiclient.py:854 Create job: <Job
 clientRequestId: '20231119230957611135-9503'
 createTime: '2023-11-19T23:10:02.772406Z'
 currentStateTime: '1970-01-01T00:00:00Z'
 id: '2023-11-19_15_10_02-13327051872394097004'
 location: 'us-central1'
 name: 'beamapp-jenkins-1119230957-610190-39d3hhnd'
 projectId: 'apache-beam-testing'
 stageStates: []
 startTime: '2023-11-19T23:10:02.772406Z'
 steps: []
 tempFiles: []
 type: TypeValueValuesEnum(JOB_TYPE_BATCH, 1)>
INFO     apache_beam.runners.dataflow.internal.apiclient:apiclient.py:856 Created job with id: [2023-11-19_15_10_02-13327051872394097004]
INFO     apache_beam.runners.dataflow.internal.apiclient:apiclient.py:857 Submitted job: 2023-11-19_15_10_02-13327051872394097004
INFO     apache_beam.runners.dataflow.internal.apiclient:apiclient.py:858 To access the Dataflow monitoring console, please navigate to https://console.cloud.google.com/dataflow/jobs/us-central1/2023-11-19_15_10_02-13327051872394097004?project=apache-beam-testing
INFO     apache_beam.runners.dataflow.test_dataflow_runner:test_dataflow_runner.py:58 Console log: 
INFO     apache_beam.runners.dataflow.test_dataflow_runner:test_dataflow_runner.py:59 https://console.cloud.google.com/dataflow/jobs/us-central1/2023-11-19_15_10_02-13327051872394097004?project=apache-beam-testing
INFO     apache_beam.runners.dataflow.dataflow_runner:dataflow_runner.py:150 Job 2023-11-19_15_10_02-13327051872394097004 is in state JOB_STATE_RUNNING
INFO     apache_beam.runners.dataflow.dataflow_runner:dataflow_runner.py:200 2023-11-19T23:10:06.320Z: JOB_MESSAGE_BASIC: Worker configuration: e2-standard-2 in us-central1-b.
INFO     apache_beam.runners.dataflow.dataflow_runner:dataflow_runner.py:200 2023-11-19T23:10:09.284Z: JOB_MESSAGE_BASIC: Executing operation _ReadFromPandas/Reshuffle/ReshufflePerKey/GroupByKey/Create
INFO     apache_beam.runners.dataflow.dataflow_runner:dataflow_runner.py:200 2023-11-19T23:10:09.337Z: JOB_MESSAGE_BASIC: Starting 1 workers in us-central1-b...
INFO     apache_beam.runners.dataflow.dataflow_runner:dataflow_runner.py:200 2023-11-19T23:10:09.863Z: JOB_MESSAGE_BASIC: Finished operation _ReadFromPandas/Reshuffle/ReshufflePerKey/GroupByKey/Create
INFO     apache_beam.runners.dataflow.dataflow_runner:dataflow_runner.py:200 2023-11-19T23:10:18.541Z: JOB_MESSAGE_BASIC: Executing operation _ReadFromPandas/Create/Impulse+_ReadFromPandas/Create/FlatMap(<lambda at core.py:3774>)+_ReadFromPandas/Create/Map(decode)+_ReadFromPandas/MatchAll/ParDo(_MatchAllFn)+_ReadFromPandas/Map(<lambda at io.py:299>)+_ReadFromPandas/Reshuffle/AddRandomKeys+_ReadFromPandas/Reshuffle/ReshufflePerKey/Map(reify_timestamps)+_ReadFromPandas/Reshuffle/ReshufflePerKey/GroupByKey/Reify+_ReadFromPandas/Reshuffle/ReshufflePerKey/GroupByKey/Write
INFO     apache_beam.runners.dataflow.dataflow_runner:dataflow_runner.py:200 2023-11-19T23:10:39.848Z: JOB_MESSAGE_BASIC: Your project already contains 100 Dataflow-created metric descriptors, so new user metrics of the form custom.googleapis.com/* will not be created. However, all user metrics are also available in the metric dataflow.googleapis.com/job/user_counter. If you rely on the custom metrics, you can delete old / unused metric descriptors. See https://developers.google.com/apis-explorer/#p/monitoring/v3/monitoring.projects.metricDescriptors.list and https://developers.google.com/apis-explorer/#p/monitoring/v3/monitoring.projects.metricDescriptors.delete
INFO     apache_beam.runners.dataflow.dataflow_runner:dataflow_runner.py:200 2023-11-19T23:12:57.154Z: JOB_MESSAGE_BASIC: All workers have finished the startup processes and began to receive work requests.
INFO     apache_beam.runners.dataflow.dataflow_runner:dataflow_runner.py:200 2023-11-19T23:12:58.452Z: JOB_MESSAGE_BASIC: Finished operation _ReadFromPandas/Create/Impulse+_ReadFromPandas/Create/FlatMap(<lambda at core.py:3774>)+_ReadFromPandas/Create/Map(decode)+_ReadFromPandas/MatchAll/ParDo(_MatchAllFn)+_ReadFromPandas/Map(<lambda at io.py:299>)+_ReadFromPandas/Reshuffle/AddRandomKeys+_ReadFromPandas/Reshuffle/ReshufflePerKey/Map(reify_timestamps)+_ReadFromPandas/Reshuffle/ReshufflePerKey/GroupByKey/Reify+_ReadFromPandas/Reshuffle/ReshufflePerKey/GroupByKey/Write
INFO     apache_beam.runners.dataflow.dataflow_runner:dataflow_runner.py:200 2023-11-19T23:12:58.530Z: JOB_MESSAGE_BASIC: Executing operation _ReadFromPandas/Reshuffle/ReshufflePerKey/GroupByKey/Close
INFO     apache_beam.runners.dataflow.dataflow_runner:dataflow_runner.py:200 2023-11-19T23:12:58.547Z: JOB_MESSAGE_BASIC: Executing operation _ReadFromPandas/Map(<lambda at io.py:295>)/View-python_side_input0
INFO     apache_beam.runners.dataflow.dataflow_runner:dataflow_runner.py:200 2023-11-19T23:12:58.590Z: JOB_MESSAGE_BASIC: Finished operation _ReadFromPandas/Map(<lambda at io.py:295>)/View-python_side_input0
INFO     apache_beam.runners.dataflow.dataflow_runner:dataflow_runner.py:200 2023-11-19T23:12:58.676Z: JOB_MESSAGE_BASIC: Executing operation _ReadFromPandas/DoOnce/Impulse+_ReadFromPandas/DoOnce/FlatMap(<lambda at core.py:3774>)+_ReadFromPandas/DoOnce/Map(decode)+_ReadFromPandas/Map(<lambda at io.py:295>)
INFO     apache_beam.runners.dataflow.dataflow_runner:dataflow_runner.py:200 2023-11-19T23:12:58.869Z: JOB_MESSAGE_BASIC: Finished operation _ReadFromPandas/Reshuffle/ReshufflePerKey/GroupByKey/Close
INFO     apache_beam.runners.dataflow.dataflow_runner:dataflow_runner.py:200 2023-11-19T23:13:00.451Z: JOB_MESSAGE_BASIC: Finished operation _ReadFromPandas/DoOnce/Impulse+_ReadFromPandas/DoOnce/FlatMap(<lambda at core.py:3774>)+_ReadFromPandas/DoOnce/Map(decode)+_ReadFromPandas/Map(<lambda at io.py:295>)
INFO     apache_beam.runners.dataflow.dataflow_runner:dataflow_runner.py:200 2023-11-19T23:13:00.544Z: JOB_MESSAGE_BASIC: Executing operation _ReadFromPandas/ParDo(_ReadFromPandasDoFn)/View-python_side_input0
INFO     apache_beam.runners.dataflow.dataflow_runner:dataflow_runner.py:200 2023-11-19T23:13:00.591Z: JOB_MESSAGE_BASIC: Finished operation _ReadFromPandas/ParDo(_ReadFromPandasDoFn)/View-python_side_input0
INFO     apache_beam.runners.dataflow.dataflow_runner:dataflow_runner.py:200 2023-11-19T23:13:00.679Z: JOB_MESSAGE_BASIC: Executing operation _ReadFromPandas/Reshuffle/ReshufflePerKey/GroupByKey/Read+_ReadFromPandas/Reshuffle/ReshufflePerKey/GroupByKey/GroupByWindow+_ReadFromPandas/Reshuffle/ReshufflePerKey/FlatMap(restore_timestamps)+_ReadFromPandas/Reshuffle/RemoveRandomKeys+_ReadFromPandas/ReadMatches/ParDo(_ReadMatchesFn)+ref_AppliedPTransform__ReadFromPandas-ParDo-_ReadFromPandasDoFn-_26/PairWithRestriction+ref_AppliedPTransform__ReadFromPandas-ParDo-_ReadFromPandasDoFn-_26/SplitWithSizing
INFO     apache_beam.runners.dataflow.dataflow_runner:dataflow_runner.py:200 2023-11-19T23:13:02.956Z: JOB_MESSAGE_BASIC: Finished operation _ReadFromPandas/Reshuffle/ReshufflePerKey/GroupByKey/Read+_ReadFromPandas/Reshuffle/ReshufflePerKey/GroupByKey/GroupByWindow+_ReadFromPandas/Reshuffle/ReshufflePerKey/FlatMap(restore_timestamps)+_ReadFromPandas/Reshuffle/RemoveRandomKeys+_ReadFromPandas/ReadMatches/ParDo(_ReadMatchesFn)+ref_AppliedPTransform__ReadFromPandas-ParDo-_ReadFromPandasDoFn-_26/PairWithRestriction+ref_AppliedPTransform__ReadFromPandas-ParDo-_ReadFromPandasDoFn-_26/SplitWithSizing
INFO     apache_beam.runners.dataflow.dataflow_runner:dataflow_runner.py:200 2023-11-19T23:13:03.060Z: JOB_MESSAGE_BASIC: Executing operation ToPCollection(df) - gs://temp-storage-for-end-to-end-tests/temp-it/taxiride_it-cdcc9d81-b56e-4d92-9faf-b477eefd093c/output.csv/[ComputedExpression[post_combine_sum_Series_139713776488528]]:139713776650384/CoGroupByKey/CoGroupByKeyImpl/GroupByKey/Create
INFO     apache_beam.runners.dataflow.dataflow_runner:dataflow_runner.py:200 2023-11-19T23:13:03.420Z: JOB_MESSAGE_BASIC: Finished operation ToPCollection(df) - gs://temp-storage-for-end-to-end-tests/temp-it/taxiride_it-cdcc9d81-b56e-4d92-9faf-b477eefd093c/output.csv/[ComputedExpression[post_combine_sum_Series_139713776488528]]:139713776650384/CoGroupByKey/CoGroupByKeyImpl/GroupByKey/Create
INFO     apache_beam.runners.dataflow.dataflow_runner:dataflow_runner.py:200 2023-11-19T23:13:03.512Z: JOB_MESSAGE_BASIC: Executing operation ref_AppliedPTransform__ReadFromPandas-ParDo-_ReadFromPandasDoFn-_26/ProcessElementAndRestrictionWithSizing+ToPCollection(df) - gs://temp-storage-for-end-to-end-tests/temp-it/taxiride_it-cdcc9d81-b56e-4d92-9faf-b477eefd093c/output.csv/[ComputedExpression[set_index_DataFrame_139713776494992], ComputedExpression[pre_combine_sum_Series_139713776772112]]:139713776778192/Map(<lambda at transforms.py:245>)+ToPCollection(df) - gs://temp-storage-for-end-to-end-tests/temp-it/taxiride_it-cdcc9d81-b56e-4d92-9faf-b477eefd093c/output.csv/[ComputedExpression[set_index_DataFrame_139713776494992], ComputedExpression[pre_combine_sum_Series_139713776772112]]:139713776778192/FlatMap(evaluate)/FlatMap(evaluate)+ToPCollection(df) - gs://temp-storage-for-end-to-end-tests/temp-it/taxiride_it-cdcc9d81-b56e-4d92-9faf-b477eefd093c/output.csv/[ComputedExpression[post_combine_sum_Series_139713776488528]]:139713776650384/Partition_Index_pre_combine_sum_Series_139713776772112/ParDo(_PreBatch)+ToPCollection(df) - gs://temp-storage-for-end-to-end-tests/temp-it/taxiride_it-cdcc9d81-b56e-4d92-9faf-b477eefd093c/output.csv/[ComputedExpression[post_combine_sum_Series_139713776488528]]:139713776650384/Partition_Index_pre_combine_sum_Series_139713776772112/FlatMap(partition_fn)+ToPCollection(df) - gs://temp-storage-for-end-to-end-tests/temp-it/taxiride_it-cdcc9d81-b56e-4d92-9faf-b477eefd093c/output.csv/[ComputedExpression[post_combine_sum_Series_139713776488528]]:139713776650384/Partition_Index_pre_combine_sum_Series_139713776772112/Filter(<lambda at transforms.py:231>)+ToPCollection(df) - gs://temp-storage-for-end-to-end-tests/temp-it/taxiride_it-cdcc9d81-b56e-4d92-9faf-b477eefd093c/output.csv/[ComputedExpression[post_combine_sum_Series_139713776488528]]:139713776650384/CoGroupByKey/CoGroupByKeyImpl/Tag[0]+ToPCollection(df) - gs://temp-storage-for-end-to-end-tests/temp-it/taxiride_it-cdcc9d81-b56e-4d92-9faf-b477eefd093c/output.csv/[ComputedExpression[post_combine_sum_Series_139713776488528]]:139713776650384/CoGroupByKey/CoGroupByKeyImpl/Flatten/OutputIdentity+ToPCollection(df) - gs://temp-storage-for-end-to-end-tests/temp-it/taxiride_it-cdcc9d81-b56e-4d92-9faf-b477eefd093c/output.csv/[ComputedExpression[post_combine_sum_Series_139713776488528]]:139713776650384/CoGroupByKey/CoGroupByKeyImpl/GroupByKey/Write
INFO     apache_beam.runners.dataflow.dataflow_runner:dataflow_runner.py:200 2023-11-19T23:15:52.713Z: JOB_MESSAGE_BASIC: Finished operation ref_AppliedPTransform__ReadFromPandas-ParDo-_ReadFromPandasDoFn-_26/ProcessElementAndRestrictionWithSizing+ToPCollection(df) - gs://temp-storage-for-end-to-end-tests/temp-it/taxiride_it-cdcc9d81-b56e-4d92-9faf-b477eefd093c/output.csv/[ComputedExpression[set_index_DataFrame_139713776494992], ComputedExpression[pre_combine_sum_Series_139713776772112]]:139713776778192/Map(<lambda at transforms.py:245>)+ToPCollection(df) - gs://temp-storage-for-end-to-end-tests/temp-it/taxiride_it-cdcc9d81-b56e-4d92-9faf-b477eefd093c/output.csv/[ComputedExpression[set_index_DataFrame_139713776494992], ComputedExpression[pre_combine_sum_Series_139713776772112]]:139713776778192/FlatMap(evaluate)/FlatMap(evaluate)+ToPCollection(df) - gs://temp-storage-for-end-to-end-tests/temp-it/taxiride_it-cdcc9d81-b56e-4d92-9faf-b477eefd093c/output.csv/[ComputedExpression[post_combine_sum_Series_139713776488528]]:139713776650384/Partition_Index_pre_combine_sum_Series_139713776772112/ParDo(_PreBatch)+ToPCollection(df) - gs://temp-storage-for-end-to-end-tests/temp-it/taxiride_it-cdcc9d81-b56e-4d92-9faf-b477eefd093c/output.csv/[ComputedExpression[post_combine_sum_Series_139713776488528]]:139713776650384/Partition_Index_pre_combine_sum_Series_139713776772112/FlatMap(partition_fn)+ToPCollection(df) - gs://temp-storage-for-end-to-end-tests/temp-it/taxiride_it-cdcc9d81-b56e-4d92-9faf-b477eefd093c/output.csv/[ComputedExpression[post_combine_sum_Series_139713776488528]]:139713776650384/Partition_Index_pre_combine_sum_Series_139713776772112/Filter(<lambda at transforms.py:231>)+ToPCollection(df) - gs://temp-storage-for-end-to-end-tests/temp-it/taxiride_it-cdcc9d81-b56e-4d92-9faf-b477eefd093c/output.csv/[ComputedExpression[post_combine_sum_Series_139713776488528]]:139713776650384/CoGroupByKey/CoGroupByKeyImpl/Tag[0]+ToPCollection(df) - gs://temp-storage-for-end-to-end-tests/temp-it/taxiride_it-cdcc9d81-b56e-4d92-9faf-b477eefd093c/output.csv/[ComputedExpression[post_combine_sum_Series_139713776488528]]:139713776650384/CoGroupByKey/CoGroupByKeyImpl/Flatten/OutputIdentity+ToPCollection(df) - gs://temp-storage-for-end-to-end-tests/temp-it/taxiride_it-cdcc9d81-b56e-4d92-9faf-b477eefd093c/output.csv/[ComputedExpression[post_combine_sum_Series_139713776488528]]:139713776650384/CoGroupByKey/CoGroupByKeyImpl/GroupByKey/Write
INFO     apache_beam.runners.dataflow.dataflow_runner:dataflow_runner.py:200 2023-11-19T23:15:52.762Z: JOB_MESSAGE_BASIC: Executing operation ToPCollection(df) - gs://temp-storage-for-end-to-end-tests/temp-it/taxiride_it-cdcc9d81-b56e-4d92-9faf-b477eefd093c/output.csv/[ComputedExpression[post_combine_sum_Series_139713776488528]]:139713776650384/CoGroupByKey/CoGroupByKeyImpl/GroupByKey/Close
INFO     apache_beam.runners.dataflow.dataflow_runner:dataflow_runner.py:200 2023-11-19T23:15:52.854Z: JOB_MESSAGE_BASIC: Finished operation ToPCollection(df) - gs://temp-storage-for-end-to-end-tests/temp-it/taxiride_it-cdcc9d81-b56e-4d92-9faf-b477eefd093c/output.csv/[ComputedExpression[post_combine_sum_Series_139713776488528]]:139713776650384/CoGroupByKey/CoGroupByKeyImpl/GroupByKey/Close
INFO     apache_beam.runners.dataflow.dataflow_runner:dataflow_runner.py:200 2023-11-19T23:15:52.896Z: JOB_MESSAGE_BASIC: Executing operation WriteToPandas(df) - gs://temp-storage-for-end-to-end-tests/temp-it/taxiride_it-cdcc9d81-b56e-4d92-9faf-b477eefd093c/output.csv/WriteToFiles/GroupRecordsByDestinationAndShard/Create
INFO     apache_beam.runners.dataflow.dataflow_runner:dataflow_runner.py:200 2023-11-19T23:15:53.048Z: JOB_MESSAGE_BASIC: Finished operation WriteToPandas(df) - gs://temp-storage-for-end-to-end-tests/temp-it/taxiride_it-cdcc9d81-b56e-4d92-9faf-b477eefd093c/output.csv/WriteToFiles/GroupRecordsByDestinationAndShard/Create
INFO     apache_beam.runners.dataflow.dataflow_runner:dataflow_runner.py:200 2023-11-19T23:15:53.136Z: JOB_MESSAGE_BASIC: Executing operation WriteToPandas(df) - gs://temp-storage-for-end-to-end-tests/temp-it/taxiride_it-cdcc9d81-b56e-4d92-9faf-b477eefd093c/output.csv/WriteToFiles/GroupTempFilesByDestination/Create
INFO     apache_beam.runners.dataflow.dataflow_runner:dataflow_runner.py:200 2023-11-19T23:15:53.374Z: JOB_MESSAGE_BASIC: Finished operation WriteToPandas(df) - gs://temp-storage-for-end-to-end-tests/temp-it/taxiride_it-cdcc9d81-b56e-4d92-9faf-b477eefd093c/output.csv/WriteToFiles/GroupTempFilesByDestination/Create
INFO     apache_beam.runners.dataflow.dataflow_runner:dataflow_runner.py:200 2023-11-19T23:15:53.470Z: JOB_MESSAGE_BASIC: Executing operation ToPCollection(df) - gs://temp-storage-for-end-to-end-tests/temp-it/taxiride_it-cdcc9d81-b56e-4d92-9faf-b477eefd093c/output.csv/[ComputedExpression[post_combine_sum_Series_139713776488528]]:139713776650384/CoGroupByKey/CoGroupByKeyImpl/GroupByKey/Read+ToPCollection(df) - gs://temp-storage-for-end-to-end-tests/temp-it/taxiride_it-cdcc9d81-b56e-4d92-9faf-b477eefd093c/output.csv/[ComputedExpression[post_combine_sum_Series_139713776488528]]:139713776650384/CoGroupByKey/CoGroupByKeyImpl/MapTuple(collect_values)+ToPCollection(df) - gs://temp-storage-for-end-to-end-tests/temp-it/taxiride_it-cdcc9d81-b56e-4d92-9faf-b477eefd093c/output.csv/[ComputedExpression[post_combine_sum_Series_139713776488528]]:139713776650384/CoGroupByKey/RestoreTags+ToPCollection(df) - gs://temp-storage-for-end-to-end-tests/temp-it/taxiride_it-cdcc9d81-b56e-4d92-9faf-b477eefd093c/output.csv/[ComputedExpression[post_combine_sum_Series_139713776488528]]:139713776650384/ParDo(_ReBatch)+ToPCollection(df) - gs://temp-storage-for-end-to-end-tests/temp-it/taxiride_it-cdcc9d81-b56e-4d92-9faf-b477eefd093c/output.csv/[ComputedExpression[post_combine_sum_Series_139713776488528]]:139713776650384/FlatMap(evaluate)/FlatMap(evaluate)+WriteToPandas(df) - gs://temp-storage-for-end-to-end-tests/temp-it/taxiride_it-cdcc9d81-b56e-4d92-9faf-b477eefd093c/output.csv/WriteToFiles/ParDo(_WriteUnshardedRecordsFn)/ParDo(_WriteUnshardedRecordsFn)+WriteToPandas(df) - gs://temp-storage-for-end-to-end-tests/temp-it/taxiride_it-cdcc9d81-b56e-4d92-9faf-b477eefd093c/output.csv/WriteToFiles/Map(<lambda at fileio.py:640>)+WriteToPandas(df) - gs://temp-storage-for-end-to-end-tests/temp-it/taxiride_it-cdcc9d81-b56e-4d92-9faf-b477eefd093c/output.csv/WriteToFiles/GroupTempFilesByDestination/Write+WriteToPandas(df) - gs://temp-storage-for-end-to-end-tests/temp-it/taxiride_it-cdcc9d81-b56e-4d92-9faf-b477eefd093c/output.csv/WriteToFiles/ParDo(_AppendShardedDestination)+WriteToPandas(df) - gs://temp-storage-for-end-to-end-tests/temp-it/taxiride_it-cdcc9d81-b56e-4d92-9faf-b477eefd093c/output.csv/WriteToFiles/GroupRecordsByDestinationAndShard/Write
INFO     apache_beam.runners.dataflow.dataflow_runner:dataflow_runner.py:200 2023-11-19T23:15:54.274Z: JOB_MESSAGE_BASIC: Finished operation ToPCollection(df) - gs://temp-storage-for-end-to-end-tests/temp-it/taxiride_it-cdcc9d81-b56e-4d92-9faf-b477eefd093c/output.csv/[ComputedExpression[post_combine_sum_Series_139713776488528]]:139713776650384/CoGroupByKey/CoGroupByKeyImpl/GroupByKey/Read+ToPCollection(df) - gs://temp-storage-for-end-to-end-tests/temp-it/taxiride_it-cdcc9d81-b56e-4d92-9faf-b477eefd093c/output.csv/[ComputedExpression[post_combine_sum_Series_139713776488528]]:139713776650384/CoGroupByKey/CoGroupByKeyImpl/MapTuple(collect_values)+ToPCollection(df) - gs://temp-storage-for-end-to-end-tests/temp-it/taxiride_it-cdcc9d81-b56e-4d92-9faf-b477eefd093c/output.csv/[ComputedExpression[post_combine_sum_Series_139713776488528]]:139713776650384/CoGroupByKey/RestoreTags+ToPCollection(df) - gs://temp-storage-for-end-to-end-tests/temp-it/taxiride_it-cdcc9d81-b56e-4d92-9faf-b477eefd093c/output.csv/[ComputedExpression[post_combine_sum_Series_139713776488528]]:139713776650384/ParDo(_ReBatch)+ToPCollection(df) - gs://temp-storage-for-end-to-end-tests/temp-it/taxiride_it-cdcc9d81-b56e-4d92-9faf-b477eefd093c/output.csv/[ComputedExpression[post_combine_sum_Series_139713776488528]]:139713776650384/FlatMap(evaluate)/FlatMap(evaluate)+WriteToPandas(df) - gs://temp-storage-for-end-to-end-tests/temp-it/taxiride_it-cdcc9d81-b56e-4d92-9faf-b477eefd093c/output.csv/WriteToFiles/ParDo(_WriteUnshardedRecordsFn)/ParDo(_WriteUnshardedRecordsFn)+WriteToPandas(df) - gs://temp-storage-for-end-to-end-tests/temp-it/taxiride_it-cdcc9d81-b56e-4d92-9faf-b477eefd093c/output.csv/WriteToFiles/Map(<lambda at fileio.py:640>)+WriteToPandas(df) - gs://temp-storage-for-end-to-end-tests/temp-it/taxiride_it-cdcc9d81-b56e-4d92-9faf-b477eefd093c/output.csv/WriteToFiles/GroupTempFilesByDestination/Write+WriteToPandas(df) - gs://temp-storage-for-end-to-end-tests/temp-it/taxiride_it-cdcc9d81-b56e-4d92-9faf-b477eefd093c/output.csv/WriteToFiles/ParDo(_AppendShardedDestination)+WriteToPandas(df) - gs://temp-storage-for-end-to-end-tests/temp-it/taxiride_it-cdcc9d81-b56e-4d92-9faf-b477eefd093c/output.csv/WriteToFiles/GroupRecordsByDestinationAndShard/Write
INFO     apache_beam.runners.dataflow.dataflow_runner:dataflow_runner.py:200 2023-11-19T23:15:54.325Z: JOB_MESSAGE_BASIC: Executing operation WriteToPandas(df) - gs://temp-storage-for-end-to-end-tests/temp-it/taxiride_it-cdcc9d81-b56e-4d92-9faf-b477eefd093c/output.csv/WriteToFiles/GroupRecordsByDestinationAndShard/Close
INFO     apache_beam.runners.dataflow.dataflow_runner:dataflow_runner.py:200 2023-11-19T23:15:54.373Z: JOB_MESSAGE_BASIC: Finished operation WriteToPandas(df) - gs://temp-storage-for-end-to-end-tests/temp-it/taxiride_it-cdcc9d81-b56e-4d92-9faf-b477eefd093c/output.csv/WriteToFiles/GroupRecordsByDestinationAndShard/Close
INFO     apache_beam.runners.dataflow.dataflow_runner:dataflow_runner.py:200 2023-11-19T23:15:54.413Z: JOB_MESSAGE_BASIC: Executing operation WriteToPandas(df) - gs://temp-storage-for-end-to-end-tests/temp-it/taxiride_it-cdcc9d81-b56e-4d92-9faf-b477eefd093c/output.csv/WriteToFiles/GroupRecordsByDestinationAndShard/Read+WriteToPandas(df) - gs://temp-storage-for-end-to-end-tests/temp-it/taxiride_it-cdcc9d81-b56e-4d92-9faf-b477eefd093c/output.csv/WriteToFiles/ParDo(_WriteShardedRecordsFn)+WriteToPandas(df) - gs://temp-storage-for-end-to-end-tests/temp-it/taxiride_it-cdcc9d81-b56e-4d92-9faf-b477eefd093c/output.csv/WriteToFiles/Map(<lambda at fileio.py:640>)+WriteToPandas(df) - gs://temp-storage-for-end-to-end-tests/temp-it/taxiride_it-cdcc9d81-b56e-4d92-9faf-b477eefd093c/output.csv/WriteToFiles/GroupTempFilesByDestination/Write
INFO     apache_beam.runners.dataflow.dataflow_runner:dataflow_runner.py:200 2023-11-19T23:15:54.734Z: JOB_MESSAGE_BASIC: Finished operation WriteToPandas(df) - gs://temp-storage-for-end-to-end-tests/temp-it/taxiride_it-cdcc9d81-b56e-4d92-9faf-b477eefd093c/output.csv/WriteToFiles/GroupRecordsByDestinationAndShard/Read+WriteToPandas(df) - gs://temp-storage-for-end-to-end-tests/temp-it/taxiride_it-cdcc9d81-b56e-4d92-9faf-b477eefd093c/output.csv/WriteToFiles/ParDo(_WriteShardedRecordsFn)+WriteToPandas(df) - gs://temp-storage-for-end-to-end-tests/temp-it/taxiride_it-cdcc9d81-b56e-4d92-9faf-b477eefd093c/output.csv/WriteToFiles/Map(<lambda at fileio.py:640>)+WriteToPandas(df) - gs://temp-storage-for-end-to-end-tests/temp-it/taxiride_it-cdcc9d81-b56e-4d92-9faf-b477eefd093c/output.csv/WriteToFiles/GroupTempFilesByDestination/Write
INFO     apache_beam.runners.dataflow.dataflow_runner:dataflow_runner.py:200 2023-11-19T23:15:54.787Z: JOB_MESSAGE_BASIC: Executing operation WriteToPandas(df) - gs://temp-storage-for-end-to-end-tests/temp-it/taxiride_it-cdcc9d81-b56e-4d92-9faf-b477eefd093c/output.csv/WriteToFiles/GroupTempFilesByDestination/Close
INFO     apache_beam.runners.dataflow.dataflow_runner:dataflow_runner.py:200 2023-11-19T23:15:54.835Z: JOB_MESSAGE_BASIC: Finished operation WriteToPandas(df) - gs://temp-storage-for-end-to-end-tests/temp-it/taxiride_it-cdcc9d81-b56e-4d92-9faf-b477eefd093c/output.csv/WriteToFiles/GroupTempFilesByDestination/Close
INFO     apache_beam.runners.dataflow.dataflow_runner:dataflow_runner.py:200 2023-11-19T23:15:54.886Z: JOB_MESSAGE_BASIC: Executing operation WriteToPandas(df) - gs://temp-storage-for-end-to-end-tests/temp-it/taxiride_it-cdcc9d81-b56e-4d92-9faf-b477eefd093c/output.csv/WriteToFiles/GroupTempFilesByDestination/Read+WriteToPandas(df) - gs://temp-storage-for-end-to-end-tests/temp-it/taxiride_it-cdcc9d81-b56e-4d92-9faf-b477eefd093c/output.csv/WriteToFiles/ParDo(_MoveTempFilesIntoFinalDestinationFn)
INFO     apache_beam.runners.dataflow.dataflow_runner:dataflow_runner.py:200 2023-11-19T23:15:55.540Z: JOB_MESSAGE_BASIC: Finished operation WriteToPandas(df) - gs://temp-storage-for-end-to-end-tests/temp-it/taxiride_it-cdcc9d81-b56e-4d92-9faf-b477eefd093c/output.csv/WriteToFiles/GroupTempFilesByDestination/Read+WriteToPandas(df) - gs://temp-storage-for-end-to-end-tests/temp-it/taxiride_it-cdcc9d81-b56e-4d92-9faf-b477eefd093c/output.csv/WriteToFiles/ParDo(_MoveTempFilesIntoFinalDestinationFn)
INFO     apache_beam.runners.dataflow.dataflow_runner:dataflow_runner.py:200 2023-11-19T23:15:55.724Z: JOB_MESSAGE_BASIC: Stopping worker pool...
INFO     apache_beam.runners.dataflow.dataflow_runner:dataflow_runner.py:200 2023-11-19T23:18:17.228Z: JOB_MESSAGE_BASIC: Worker pool stopped.
INFO     apache_beam.runners.dataflow.dataflow_runner:dataflow_runner.py:150 Job 2023-11-19_15_10_02-13327051872394097004 is in state JOB_STATE_DONE
INFO     apache_beam.io.gcp.gcsio:gcsio.py:486 Finished listing 1 files in 0.06339883804321289 seconds.
INFO     apache_beam.io.gcp.gcsio:gcsio.py:486 Finished listing 1 files in 0.061226844787597656 seconds.
=============================== warnings summary ===============================
apache_beam/examples/complete/game/hourly_team_score_it_test.py::HourlyTeamScoreIT::test_hourly_team_score_it
apache_beam/examples/complete/game/game_stats_it_test.py::GameStatsIT::test_game_stats_it
apache_beam/examples/complete/game/leader_board_it_test.py::LeaderBoardIT::test_leader_board_it
apache_beam/io/gcp/bigquery_test.py::PubSubBigQueryIT::test_file_loads
apache_beam/io/gcp/bigquery_test.py::PubSubBigQueryIT::test_streaming_inserts
  <https://ci-beam.apache.org/job/beam_PostCommit_Python311/ws/src/sdks/python/apache_beam/io/gcp/tests/utils.py>:63: PendingDeprecationWarning: Client.dataset is deprecated and will be removed in a future version. Use a string like 'my_project.my_dataset' or a cloud.google.bigquery.DatasetReference object, instead.
    dataset_ref = client.dataset(unique_dataset_name, project=project)

apache_beam/examples/cookbook/bigquery_tornadoes_it_test.py::BigqueryTornadoesIT::test_bigquery_tornadoes_it
  <https://ci-beam.apache.org/job/beam_PostCommit_Python311/ws/src/sdks/python/apache_beam/io/gcp/tests/utils.py>:100: PendingDeprecationWarning: Client.dataset is deprecated and will be removed in a future version. Use a string like 'my_project.my_dataset' or a cloud.google.bigquery.DatasetReference object, instead.
    table_ref = client.dataset(dataset_id).table(table_id)

apache_beam/examples/dataframe/flight_delays_it_test.py::FlightDelaysTest::test_flight_delays
  <https://ci-beam.apache.org/job/beam_PostCommit_Python311/ws/src/sdks/python/apache_beam/examples/dataframe/flight_delays.py>:47: FutureWarning: The default value of numeric_only in DataFrame.mean is deprecated. In a future version, it will default to False. In addition, specifying 'numeric_only=None' is deprecated. Select only valid columns or specify the value of numeric_only to silence this warning.
    return airline_df[at_top_airports].mean()

apache_beam/io/gcp/bigquery_read_it_test.py::ReadTests::test_native_source
  <https://ci-beam.apache.org/job/beam_PostCommit_Python311/ws/src/sdks/python/apache_beam/io/gcp/bigquery_read_it_test.py>:170: BeamDeprecationWarning: BigQuerySource is deprecated since 2.25.0. Use ReadFromBigQuery instead.
    beam.io.BigQuerySource(query=self.query, use_standard_sql=True)))

apache_beam/io/gcp/bigquery_read_it_test.py::ReadNewTypesTests::test_native_source
  <https://ci-beam.apache.org/job/beam_PostCommit_Python311/ws/src/sdks/python/apache_beam/io/gcp/bigquery_read_it_test.py>:706: BeamDeprecationWarning: BigQuerySource is deprecated since 2.25.0. Use ReadFromBigQuery instead.
    beam.io.BigQuerySource(query=self.query, use_standard_sql=True)))

-- Docs: https://docs.pytest.org/en/stable/how-to/capture-warnings.html
- generated xml file: <https://ci-beam.apache.org/job/beam_PostCommit_Python311/ws/src/sdks/python/pytest_postCommitIT-df-py311.xml> -
=========================== short test summary info ============================
FAILED apache_beam/examples/dataframe/taxiride_it_test.py::TaxirideIT::test_aggregation - AssertionError: DataFrame are different

DataFrame shape mismatch
[left]:  (264, 2)
[right]: (471, 2)
====== 1 failed, 81 passed, 51 skipped, 9 warnings in 6762.56s (1:52:42) =======

> Task :sdks:python:test-suites:dataflow:py311:postCommitIT FAILED

FAILURE: Build failed with an exception.

* Where:
Script '<https://ci-beam.apache.org/job/beam_PostCommit_Python311/ws/src/sdks/python/test-suites/dataflow/common.gradle'> line: 139

* What went wrong:
Execution failed for task ':sdks:python:test-suites:dataflow:py311:postCommitIT'.
> Process 'command 'sh'' finished with non-zero exit value 1

* Try:
> Run with --stacktrace option to get the stack trace.
> Run with --info or --debug option to get more log output.
> Get more help at https://help.gradle.org.

Deprecated Gradle features were used in this build, making it incompatible with Gradle 9.0.

You can use '--warning-mode all' to show the individual deprecation warnings and determine if they come from your own scripts or plugins.

For more on this, please refer to https://docs.gradle.org/8.4/userguide/command_line_interface.html#sec:command_line_warnings in the Gradle documentation.

BUILD FAILED in 1h 58m 53s
217 actionable tasks: 152 executed, 61 from cache, 4 up-to-date

Publishing build scan...
https://ge.apache.org/s/xedudpjxdejxc

Build step 'Invoke Gradle script' changed build result to FAILURE
Build step 'Invoke Gradle script' marked build as failure


---------------------------------------------------------------------
To unsubscribe, e-mail: builds-unsubscribe@beam.apache.org
For additional commands, e-mail: builds-help@beam.apache.org


Jenkins build is back to normal : beam_PostCommit_Python311 #904

Posted by Apache Jenkins Server <je...@builds.apache.org>.
See <https://ci-beam.apache.org/job/beam_PostCommit_Python311/904/display/redirect>


---------------------------------------------------------------------
To unsubscribe, e-mail: builds-unsubscribe@beam.apache.org
For additional commands, e-mail: builds-help@beam.apache.org