You are viewing a plain text version of this content. The canonical link for it is here.
Posted to builds@beam.apache.org by Apache Jenkins Server <je...@builds.apache.org> on 2023/06/27 16:13:40 UTC
Build failed in Jenkins: beam_Publish_Beam_SDK_Snapshots #5627
See <https://ci-beam.apache.org/job/beam_Publish_Beam_SDK_Snapshots/5627/display/redirect>
Changes:
------------------------------------------
Started by timer
Running as SYSTEM
[EnvInject] - Loading node environment variables.
Building remotely on apache-beam-jenkins-11 (beam) in workspace <https://ci-beam.apache.org/job/beam_Publish_Beam_SDK_Snapshots/ws/>
The recommended git tool is: NONE
No credentials specified
Wiping out workspace first.
Cloning the remote Git repository
Using shallow clone with depth 1
Avoid fetching tags
Cloning repository https://github.com/apache/beam.git
> git init <https://ci-beam.apache.org/job/beam_Publish_Beam_SDK_Snapshots/ws/src> # timeout=10
Fetching upstream changes from https://github.com/apache/beam.git
> git --version # timeout=10
> git --version # 'git version 2.25.1'
> git fetch --no-tags --force --progress --depth=1 -- https://github.com/apache/beam.git +refs/heads/*:refs/remotes/origin/* # timeout=10
> git config remote.origin.url https://github.com/apache/beam.git # timeout=10
> git config --add remote.origin.fetch +refs/heads/*:refs/remotes/origin/* # timeout=10
> git config remote.origin.url https://github.com/apache/beam.git # timeout=10
Using shallow fetch with depth 1
Fetching upstream changes from https://github.com/apache/beam.git
> git fetch --no-tags --force --progress --depth=1 -- https://github.com/apache/beam.git +refs/heads/*:refs/remotes/origin/* +refs/pull/${ghprbPullId}/*:refs/remotes/origin/pr/${ghprbPullId}/* # timeout=10
> git rev-parse origin/master^{commit} # timeout=10
Checking out Revision 8695d704a5944eea61901a45b1ed6f2deb779d9c (origin/master)
> git config core.sparsecheckout # timeout=10
> git checkout -f 8695d704a5944eea61901a45b1ed6f2deb779d9c # timeout=10
Exception logging commit message for Build #5627 of Revision 8695d704a5944eea61901a45b1ed6f2deb779d9c (origin/master): Remote call on apache-beam-jenkins-11 failed
> git rev-list --no-walk d0806a6807ee408e0a7cc6b42f3c2869fd7df022 # timeout=10
First time build. Skipping changelog.
FATAL: unable to create native thread: possibly out of memory or process/resource limits reached
java.lang.OutOfMemoryError: unable to create native thread: possibly out of memory or process/resource limits reached
at java.base/java.lang.Thread.start0(Native Method)
at java.base/java.lang.Thread.start(Thread.java:798)
at java.base/java.util.concurrent.ThreadPoolExecutor.addWorker(ThreadPoolExecutor.java:937)
at java.base/java.util.concurrent.ThreadPoolExecutor.execute(ThreadPoolExecutor.java:1354)
at java.base/java.util.concurrent.AbstractExecutorService.submit(AbstractExecutorService.java:140)
at jenkins.util.InterceptingExecutorService.submit(InterceptingExecutorService.java:36)
at jenkins.util.InterceptingExecutorService.submit(InterceptingExecutorService.java:36)
at hudson.remoting.DelegatingExecutorService.submit(DelegatingExecutorService.java:52)
at hudson.remoting.InterceptingExecutorService.submit(InterceptingExecutorService.java:50)
at hudson.remoting.InterceptingExecutorService.submit(InterceptingExecutorService.java:44)
at org.jenkinsci.remoting.util.AnonymousClassWarnings.check(AnonymousClassWarnings.java:66)
at org.jenkinsci.remoting.util.AnonymousClassWarnings$1.annotateClass(AnonymousClassWarnings.java:123)
at java.base/java.io.ObjectOutputStream.writeNonProxyDesc(ObjectOutputStream.java:1281)
at java.base/java.io.ObjectOutputStream.writeClassDesc(ObjectOutputStream.java:1222)
at java.base/java.io.ObjectOutputStream.writeArray(ObjectOutputStream.java:1313)
at java.base/java.io.ObjectOutputStream.writeObject0(ObjectOutputStream.java:1165)
at java.base/java.io.ObjectOutputStream.defaultWriteFields(ObjectOutputStream.java:1543)
at java.base/java.io.ObjectOutputStream.defaultWriteObject(ObjectOutputStream.java:438)
at java.base/java.lang.Throwable.writeObject(Throwable.java:996)
at java.base/jdk.internal.reflect.GeneratedMethodAccessor65.invoke(Unknown Source)
at java.base/jdk.internal.reflect.DelegatingMethodAccessorImpl.invoke(DelegatingMethodAccessorImpl.java:43)
at java.base/java.lang.reflect.Method.invoke(Method.java:566)
at java.base/java.io.ObjectStreamClass.invokeWriteObject(ObjectStreamClass.java:1016)
at java.base/java.io.ObjectOutputStream.writeSerialData(ObjectOutputStream.java:1487)
at java.base/java.io.ObjectOutputStream.writeOrdinaryObject(ObjectOutputStream.java:1423)
at java.base/java.io.ObjectOutputStream.writeObject0(ObjectOutputStream.java:1169)
at java.base/java.io.ObjectOutputStream.defaultWriteFields(ObjectOutputStream.java:1543)
at java.base/java.io.ObjectOutputStream.writeSerialData(ObjectOutputStream.java:1500)
at java.base/java.io.ObjectOutputStream.writeOrdinaryObject(ObjectOutputStream.java:1423)
at java.base/java.io.ObjectOutputStream.writeObject0(ObjectOutputStream.java:1169)
at java.base/java.io.ObjectOutputStream.writeObject(ObjectOutputStream.java:345)
at hudson.remoting.Command.writeTo(Command.java:111)
at hudson.remoting.AbstractSynchronousByteArrayCommandTransport.write(AbstractSynchronousByteArrayCommandTransport.java:42)
at hudson.remoting.Channel.send(Channel.java:765)
at hudson.remoting.Request.callAsync(Request.java:238)
at hudson.remoting.Channel.callAsync(Channel.java:1029)
at hudson.FilePath.actAsync(FilePath.java:1271)
at com.cloudbees.devoptics.deliver.jenkins.AbstractRemoteAgentExecutor.transfer(AbstractRemoteAgentExecutor.java:49)
at com.cloudbees.devoptics.deliver.events.CommitsSinceExecutor.getCommitsSince(CommitsSinceExecutor.java:107)
at com.cloudbees.devoptics.deliver.events.CheckoutEventListener.onCheckout(CheckoutEventListener.java:61)
at hudson.model.AbstractBuild$AbstractBuildExecution.defaultCheckout(AbstractBuild.java:650)
at jenkins.scm.SCMCheckoutStrategy.checkout(SCMCheckoutStrategy.java:85)
at hudson.model.AbstractBuild$AbstractBuildExecution.run(AbstractBuild.java:517)
at hudson.model.Run.execute(Run.java:1896)
at hudson.model.FreeStyleBuild.run(FreeStyleBuild.java:44)
at hudson.model.ResourceController.execute(ResourceController.java:101)
at hudson.model.Executor.run(Executor.java:442)
---------------------------------------------------------------------
To unsubscribe, e-mail: builds-unsubscribe@beam.apache.org
For additional commands, e-mail: builds-help@beam.apache.org
Jenkins build is back to normal : beam_Publish_Beam_SDK_Snapshots #5629
Posted by Apache Jenkins Server <je...@builds.apache.org>.
See <https://ci-beam.apache.org/job/beam_Publish_Beam_SDK_Snapshots/5629/display/redirect>
---------------------------------------------------------------------
To unsubscribe, e-mail: builds-unsubscribe@beam.apache.org
For additional commands, e-mail: builds-help@beam.apache.org
Build failed in Jenkins: beam_Publish_Beam_SDK_Snapshots #5628
Posted by Apache Jenkins Server <je...@builds.apache.org>.
See <https://ci-beam.apache.org/job/beam_Publish_Beam_SDK_Snapshots/5628/display/redirect>
Changes:
------------------------------------------
[...truncated 2.19 MB...]
#9 492.1 greenlet==2.0.2
#9 492.1 grpc-google-iam-v1==0.12.6
#9 492.1 grpcio==1.56.0
#9 492.1 grpcio-status==1.56.0
#9 492.1 guppy3==3.1.3
#9 492.1 h5py==3.9.0
#9 492.1 hdfs==2.7.0
#9 492.1 httplib2==0.22.0
#9 492.1 hypothesis==6.79.3
#9 492.1 idna==3.4
#9 492.1 importlib-metadata==6.7.0
#9 492.1 iniconfig==2.0.0
#9 492.1 jax==0.4.13
#9 492.1 joblib==1.2.0
#9 492.1 keras==2.12.0
#9 492.1 libclang==16.0.0
#9 492.1 Markdown==3.4.3
#9 492.1 MarkupSafe==2.1.3
#9 492.1 ml-dtypes==0.2.0
#9 492.1 mmh3==4.0.0
#9 492.1 mock==5.0.2
#9 492.1 nltk==3.8.1
#9 492.1 nose==1.3.7
#9 492.1 numpy==1.23.5
#9 492.1 oauth2client==4.1.3
#9 492.1 oauthlib==3.2.2
#9 492.1 objsize==0.6.1
#9 492.1 opt-einsum==3.3.0
#9 492.1 orjson==3.9.1
#9 492.1 overrides==6.5.0
#9 492.1 packaging==23.1
#9 492.1 pandas==1.5.3
#9 492.1 parameterized==0.9.0
#9 492.1 pip==23.0.1
#9 492.1 pluggy==1.2.0
#9 492.1 proto-plus==1.22.3
#9 492.1 protobuf==4.23.3
#9 492.1 psycopg2-binary==2.9.6
#9 492.1 pyarrow==11.0.0
#9 492.1 pyasn1==0.5.0
#9 492.1 pyasn1-modules==0.3.0
#9 492.1 pycparser==2.21
#9 492.1 pydot==1.4.2
#9 492.1 PyHamcrest==2.0.4
#9 492.1 pymongo==4.4.0
#9 492.1 PyMySQL==1.1.0
#9 492.1 pyparsing==3.1.0
#9 492.1 pytest==7.4.0
#9 492.1 pytest-timeout==2.1.0
#9 492.1 pytest-xdist==3.3.1
#9 492.1 python-dateutil==2.8.2
#9 492.1 python-snappy==0.6.1
#9 492.1 pytz==2023.3
#9 492.1 PyYAML==6.0
#9 492.1 regex==2023.6.3
#9 492.1 requests==2.31.0
#9 492.1 requests-mock==1.11.0
#9 492.1 requests-oauthlib==1.3.1
#9 492.1 rsa==4.9
#9 492.1 scikit-learn==1.2.2
#9 492.1 scipy==1.11.0
#9 492.1 setuptools==68.0.0
#9 492.1 Shapely==1.8.5.post1
#9 492.1 six==1.16.0
#9 492.1 sortedcontainers==2.4.0
#9 492.1 soupsieve==2.4.1
#9 492.1 SQLAlchemy==1.4.48
#9 492.1 sqlparse==0.4.4
#9 492.1 tenacity==8.2.2
#9 492.1 tensorboard==2.12.3
#9 492.1 tensorboard-data-server==0.7.1
#9 492.1 tensorflow==2.12.0
#9 492.1 tensorflow-estimator==2.12.0
#9 492.1 tensorflow-io-gcs-filesystem==0.32.0
#9 492.1 termcolor==2.3.0
#9 492.1 testcontainers==3.7.1
#9 492.1 threadpoolctl==3.1.0
#9 492.1 tomli==2.0.1
#9 492.1 tqdm==4.65.0
#9 492.1 typing_extensions==4.6.3
#9 492.1 uritemplate==4.1.1
#9 492.1 urllib3==1.26.16
#9 492.1 websocket-client==1.6.1
#9 492.1 Werkzeug==2.3.6
#9 492.1 wheel==0.40.0
#9 492.1 wrapt==1.14.1
#9 492.1 zipp==3.15.0
#9 492.1 zstandard==0.21.0
#9 DONE 494.1s
#10 [third_party_licenses 1/4] COPY target/license_scripts /tmp/license_scripts/
#10 DONE 0.1s
#11 [third_party_licenses 2/4] COPY target/go-licenses/* /opt/apache/beam/third_party_licenses/golang/
#11 DONE 0.2s
#12 [third_party_licenses 3/4] COPY target/license_scripts /tmp/license_scripts/
#12 DONE 0.1s
#13 [third_party_licenses 4/4] RUN if [ "true" = "true" ] ; then pip install 'pip-licenses<5' pyyaml tenacity && python /tmp/license_scripts/pull_licenses_py.py ; fi
#13 1.123 Collecting pip-licenses<5
#13 1.182 Downloading pip_licenses-4.3.2-py3-none-any.whl (19 kB)
#13 1.194 Requirement already satisfied: pyyaml in /usr/local/lib/python3.9/site-packages (6.0)
#13 1.195 Requirement already satisfied: tenacity in /usr/local/lib/python3.9/site-packages (8.2.2)
#13 1.267 Collecting prettytable>=2.3.0
#13 1.282 Downloading prettytable-3.8.0-py3-none-any.whl (27 kB)
#13 1.347 Collecting wcwidth
#13 1.363 Downloading wcwidth-0.2.6-py2.py3-none-any.whl (29 kB)
#13 2.675 Installing collected packages: wcwidth, prettytable, pip-licenses
> Task :sdks:python:container:py311:docker
#13 16.59 INFO:root:Successfully pulled licenses for 131 dependencies
#13 16.59 Skip pulling license for bs4
#13 DONE 17.7s
#14 [stage-2 1/2] COPY --from=third_party_licenses /opt/apache/beam/third_party_licenses /opt/apache/beam/third_party_licenses
#14 DONE 0.2s
#15 [stage-2 2/2] RUN if [ "true" != "true" ] ; then rm -rf /opt/apache/beam/third_party_licenses ; fi
#15 DONE 0.8s
#16 exporting to image
#16 exporting layers
> Task :sdks:python:container:py310:docker
#16 exporting layers 24.5s done
#16 writing image sha256:5173a00a3d6aea7e78eb1bd80d33c2f27119e0c2d2417a18f52bdd6e374c41ab done
#16 naming to gcr.io/apache-beam-testing/beam-sdk/beam_python3.10_sdk:2.49.0.dev done
#16 DONE 24.5s
> Task :sdks:python:container:py310:dockerTag2.49.0-SNAPSHOT
> Task :sdks:python:container:py39:docker
#13 2.883 Successfully installed pip-licenses-4.3.2 prettytable-3.8.0 wcwidth-0.2.6
#13 2.884 WARNING: Running pip as the 'root' user can result in broken permissions and conflicting behaviour with the system package manager. It is recommended to use a virtual environment instead: https://pip.pypa.io/warnings/venv
#13 3.099
#13 3.099 [notice] A new release of pip is available: 23.0.1 -> 23.1.2
#13 3.099 [notice] To update, run: pip install --upgrade pip
#13 9.587 INFO:root:Successfully pulled licenses for 139 dependencies
#13 9.587 Skip pulling license for bs4
#13 DONE 10.1s
#14 [stage-2 1/2] COPY --from=third_party_licenses /opt/apache/beam/third_party_licenses /opt/apache/beam/third_party_licenses
#14 DONE 0.2s
#15 [stage-2 2/2] RUN if [ "true" != "true" ] ; then rm -rf /opt/apache/beam/third_party_licenses ; fi
#15 DONE 0.4s
#16 exporting to image
#16 exporting layers
> Task :sdks:python:container:py311:docker
#16 exporting layers 24.8s done
#16 writing image sha256:302007b91a42ddf4f7ab8c9a559649f5c77fe795a8f766d9227f78c45cb51195 done
#16 naming to gcr.io/apache-beam-testing/beam-sdk/beam_python3.11_sdk:2.49.0.dev done
#16 DONE 24.9s
> Task :sdks:python:container:py311:dockerTag2.49.0-SNAPSHOT
> Task :sdks:python:container:py38:docker
#15 DONE 0.5s
#16 exporting to image
#16 exporting layers
#16 exporting layers 24.5s done
#16 writing image sha256:8d282bf7b138c53ecb7cefc3344aa47fc0693fb4294ddab231d8f2493904718f done
#16 naming to gcr.io/apache-beam-testing/beam-sdk/beam_python3.8_sdk:2.49.0.dev done
#16 DONE 24.6s
> Task :sdks:python:container:py38:dockerTag2.49.0-SNAPSHOT
> Task :sdks:python:container:py39:docker
#16 exporting layers 24.2s done
#16 writing image sha256:7ad3417b0be4e41bf5897f672b6766ce5028c1417d7675aabaf9e7049598cb56 done
#16 naming to gcr.io/apache-beam-testing/beam-sdk/beam_python3.9_sdk:2.49.0.dev done
#16 DONE 24.2s
> Task :sdks:python:container:py39:dockerTag2.49.0-SNAPSHOT
> Task :sdks:python:container:py310:dockerPush2.49.0-SNAPSHOT
> Task :sdks:python:container:py311:dockerPush2.49.0-SNAPSHOT
> Task :sdks:python:container:py38:dockerPush2.49.0-SNAPSHOT
> Task :sdks:python:container:py39:dockerPush2.49.0-SNAPSHOT
> Task :sdks:python:container:py310:dockerTagBc14623d02fae00a37979fe8dcbcf94cd8aa6397
> Task :sdks:python:container:py310:dockerPushBc14623d02fae00a37979fe8dcbcf94cd8aa6397
> Task :sdks:python:container:py310:dockerTagLatest
> Task :sdks:python:container:py311:dockerTagBc14623d02fae00a37979fe8dcbcf94cd8aa6397
> Task :sdks:python:container:py311:dockerPushBc14623d02fae00a37979fe8dcbcf94cd8aa6397
> Task :sdks:python:container:py311:dockerTagLatest
> Task :sdks:python:container:py311:dockerPushLatest
> Task :sdks:python:container:py311:dockerTagsPush
> Task :sdks:python:container:py38:dockerTagBc14623d02fae00a37979fe8dcbcf94cd8aa6397
> Task :sdks:python:container:py38:dockerPushBc14623d02fae00a37979fe8dcbcf94cd8aa6397
> Task :sdks:python:container:py38:dockerTagLatest
> Task :sdks:python:container:py38:dockerPushLatest
> Task :sdks:python:container:py38:dockerTagsPush
> Task :sdks:python:container:py39:dockerTagBc14623d02fae00a37979fe8dcbcf94cd8aa6397
> Task :sdks:python:container:py310:dockerPushLatest
> Task :sdks:python:container:py39:dockerPushBc14623d02fae00a37979fe8dcbcf94cd8aa6397
> Task :sdks:python:container:py39:dockerTagLatest
> Task :sdks:python:container:py310:dockerPushLatest FAILED
Put "https://gcr.io/v2/apache-beam-testing/beam-sdk/beam_python3.10_sdk/manifests/latest": dial tcp 142.250.125.82:443: i/o timeout
> Task :sdks:python:container:py39:dockerPushLatest
> Task :sdks:python:container:py39:dockerTagsPush
FAILURE: Build completed with 2 failures.
1: Task failed with an exception.
-----------
* What went wrong:
Execution failed for task ':sdks:java:container:java11:dockerPushBc14623d02fae00a37979fe8dcbcf94cd8aa6397'.
> Process 'command 'docker'' finished with non-zero exit value 1
* Try:
> Run with --stacktrace option to get the stack trace.
> Run with --info or --debug option to get more log output.
==============================================================================
2: Task failed with an exception.
-----------
* What went wrong:
Execution failed for task ':sdks:python:container:py310:dockerPushLatest'.
> Process 'command 'docker'' finished with non-zero exit value 1
* Try:
> Run with --stacktrace option to get the stack trace.
> Run with --info or --debug option to get more log output.
==============================================================================
* Get more help at https://help.gradle.org
Deprecated Gradle features were used in this build, making it incompatible with Gradle 8.0.
You can use '--warning-mode all' to show the individual deprecation warnings and determine if they come from your own scripts or plugins.
See https://docs.gradle.org/7.5.1/userguide/command_line_interface.html#sec:command_line_warnings
Execution optimizations have been disabled for 3 invalid unit(s) of work during this build to ensure correctness.
Please consult deprecation warnings for more details.
BUILD FAILED in 15m 12s
192 actionable tasks: 156 executed, 23 from cache, 13 up-to-date
Publishing build scan...
https://ge.apache.org/s/oohmj47z7vgxy
Build step 'Invoke Gradle script' changed build result to FAILURE
Build step 'Invoke Gradle script' marked build as failure
---------------------------------------------------------------------
To unsubscribe, e-mail: builds-unsubscribe@beam.apache.org
For additional commands, e-mail: builds-help@beam.apache.org