You are viewing a plain text version of this content. The canonical link for it is here.
Posted to mapreduce-dev@hadoop.apache.org by Apache Jenkins Server <je...@builds.apache.org> on 2015/11/21 02:36:41 UTC

Hadoop-Mapreduce-trunk-Java8 - Build # 691 - Still Failing

See https://builds.apache.org/job/Hadoop-Mapreduce-trunk-Java8/691/

###################################################################################
########################## LAST 60 LINES OF THE CONSOLE ###########################
[...truncated 10087 lines...]
Java HotSpot(TM) 64-Bit Server VM warning: ignoring option MaxPermSize=768m; support was removed in 8.0
Running org.apache.hadoop.mapred.TestTaskAttemptListenerImpl
Tests run: 6, Failures: 0, Errors: 0, Skipped: 0, Time elapsed: 1.174 sec - in org.apache.hadoop.mapred.TestTaskAttemptListenerImpl
Java HotSpot(TM) 64-Bit Server VM warning: ignoring option MaxPermSize=768m; support was removed in 8.0
Running org.apache.hadoop.mapred.TestLocalContainerLauncher
Tests run: 2, Failures: 0, Errors: 0, Skipped: 0, Time elapsed: 1.713 sec - in org.apache.hadoop.mapred.TestLocalContainerLauncher

Results :

Failed tests: 
  TestMRAppMaster.testMRAppMasterMidLock:174 null

Tests in error: 
  TestMRAppMaster.testMRAppMasterSuccessLock:254 » YarnRuntime java.io.FileNotFo...

Tests run: 340, Failures: 1, Errors: 1, Skipped: 0

[INFO] ------------------------------------------------------------------------
[INFO] Reactor Summary:
[INFO] 
[INFO] Apache Hadoop MapReduce Client .................... SUCCESS [  2.931 s]
[INFO] Apache Hadoop MapReduce Core ...................... SUCCESS [01:34 min]
[INFO] Apache Hadoop MapReduce Common .................... SUCCESS [ 29.312 s]
[INFO] Apache Hadoop MapReduce Shuffle ................... SUCCESS [  4.681 s]
[INFO] Apache Hadoop MapReduce App ....................... FAILURE [11:40 min]
[INFO] Apache Hadoop MapReduce HistoryServer ............. SKIPPED
[INFO] Apache Hadoop MapReduce JobClient ................. SKIPPED
[INFO] Apache Hadoop MapReduce HistoryServer Plugins ..... SKIPPED
[INFO] Apache Hadoop MapReduce NativeTask ................ SKIPPED
[INFO] Apache Hadoop MapReduce Examples .................. SKIPPED
[INFO] Apache Hadoop MapReduce ........................... SKIPPED
[INFO] ------------------------------------------------------------------------
[INFO] BUILD FAILURE
[INFO] ------------------------------------------------------------------------
[INFO] Total time: 13:52 min
[INFO] Finished at: 2015-11-21T01:36:37+00:00
[INFO] Final Memory: 40M/257M
[INFO] ------------------------------------------------------------------------
[ERROR] Failed to execute goal org.apache.maven.plugins:maven-surefire-plugin:2.17:test (default-test) on project hadoop-mapreduce-client-app: There are test failures.
[ERROR] 
[ERROR] Please refer to /home/jenkins/jenkins-slave/workspace/Hadoop-Mapreduce-trunk-Java8/hadoop-mapreduce-project/hadoop-mapreduce-client/hadoop-mapreduce-client-app/target/surefire-reports for the individual test results.
[ERROR] -> [Help 1]
[ERROR] 
[ERROR] To see the full stack trace of the errors, re-run Maven with the -e switch.
[ERROR] Re-run Maven using the -X switch to enable full debug logging.
[ERROR] 
[ERROR] For more information about the errors and possible solutions, please read the following articles:
[ERROR] [Help 1] http://cwiki.apache.org/confluence/display/MAVEN/MojoFailureException
[ERROR] 
[ERROR] After correcting the problems, you can resume the build with the command
[ERROR]   mvn <goals> -rf :hadoop-mapreduce-client-app
Build step 'Execute shell' marked build as failure
[FINDBUGS] Skipping publisher since build result is FAILURE
Archiving artifacts
Recording test results
Updating YARN-3849
Updating YARN-4326
Email was triggered for: Failure - Any
Sending email for trigger: Failure - Any



###################################################################################
############################## FAILED TESTS (if any) ##############################
2 tests failed.
FAILED:  org.apache.hadoop.mapreduce.v2.app.TestMRAppMaster.testMRAppMasterSuccessLock

Error Message:
java.io.FileNotFoundException: File file:/home/jenkins/jenkins-slave/workspace/Hadoop-Mapreduce-trunk-Java8/hadoop-mapreduce-project/hadoop-mapreduce-client/hadoop-mapreduce-client-app/staging/history/done_intermediate/TestAppMasterUser/job_1317529182569_0004-1448069137151-TestAppMasterUser-%3Cmissing+job+name%3E-1448069137313-0-0-SUCCEEDED-default-1448069137151.jhist_tmp does not exist

Stack Trace:
org.apache.hadoop.yarn.exceptions.YarnRuntimeException: java.io.FileNotFoundException: File file:/home/jenkins/jenkins-slave/workspace/Hadoop-Mapreduce-trunk-Java8/hadoop-mapreduce-project/hadoop-mapreduce-client/hadoop-mapreduce-client-app/staging/history/done_intermediate/TestAppMasterUser/job_1317529182569_0004-1448069137151-TestAppMasterUser-%3Cmissing+job+name%3E-1448069137313-0-0-SUCCEEDED-default-1448069137151.jhist_tmp does not exist
	at org.apache.hadoop.fs.RawLocalFileSystem.deprecatedGetFileStatus(RawLocalFileSystem.java:640)
	at org.apache.hadoop.fs.RawLocalFileSystem.getFileLinkStatusInternal(RawLocalFileSystem.java:866)
	at org.apache.hadoop.fs.RawLocalFileSystem.getFileStatus(RawLocalFileSystem.java:630)
	at org.apache.hadoop.fs.FileUtil.copy(FileUtil.java:340)
	at org.apache.hadoop.fs.FileUtil.copy(FileUtil.java:292)
	at org.apache.hadoop.fs.RawLocalFileSystem.rename(RawLocalFileSystem.java:372)
	at org.apache.hadoop.fs.ChecksumFileSystem.rename(ChecksumFileSystem.java:513)
	at org.apache.hadoop.mapreduce.jobhistory.JobHistoryEventHandler.moveTmpToDone(JobHistoryEventHandler.java:1346)
	at org.apache.hadoop.mapreduce.jobhistory.JobHistoryEventHandler.processDoneFiles(JobHistoryEventHandler.java:1154)
	at org.apache.hadoop.service.ServiceOperations.stop(ServiceOperations.java:52)
	at org.apache.hadoop.service.ServiceOperations.stopQuietly(ServiceOperations.java:80)
	at org.apache.hadoop.service.CompositeService.stop(CompositeService.java:157)
	at org.apache.hadoop.service.CompositeService.serviceStop(CompositeService.java:131)
	at org.apache.hadoop.mapreduce.v2.app.MRAppMaster.serviceStop(MRAppMaster.java:1751)
	at org.apache.hadoop.service.AbstractService.stop(AbstractService.java:221)
	at org.apache.hadoop.mapreduce.v2.app.MRAppMaster.stop(MRAppMaster.java:1247)
	at org.apache.hadoop.mapreduce.v2.app.TestMRAppMaster.testMRAppMasterSuccessLock(TestMRAppMaster.java:254)


FAILED:  org.apache.hadoop.mapreduce.v2.app.TestMRAppMaster.testMRAppMasterMidLock

Error Message:
null

Stack Trace:
java.lang.AssertionError: null
	at org.junit.Assert.fail(Assert.java:86)
	at org.junit.Assert.assertTrue(Assert.java:41)
	at org.junit.Assert.assertTrue(Assert.java:52)
	at org.apache.hadoop.mapreduce.v2.app.TestMRAppMaster.testMRAppMasterMidLock(TestMRAppMaster.java:174)



Hadoop-Mapreduce-trunk-Java8 - Build # 722 - Still Failing

Posted by Apache Jenkins Server <je...@builds.apache.org>.
See https://builds.apache.org/job/Hadoop-Mapreduce-trunk-Java8/722/

###################################################################################
########################## LAST 60 LINES OF THE CONSOLE ###########################
[...truncated 10828 lines...]
Running org.apache.hadoop.mapred.TestBadRecords
Tests run: 1, Failures: 0, Errors: 0, Skipped: 1, Time elapsed: 0.035 sec - in org.apache.hadoop.mapred.TestBadRecords
Java HotSpot(TM) 64-Bit Server VM warning: ignoring option MaxPermSize=768m; support was removed in 8.0
Running org.apache.hadoop.mapred.TestMiniMRDFSCaching
Tests run: 1, Failures: 0, Errors: 0, Skipped: 1, Time elapsed: 0.039 sec - in org.apache.hadoop.mapred.TestMiniMRDFSCaching
Java HotSpot(TM) 64-Bit Server VM warning: ignoring option MaxPermSize=768m; support was removed in 8.0
Running org.apache.hadoop.io.TestSequenceFileMergeProgress
Tests run: 3, Failures: 0, Errors: 0, Skipped: 0, Time elapsed: 1.386 sec - in org.apache.hadoop.io.TestSequenceFileMergeProgress
Java HotSpot(TM) 64-Bit Server VM warning: ignoring option MaxPermSize=768m; support was removed in 8.0
Running org.apache.hadoop.conf.TestNoDefaultsJobConf
Tests run: 1, Failures: 0, Errors: 0, Skipped: 0, Time elapsed: 23.805 sec - in org.apache.hadoop.conf.TestNoDefaultsJobConf

Results :

Tests in error: 
  TestJoinDatamerge$1>TestSetup.run:27->setUp:48 » NoClassDefFound org/apache/ha...
  TestMRKeyFieldBasedComparator.testBasicUnixComparator:98->testComparator:68 » NoClassDefFound

Tests run: 521, Failures: 0, Errors: 2, Skipped: 11

[INFO] ------------------------------------------------------------------------
[INFO] Reactor Summary:
[INFO] 
[INFO] Apache Hadoop MapReduce Client .................... SUCCESS [  2.328 s]
[INFO] Apache Hadoop MapReduce Core ...................... SUCCESS [01:24 min]
[INFO] Apache Hadoop MapReduce Common .................... SUCCESS [ 26.229 s]
[INFO] Apache Hadoop MapReduce Shuffle ................... SUCCESS [  4.181 s]
[INFO] Apache Hadoop MapReduce App ....................... SUCCESS [10:49 min]
[INFO] Apache Hadoop MapReduce HistoryServer ............. SUCCESS [06:05 min]
[INFO] Apache Hadoop MapReduce JobClient ................. FAILURE [  01:56 h]
[INFO] Apache Hadoop MapReduce HistoryServer Plugins ..... SKIPPED
[INFO] Apache Hadoop MapReduce NativeTask ................ SKIPPED
[INFO] Apache Hadoop MapReduce Examples .................. SKIPPED
[INFO] Apache Hadoop MapReduce ........................... SKIPPED
[INFO] ------------------------------------------------------------------------
[INFO] BUILD FAILURE
[INFO] ------------------------------------------------------------------------
[INFO] Total time: 02:15 h
[INFO] Finished at: 2015-11-25T18:38:07+00:00
[INFO] Final Memory: 38M/174M
[INFO] ------------------------------------------------------------------------
[ERROR] Failed to execute goal org.apache.maven.plugins:maven-surefire-plugin:2.17:test (default-test) on project hadoop-mapreduce-client-jobclient: There was a timeout or other error in the fork -> [Help 1]
[ERROR] 
[ERROR] To see the full stack trace of the errors, re-run Maven with the -e switch.
[ERROR] Re-run Maven using the -X switch to enable full debug logging.
[ERROR] 
[ERROR] For more information about the errors and possible solutions, please read the following articles:
[ERROR] [Help 1] http://cwiki.apache.org/confluence/display/MAVEN/MojoFailureException
[ERROR] 
[ERROR] After correcting the problems, you can resume the build with the command
[ERROR]   mvn <goals> -rf :hadoop-mapreduce-client-jobclient
Build step 'Execute shell' marked build as failure
[FINDBUGS] Skipping publisher since build result is FAILURE
Archiving artifacts
Recording test results
Updating MAPREDUCE-6555
Updating HDFS-9438
Email was triggered for: Failure - Any
Sending email for trigger: Failure - Any



###################################################################################
############################## FAILED TESTS (if any) ##############################
2 tests failed.
FAILED:  org.apache.hadoop.mapreduce.lib.join.TestJoinDatamerge$1.org.apache.hadoop.mapreduce.lib.join.TestJoinDatamerge

Error Message:
org/apache/hadoop/security/authentication/util/KerberosName

Stack Trace:
java.lang.NoClassDefFoundError: org/apache/hadoop/security/authentication/util/KerberosName
	at java.net.URLClassLoader$1.run(URLClassLoader.java:372)
	at java.net.URLClassLoader$1.run(URLClassLoader.java:361)
	at java.security.AccessController.doPrivileged(Native Method)
	at java.net.URLClassLoader.findClass(URLClassLoader.java:360)
	at java.lang.ClassLoader.loadClass(ClassLoader.java:424)
	at sun.misc.Launcher$AppClassLoader.loadClass(Launcher.java:308)
	at java.lang.ClassLoader.loadClass(ClassLoader.java:357)
	at java.lang.ClassLoader.defineClass1(Native Method)
	at java.lang.ClassLoader.defineClass(ClassLoader.java:760)
	at java.security.SecureClassLoader.defineClass(SecureClassLoader.java:142)
	at java.net.URLClassLoader.defineClass(URLClassLoader.java:455)
	at java.net.URLClassLoader.access$100(URLClassLoader.java:73)
	at java.net.URLClassLoader$1.run(URLClassLoader.java:367)
	at java.net.URLClassLoader$1.run(URLClassLoader.java:361)
	at java.security.AccessController.doPrivileged(Native Method)
	at java.net.URLClassLoader.findClass(URLClassLoader.java:360)
	at java.lang.ClassLoader.loadClass(ClassLoader.java:424)
	at sun.misc.Launcher$AppClassLoader.loadClass(Launcher.java:308)
	at java.lang.ClassLoader.loadClass(ClassLoader.java:357)
	at org.apache.hadoop.security.UserGroupInformation.initialize(UserGroupInformation.java:274)
	at org.apache.hadoop.security.UserGroupInformation.ensureInitialized(UserGroupInformation.java:261)
	at org.apache.hadoop.security.UserGroupInformation.isAuthenticationMethodEnabled(UserGroupInformation.java:349)
	at org.apache.hadoop.security.UserGroupInformation.isSecurityEnabled(UserGroupInformation.java:343)
	at org.apache.hadoop.hdfs.server.namenode.NameNode.format(NameNode.java:1040)
	at org.apache.hadoop.hdfs.server.namenode.NameNode.format(NameNode.java:370)
	at org.apache.hadoop.hdfs.DFSTestUtil.formatNameNode(DFSTestUtil.java:228)
	at org.apache.hadoop.hdfs.MiniDFSCluster.configureNameService(MiniDFSCluster.java:1005)
	at org.apache.hadoop.hdfs.MiniDFSCluster.createNameNodesAndSetConf(MiniDFSCluster.java:891)
	at org.apache.hadoop.hdfs.MiniDFSCluster.initMiniDFSCluster(MiniDFSCluster.java:823)
	at org.apache.hadoop.hdfs.MiniDFSCluster.<init>(MiniDFSCluster.java:482)
	at org.apache.hadoop.hdfs.MiniDFSCluster$Builder.build(MiniDFSCluster.java:441)
	at org.apache.hadoop.mapreduce.lib.join.TestJoinDatamerge$1.setUp(TestJoinDatamerge.java:48)


FAILED:  org.apache.hadoop.mapreduce.lib.partition.TestMRKeyFieldBasedComparator.testBasicUnixComparator

Error Message:
org/apache/hadoop/fs/FileUtil

Stack Trace:
java.lang.NoClassDefFoundError: org/apache/hadoop/fs/FileUtil
	at java.net.URLClassLoader$1.run(URLClassLoader.java:372)
	at java.net.URLClassLoader$1.run(URLClassLoader.java:361)
	at java.security.AccessController.doPrivileged(Native Method)
	at java.net.URLClassLoader.findClass(URLClassLoader.java:360)
	at java.lang.ClassLoader.loadClass(ClassLoader.java:424)
	at sun.misc.Launcher$AppClassLoader.loadClass(Launcher.java:308)
	at java.lang.ClassLoader.loadClass(ClassLoader.java:357)
	at org.apache.hadoop.fs.RawLocalFileSystem.delete(RawLocalFileSystem.java:445)
	at org.apache.hadoop.fs.ChecksumFileSystem.delete(ChecksumFileSystem.java:546)
	at org.apache.hadoop.mapreduce.JobSubmitter.submitJobInternal(JobSubmitter.java:252)
	at org.apache.hadoop.mapreduce.Job$11.run(Job.java:1341)
	at org.apache.hadoop.mapreduce.Job$11.run(Job.java:1338)
	at java.security.AccessController.doPrivileged(Native Method)
	at javax.security.auth.Subject.doAs(Subject.java:422)
	at org.apache.hadoop.security.UserGroupInformation.doAs(UserGroupInformation.java:1669)
	at org.apache.hadoop.mapreduce.Job.submit(Job.java:1338)
	at org.apache.hadoop.mapreduce.Job.waitForCompletion(Job.java:1359)
	at org.apache.hadoop.mapreduce.lib.partition.TestMRKeyFieldBasedComparator.testComparator(TestMRKeyFieldBasedComparator.java:68)
	at org.apache.hadoop.mapreduce.lib.partition.TestMRKeyFieldBasedComparator.testBasicUnixComparator(TestMRKeyFieldBasedComparator.java:98)



Hadoop-Mapreduce-trunk-Java8 - Build # 721 - Still Failing

Posted by Apache Jenkins Server <je...@builds.apache.org>.
See https://builds.apache.org/job/Hadoop-Mapreduce-trunk-Java8/721/

###################################################################################
########################## LAST 60 LINES OF THE CONSOLE ###########################
[...truncated 10082 lines...]
Tests run: 6, Failures: 0, Errors: 0, Skipped: 0, Time elapsed: 2.639 sec - in org.apache.hadoop.mapred.TestTaskAttemptListenerImpl
Java HotSpot(TM) 64-Bit Server VM warning: ignoring option MaxPermSize=768m; support was removed in 8.0
Running org.apache.hadoop.mapred.TestTaskAttemptFinishingMonitor
Tests run: 1, Failures: 0, Errors: 0, Skipped: 0, Time elapsed: 2.717 sec - in org.apache.hadoop.mapred.TestTaskAttemptFinishingMonitor
Java HotSpot(TM) 64-Bit Server VM warning: ignoring option MaxPermSize=768m; support was removed in 8.0
Running org.apache.hadoop.mapred.TestLocalContainerLauncher
Tests run: 2, Failures: 0, Errors: 0, Skipped: 0, Time elapsed: 3.645 sec - in org.apache.hadoop.mapred.TestLocalContainerLauncher

Results :

Failed tests: 
  TestMRAppMaster.testMRAppMasterMidLock:174 null

Tests in error: 
  TestRMCommunicator.testRMContainerAllocatorExceptionIsHandled:67 »  test timed...

Tests run: 340, Failures: 1, Errors: 1, Skipped: 0

[INFO] ------------------------------------------------------------------------
[INFO] Reactor Summary:
[INFO] 
[INFO] Apache Hadoop MapReduce Client .................... SUCCESS [  7.559 s]
[INFO] Apache Hadoop MapReduce Core ...................... SUCCESS [03:46 min]
[INFO] Apache Hadoop MapReduce Common .................... SUCCESS [01:02 min]
[INFO] Apache Hadoop MapReduce Shuffle ................... SUCCESS [ 11.750 s]
[INFO] Apache Hadoop MapReduce App ....................... FAILURE [18:24 min]
[INFO] Apache Hadoop MapReduce HistoryServer ............. SKIPPED
[INFO] Apache Hadoop MapReduce JobClient ................. SKIPPED
[INFO] Apache Hadoop MapReduce HistoryServer Plugins ..... SKIPPED
[INFO] Apache Hadoop MapReduce NativeTask ................ SKIPPED
[INFO] Apache Hadoop MapReduce Examples .................. SKIPPED
[INFO] Apache Hadoop MapReduce ........................... SKIPPED
[INFO] ------------------------------------------------------------------------
[INFO] BUILD FAILURE
[INFO] ------------------------------------------------------------------------
[INFO] Total time: 23:35 min
[INFO] Finished at: 2015-11-25T08:52:59+00:00
[INFO] Final Memory: 41M/269M
[INFO] ------------------------------------------------------------------------
[ERROR] Failed to execute goal org.apache.maven.plugins:maven-surefire-plugin:2.17:test (default-test) on project hadoop-mapreduce-client-app: There are test failures.
[ERROR] 
[ERROR] Please refer to /home/jenkins/jenkins-slave/workspace/Hadoop-Mapreduce-trunk-Java8/hadoop-mapreduce-project/hadoop-mapreduce-client/hadoop-mapreduce-client-app/target/surefire-reports for the individual test results.
[ERROR] -> [Help 1]
[ERROR] 
[ERROR] To see the full stack trace of the errors, re-run Maven with the -e switch.
[ERROR] Re-run Maven using the -X switch to enable full debug logging.
[ERROR] 
[ERROR] For more information about the errors and possible solutions, please read the following articles:
[ERROR] [Help 1] http://cwiki.apache.org/confluence/display/MAVEN/MojoFailureException
[ERROR] 
[ERROR] After correcting the problems, you can resume the build with the command
[ERROR]   mvn <goals> -rf :hadoop-mapreduce-client-app
Build step 'Execute shell' marked build as failure
[FINDBUGS] Skipping publisher since build result is FAILURE
Archiving artifacts
Recording test results
Updating MAPREDUCE-6553
Email was triggered for: Failure - Any
Sending email for trigger: Failure - Any



###################################################################################
############################## FAILED TESTS (if any) ##############################
2 tests failed.
FAILED:  org.apache.hadoop.mapreduce.v2.app.rm.TestRMCommunicator.testRMContainerAllocatorExceptionIsHandled

Error Message:
test timed out after 2000 milliseconds

Stack Trace:
java.lang.Exception: test timed out after 2000 milliseconds
	at java.lang.reflect.Field.getName(Field.java:165)
	at java.lang.Class.searchFields(Class.java:2868)
	at java.lang.Class.getDeclaredField(Class.java:2055)
	at org.mockito.internal.creation.cglib.CGLIBHacker.reflectOnCreateInfo(CGLIBHacker.java:44)
	at org.mockito.internal.creation.cglib.CGLIBHacker.setMockitoNamingPolicy(CGLIBHacker.java:20)
	at org.mockito.internal.creation.MethodInterceptorFilter.intercept(MethodInterceptorFilter.java:41)
	at org.apache.hadoop.mapreduce.v2.app.rm.TestRMCommunicator$MockRMCommunicator$$EnhancerByMockitoWithCGLIB$$34de0e0a.heartbeat(<generated>)
	at org.apache.hadoop.mapreduce.v2.app.rm.RMCommunicator$AllocatorRunnable.run(RMCommunicator.java:281)
	at org.apache.hadoop.mapreduce.v2.app.rm.TestRMCommunicator.testRMContainerAllocatorExceptionIsHandled(TestRMCommunicator.java:67)


FAILED:  org.apache.hadoop.mapreduce.v2.app.TestMRAppMaster.testMRAppMasterMidLock

Error Message:
null

Stack Trace:
java.lang.AssertionError: null
	at org.junit.Assert.fail(Assert.java:86)
	at org.junit.Assert.assertTrue(Assert.java:41)
	at org.junit.Assert.assertTrue(Assert.java:52)
	at org.apache.hadoop.mapreduce.v2.app.TestMRAppMaster.testMRAppMasterMidLock(TestMRAppMaster.java:174)



Hadoop-Mapreduce-trunk-Java8 - Build # 720 - Still Failing

Posted by Apache Jenkins Server <je...@builds.apache.org>.
See https://builds.apache.org/job/Hadoop-Mapreduce-trunk-Java8/720/

###################################################################################
########################## LAST 60 LINES OF THE CONSOLE ###########################
[...truncated 10074 lines...]
Java HotSpot(TM) 64-Bit Server VM warning: ignoring option MaxPermSize=768m; support was removed in 8.0
Running org.apache.hadoop.mapred.TestTaskAttemptListenerImpl
Tests run: 6, Failures: 0, Errors: 0, Skipped: 0, Time elapsed: 1.735 sec - in org.apache.hadoop.mapred.TestTaskAttemptListenerImpl
Java HotSpot(TM) 64-Bit Server VM warning: ignoring option MaxPermSize=768m; support was removed in 8.0
Running org.apache.hadoop.mapred.TestLocalContainerLauncher
Tests run: 2, Failures: 0, Errors: 0, Skipped: 0, Time elapsed: 2.321 sec - in org.apache.hadoop.mapred.TestLocalContainerLauncher
Java HotSpot(TM) 64-Bit Server VM warning: ignoring option MaxPermSize=768m; support was removed in 8.0
Running org.apache.hadoop.mapred.TestTaskAttemptFinishingMonitor
Tests run: 1, Failures: 0, Errors: 0, Skipped: 0, Time elapsed: 2.51 sec - in org.apache.hadoop.mapred.TestTaskAttemptFinishingMonitor

Results :

Failed tests: 
  TestMRAppMaster.testMRAppMasterMidLock:174 null
  TestKill.testKillJob:84 Task state not correct expected:<KILLED> but was:<NEW>

Tests run: 340, Failures: 2, Errors: 0, Skipped: 0

[INFO] ------------------------------------------------------------------------
[INFO] Reactor Summary:
[INFO] 
[INFO] Apache Hadoop MapReduce Client .................... SUCCESS [  6.113 s]
[INFO] Apache Hadoop MapReduce Core ...................... SUCCESS [02:58 min]
[INFO] Apache Hadoop MapReduce Common .................... SUCCESS [ 45.091 s]
[INFO] Apache Hadoop MapReduce Shuffle ................... SUCCESS [  7.940 s]
[INFO] Apache Hadoop MapReduce App ....................... FAILURE [14:40 min]
[INFO] Apache Hadoop MapReduce HistoryServer ............. SKIPPED
[INFO] Apache Hadoop MapReduce JobClient ................. SKIPPED
[INFO] Apache Hadoop MapReduce HistoryServer Plugins ..... SKIPPED
[INFO] Apache Hadoop MapReduce NativeTask ................ SKIPPED
[INFO] Apache Hadoop MapReduce Examples .................. SKIPPED
[INFO] Apache Hadoop MapReduce ........................... SKIPPED
[INFO] ------------------------------------------------------------------------
[INFO] BUILD FAILURE
[INFO] ------------------------------------------------------------------------
[INFO] Total time: 18:39 min
[INFO] Finished at: 2015-11-25T04:16:44+00:00
[INFO] Final Memory: 40M/247M
[INFO] ------------------------------------------------------------------------
[ERROR] Failed to execute goal org.apache.maven.plugins:maven-surefire-plugin:2.17:test (default-test) on project hadoop-mapreduce-client-app: There are test failures.
[ERROR] 
[ERROR] Please refer to /home/jenkins/jenkins-slave/workspace/Hadoop-Mapreduce-trunk-Java8/hadoop-mapreduce-project/hadoop-mapreduce-client/hadoop-mapreduce-client-app/target/surefire-reports for the individual test results.
[ERROR] -> [Help 1]
[ERROR] 
[ERROR] To see the full stack trace of the errors, re-run Maven with the -e switch.
[ERROR] Re-run Maven using the -X switch to enable full debug logging.
[ERROR] 
[ERROR] For more information about the errors and possible solutions, please read the following articles:
[ERROR] [Help 1] http://cwiki.apache.org/confluence/display/MAVEN/MojoFailureException
[ERROR] 
[ERROR] After correcting the problems, you can resume the build with the command
[ERROR]   mvn <goals> -rf :hadoop-mapreduce-client-app
Build step 'Execute shell' marked build as failure
[FINDBUGS] Skipping publisher since build result is FAILURE
Archiving artifacts
Recording test results
Updating HADOOP-12415
Email was triggered for: Failure - Any
Sending email for trigger: Failure - Any



###################################################################################
############################## FAILED TESTS (if any) ##############################
2 tests failed.
FAILED:  org.apache.hadoop.mapreduce.v2.app.TestKill.testKillJob

Error Message:
Task state not correct expected:<KILLED> but was:<NEW>

Stack Trace:
java.lang.AssertionError: Task state not correct expected:<KILLED> but was:<NEW>
	at org.junit.Assert.fail(Assert.java:88)
	at org.junit.Assert.failNotEquals(Assert.java:743)
	at org.junit.Assert.assertEquals(Assert.java:118)
	at org.apache.hadoop.mapreduce.v2.app.TestKill.testKillJob(TestKill.java:84)


FAILED:  org.apache.hadoop.mapreduce.v2.app.TestMRAppMaster.testMRAppMasterMidLock

Error Message:
null

Stack Trace:
java.lang.AssertionError: null
	at org.junit.Assert.fail(Assert.java:86)
	at org.junit.Assert.assertTrue(Assert.java:41)
	at org.junit.Assert.assertTrue(Assert.java:52)
	at org.apache.hadoop.mapreduce.v2.app.TestMRAppMaster.testMRAppMasterMidLock(TestMRAppMaster.java:174)



Hadoop-Mapreduce-trunk-Java8 - Build # 719 - Still Failing

Posted by Apache Jenkins Server <je...@builds.apache.org>.
See https://builds.apache.org/job/Hadoop-Mapreduce-trunk-Java8/719/

###################################################################################
########################## LAST 60 LINES OF THE CONSOLE ###########################
[...truncated 10100 lines...]
Tests run: 6, Failures: 0, Errors: 0, Skipped: 0, Time elapsed: 1.156 sec - in org.apache.hadoop.mapred.TestTaskAttemptListenerImpl
Java HotSpot(TM) 64-Bit Server VM warning: ignoring option MaxPermSize=768m; support was removed in 8.0
Running org.apache.hadoop.mapred.TestLocalContainerLauncher
Tests run: 2, Failures: 0, Errors: 0, Skipped: 0, Time elapsed: 1.624 sec - in org.apache.hadoop.mapred.TestLocalContainerLauncher

Results :

Failed tests: 
  TestMRAppMaster.testMRAppMasterMidLock:174 null
  TestKill.testKillJob:84 Task state not correct expected:<KILLED> but was:<NEW>

Tests in error: 
  TestMRAppMaster.testMRAppMasterSuccessLock:254 » YarnRuntime java.io.FileNotFo...

Tests run: 340, Failures: 2, Errors: 1, Skipped: 0

[INFO] ------------------------------------------------------------------------
[INFO] Reactor Summary:
[INFO] 
[INFO] Apache Hadoop MapReduce Client .................... SUCCESS [  2.582 s]
[INFO] Apache Hadoop MapReduce Core ...................... SUCCESS [01:26 min]
[INFO] Apache Hadoop MapReduce Common .................... SUCCESS [ 26.221 s]
[INFO] Apache Hadoop MapReduce Shuffle ................... SUCCESS [  4.261 s]
[INFO] Apache Hadoop MapReduce App ....................... FAILURE [11:52 min]
[INFO] Apache Hadoop MapReduce HistoryServer ............. SKIPPED
[INFO] Apache Hadoop MapReduce JobClient ................. SKIPPED
[INFO] Apache Hadoop MapReduce HistoryServer Plugins ..... SKIPPED
[INFO] Apache Hadoop MapReduce NativeTask ................ SKIPPED
[INFO] Apache Hadoop MapReduce Examples .................. SKIPPED
[INFO] Apache Hadoop MapReduce ........................... SKIPPED
[INFO] ------------------------------------------------------------------------
[INFO] BUILD FAILURE
[INFO] ------------------------------------------------------------------------
[INFO] Total time: 13:52 min
[INFO] Finished at: 2015-11-25T01:13:53+00:00
[INFO] Final Memory: 40M/257M
[INFO] ------------------------------------------------------------------------
[ERROR] Failed to execute goal org.apache.maven.plugins:maven-surefire-plugin:2.17:test (default-test) on project hadoop-mapreduce-client-app: There are test failures.
[ERROR] 
[ERROR] Please refer to /home/jenkins/jenkins-slave/workspace/Hadoop-Mapreduce-trunk-Java8/hadoop-mapreduce-project/hadoop-mapreduce-client/hadoop-mapreduce-client-app/target/surefire-reports for the individual test results.
[ERROR] -> [Help 1]
[ERROR] 
[ERROR] To see the full stack trace of the errors, re-run Maven with the -e switch.
[ERROR] Re-run Maven using the -X switch to enable full debug logging.
[ERROR] 
[ERROR] For more information about the errors and possible solutions, please read the following articles:
[ERROR] [Help 1] http://cwiki.apache.org/confluence/display/MAVEN/MojoFailureException
[ERROR] 
[ERROR] After correcting the problems, you can resume the build with the command
[ERROR]   mvn <goals> -rf :hadoop-mapreduce-client-app
Build step 'Execute shell' marked build as failure
[FINDBUGS] Skipping publisher since build result is FAILURE
Archiving artifacts
Recording test results
Updating YARN-4384
Updating HDFS-8807
Updating YARN-4365
Email was triggered for: Failure - Any
Sending email for trigger: Failure - Any



###################################################################################
############################## FAILED TESTS (if any) ##############################
3 tests failed.
FAILED:  org.apache.hadoop.mapreduce.v2.app.TestKill.testKillJob

Error Message:
Task state not correct expected:<KILLED> but was:<NEW>

Stack Trace:
java.lang.AssertionError: Task state not correct expected:<KILLED> but was:<NEW>
	at org.junit.Assert.fail(Assert.java:88)
	at org.junit.Assert.failNotEquals(Assert.java:743)
	at org.junit.Assert.assertEquals(Assert.java:118)
	at org.apache.hadoop.mapreduce.v2.app.TestKill.testKillJob(TestKill.java:84)


FAILED:  org.apache.hadoop.mapreduce.v2.app.TestMRAppMaster.testMRAppMasterSuccessLock

Error Message:
java.io.FileNotFoundException: File file:/home/jenkins/jenkins-slave/workspace/Hadoop-Mapreduce-trunk-Java8/hadoop-mapreduce-project/hadoop-mapreduce-client/hadoop-mapreduce-client-app/staging/history/done_intermediate/TestAppMasterUser/job_1317529182569_0004_conf.xml_tmp does not exist

Stack Trace:
org.apache.hadoop.yarn.exceptions.YarnRuntimeException: java.io.FileNotFoundException: File file:/home/jenkins/jenkins-slave/workspace/Hadoop-Mapreduce-trunk-Java8/hadoop-mapreduce-project/hadoop-mapreduce-client/hadoop-mapreduce-client-app/staging/history/done_intermediate/TestAppMasterUser/job_1317529182569_0004_conf.xml_tmp does not exist
	at org.apache.hadoop.fs.RawLocalFileSystem.deprecatedGetFileStatus(RawLocalFileSystem.java:640)
	at org.apache.hadoop.fs.RawLocalFileSystem.getFileLinkStatusInternal(RawLocalFileSystem.java:866)
	at org.apache.hadoop.fs.RawLocalFileSystem.getFileStatus(RawLocalFileSystem.java:630)
	at org.apache.hadoop.fs.FileUtil.copy(FileUtil.java:340)
	at org.apache.hadoop.fs.FileUtil.copy(FileUtil.java:292)
	at org.apache.hadoop.fs.RawLocalFileSystem.rename(RawLocalFileSystem.java:372)
	at org.apache.hadoop.fs.ChecksumFileSystem.rename(ChecksumFileSystem.java:513)
	at org.apache.hadoop.mapreduce.jobhistory.JobHistoryEventHandler.moveTmpToDone(JobHistoryEventHandler.java:1346)
	at org.apache.hadoop.mapreduce.jobhistory.JobHistoryEventHandler.processDoneFiles(JobHistoryEventHandler.java:1153)
	at org.apache.hadoop.service.ServiceOperations.stop(ServiceOperations.java:52)
	at org.apache.hadoop.service.ServiceOperations.stopQuietly(ServiceOperations.java:80)
	at org.apache.hadoop.service.CompositeService.stop(CompositeService.java:157)
	at org.apache.hadoop.service.CompositeService.serviceStop(CompositeService.java:131)
	at org.apache.hadoop.mapreduce.v2.app.MRAppMaster.serviceStop(MRAppMaster.java:1756)
	at org.apache.hadoop.service.AbstractService.stop(AbstractService.java:221)
	at org.apache.hadoop.mapreduce.v2.app.MRAppMaster.stop(MRAppMaster.java:1248)
	at org.apache.hadoop.mapreduce.v2.app.TestMRAppMaster.testMRAppMasterSuccessLock(TestMRAppMaster.java:254)


FAILED:  org.apache.hadoop.mapreduce.v2.app.TestMRAppMaster.testMRAppMasterMidLock

Error Message:
null

Stack Trace:
java.lang.AssertionError: null
	at org.junit.Assert.fail(Assert.java:86)
	at org.junit.Assert.assertTrue(Assert.java:41)
	at org.junit.Assert.assertTrue(Assert.java:52)
	at org.apache.hadoop.mapreduce.v2.app.TestMRAppMaster.testMRAppMasterMidLock(TestMRAppMaster.java:174)



Hadoop-Mapreduce-trunk-Java8 - Build # 718 - Still Failing

Posted by Apache Jenkins Server <je...@builds.apache.org>.
See https://builds.apache.org/job/Hadoop-Mapreduce-trunk-Java8/718/

###################################################################################
########################## LAST 60 LINES OF THE CONSOLE ###########################
[...truncated 10091 lines...]
Running org.apache.hadoop.mapred.TestTaskAttemptListenerImpl
Tests run: 6, Failures: 0, Errors: 0, Skipped: 0, Time elapsed: 1.013 sec - in org.apache.hadoop.mapred.TestTaskAttemptListenerImpl
Java HotSpot(TM) 64-Bit Server VM warning: ignoring option MaxPermSize=768m; support was removed in 8.0
Running org.apache.hadoop.mapred.TestLocalContainerLauncher
Tests run: 2, Failures: 0, Errors: 0, Skipped: 0, Time elapsed: 1.549 sec - in org.apache.hadoop.mapred.TestLocalContainerLauncher

Results :

Failed tests: 
  TestMRAppMaster.testMRAppMasterMidLock:174 null

Tests in error: 
  TestMRAppMaster.testMRAppMasterSuccessLock:254 » YarnRuntime java.io.FileNotFo...

Tests run: 340, Failures: 1, Errors: 1, Skipped: 0

[INFO] ------------------------------------------------------------------------
[INFO] Reactor Summary:
[INFO] 
[INFO] Apache Hadoop MapReduce Client .................... SUCCESS [  2.318 s]
[INFO] Apache Hadoop MapReduce Core ...................... SUCCESS [01:27 min]
[INFO] Apache Hadoop MapReduce Common .................... SUCCESS [ 26.329 s]
[INFO] Apache Hadoop MapReduce Shuffle ................... SUCCESS [  4.116 s]
[INFO] Apache Hadoop MapReduce App ....................... FAILURE [11:02 min]
[INFO] Apache Hadoop MapReduce HistoryServer ............. SKIPPED
[INFO] Apache Hadoop MapReduce JobClient ................. SKIPPED
[INFO] Apache Hadoop MapReduce HistoryServer Plugins ..... SKIPPED
[INFO] Apache Hadoop MapReduce NativeTask ................ SKIPPED
[INFO] Apache Hadoop MapReduce Examples .................. SKIPPED
[INFO] Apache Hadoop MapReduce ........................... SKIPPED
[INFO] ------------------------------------------------------------------------
[INFO] BUILD FAILURE
[INFO] ------------------------------------------------------------------------
[INFO] Total time: 13:03 min
[INFO] Finished at: 2015-11-24T23:13:30+00:00
[INFO] Final Memory: 40M/259M
[INFO] ------------------------------------------------------------------------
[ERROR] Failed to execute goal org.apache.maven.plugins:maven-surefire-plugin:2.17:test (default-test) on project hadoop-mapreduce-client-app: There are test failures.
[ERROR] 
[ERROR] Please refer to /home/jenkins/jenkins-slave/workspace/Hadoop-Mapreduce-trunk-Java8/hadoop-mapreduce-project/hadoop-mapreduce-client/hadoop-mapreduce-client-app/target/surefire-reports for the individual test results.
[ERROR] -> [Help 1]
[ERROR] 
[ERROR] To see the full stack trace of the errors, re-run Maven with the -e switch.
[ERROR] Re-run Maven using the -X switch to enable full debug logging.
[ERROR] 
[ERROR] For more information about the errors and possible solutions, please read the following articles:
[ERROR] [Help 1] http://cwiki.apache.org/confluence/display/MAVEN/MojoFailureException
[ERROR] 
[ERROR] After correcting the problems, you can resume the build with the command
[ERROR]   mvn <goals> -rf :hadoop-mapreduce-client-app
Build step 'Execute shell' marked build as failure
[FINDBUGS] Skipping publisher since build result is FAILURE
Archiving artifacts
Recording test results
Updating MAPREDUCE-5883
Updating MAPREDUCE-5870
Updating YARN-4132
Email was triggered for: Failure - Any
Sending email for trigger: Failure - Any



###################################################################################
############################## FAILED TESTS (if any) ##############################
2 tests failed.
FAILED:  org.apache.hadoop.mapreduce.v2.app.TestMRAppMaster.testMRAppMasterSuccessLock

Error Message:
java.io.FileNotFoundException: File file:/home/jenkins/jenkins-slave/workspace/Hadoop-Mapreduce-trunk-Java8/hadoop-mapreduce-project/hadoop-mapreduce-client/hadoop-mapreduce-client-app/staging/history/done_intermediate/TestAppMasterUser/job_1317529182569_0004_conf.xml_tmp does not exist

Stack Trace:
org.apache.hadoop.yarn.exceptions.YarnRuntimeException: java.io.FileNotFoundException: File file:/home/jenkins/jenkins-slave/workspace/Hadoop-Mapreduce-trunk-Java8/hadoop-mapreduce-project/hadoop-mapreduce-client/hadoop-mapreduce-client-app/staging/history/done_intermediate/TestAppMasterUser/job_1317529182569_0004_conf.xml_tmp does not exist
	at org.apache.hadoop.fs.RawLocalFileSystem.deprecatedGetFileStatus(RawLocalFileSystem.java:640)
	at org.apache.hadoop.fs.RawLocalFileSystem.getFileLinkStatusInternal(RawLocalFileSystem.java:866)
	at org.apache.hadoop.fs.RawLocalFileSystem.getFileStatus(RawLocalFileSystem.java:630)
	at org.apache.hadoop.fs.FileUtil.copy(FileUtil.java:340)
	at org.apache.hadoop.fs.FileUtil.copy(FileUtil.java:292)
	at org.apache.hadoop.fs.RawLocalFileSystem.rename(RawLocalFileSystem.java:372)
	at org.apache.hadoop.fs.ChecksumFileSystem.rename(ChecksumFileSystem.java:513)
	at org.apache.hadoop.mapreduce.jobhistory.JobHistoryEventHandler.moveTmpToDone(JobHistoryEventHandler.java:1346)
	at org.apache.hadoop.mapreduce.jobhistory.JobHistoryEventHandler.processDoneFiles(JobHistoryEventHandler.java:1153)
	at org.apache.hadoop.service.ServiceOperations.stop(ServiceOperations.java:52)
	at org.apache.hadoop.service.ServiceOperations.stopQuietly(ServiceOperations.java:80)
	at org.apache.hadoop.service.CompositeService.stop(CompositeService.java:157)
	at org.apache.hadoop.service.CompositeService.serviceStop(CompositeService.java:131)
	at org.apache.hadoop.mapreduce.v2.app.MRAppMaster.serviceStop(MRAppMaster.java:1756)
	at org.apache.hadoop.service.AbstractService.stop(AbstractService.java:221)
	at org.apache.hadoop.mapreduce.v2.app.MRAppMaster.stop(MRAppMaster.java:1248)
	at org.apache.hadoop.mapreduce.v2.app.TestMRAppMaster.testMRAppMasterSuccessLock(TestMRAppMaster.java:254)


FAILED:  org.apache.hadoop.mapreduce.v2.app.TestMRAppMaster.testMRAppMasterMidLock

Error Message:
null

Stack Trace:
java.lang.AssertionError: null
	at org.junit.Assert.fail(Assert.java:86)
	at org.junit.Assert.assertTrue(Assert.java:41)
	at org.junit.Assert.assertTrue(Assert.java:52)
	at org.apache.hadoop.mapreduce.v2.app.TestMRAppMaster.testMRAppMasterMidLock(TestMRAppMaster.java:174)



Hadoop-Mapreduce-trunk-Java8 - Build # 717 - Still Failing

Posted by Apache Jenkins Server <je...@builds.apache.org>.
See https://builds.apache.org/job/Hadoop-Mapreduce-trunk-Java8/717/

###################################################################################
########################## LAST 60 LINES OF THE CONSOLE ###########################
[...truncated 10096 lines...]
Tests run: 1, Failures: 0, Errors: 0, Skipped: 0, Time elapsed: 0.689 sec - in org.apache.hadoop.mapreduce.jobhistory.TestJobSummary
Java HotSpot(TM) 64-Bit Server VM warning: ignoring option MaxPermSize=768m; support was removed in 8.0
Running org.apache.hadoop.mapreduce.jobhistory.TestJobHistoryEventHandler
Tests run: 13, Failures: 0, Errors: 0, Skipped: 0, Time elapsed: 29.856 sec - in org.apache.hadoop.mapreduce.jobhistory.TestJobHistoryEventHandler

Results :

Failed tests: 
  TestMRAppMaster.testMRAppMasterMidLock:174 null

Tests in error: 
  TestMRAppMaster.testMRAppMasterSuccessLock:254 » YarnRuntime java.io.FileNotFo...

Tests run: 340, Failures: 1, Errors: 1, Skipped: 0

[INFO] ------------------------------------------------------------------------
[INFO] Reactor Summary:
[INFO] 
[INFO] Apache Hadoop MapReduce Client .................... SUCCESS [  4.459 s]
[INFO] Apache Hadoop MapReduce Core ...................... SUCCESS [02:44 min]
[INFO] Apache Hadoop MapReduce Common .................... SUCCESS [ 42.389 s]
[INFO] Apache Hadoop MapReduce Shuffle ................... SUCCESS [  9.494 s]
[INFO] Apache Hadoop MapReduce App ....................... FAILURE [14:51 min]
[INFO] Apache Hadoop MapReduce HistoryServer ............. SKIPPED
[INFO] Apache Hadoop MapReduce JobClient ................. SKIPPED
[INFO] Apache Hadoop MapReduce HistoryServer Plugins ..... SKIPPED
[INFO] Apache Hadoop MapReduce NativeTask ................ SKIPPED
[INFO] Apache Hadoop MapReduce Examples .................. SKIPPED
[INFO] Apache Hadoop MapReduce ........................... SKIPPED
[INFO] ------------------------------------------------------------------------
[INFO] BUILD FAILURE
[INFO] ------------------------------------------------------------------------
[INFO] Total time: 18:34 min
[INFO] Finished at: 2015-11-24T22:07:19+00:00
[INFO] Final Memory: 40M/259M
[INFO] ------------------------------------------------------------------------
[ERROR] Failed to execute goal org.apache.maven.plugins:maven-surefire-plugin:2.17:test (default-test) on project hadoop-mapreduce-client-app: There are test failures.
[ERROR] 
[ERROR] Please refer to /home/jenkins/jenkins-slave/workspace/Hadoop-Mapreduce-trunk-Java8/hadoop-mapreduce-project/hadoop-mapreduce-client/hadoop-mapreduce-client-app/target/surefire-reports for the individual test results.
[ERROR] -> [Help 1]
[ERROR] 
[ERROR] To see the full stack trace of the errors, re-run Maven with the -e switch.
[ERROR] Re-run Maven using the -X switch to enable full debug logging.
[ERROR] 
[ERROR] For more information about the errors and possible solutions, please read the following articles:
[ERROR] [Help 1] http://cwiki.apache.org/confluence/display/MAVEN/MojoFailureException
[ERROR] 
[ERROR] After correcting the problems, you can resume the build with the command
[ERROR]   mvn <goals> -rf :hadoop-mapreduce-client-app
Build step 'Execute shell' marked build as failure
[FINDBUGS] Skipping publisher since build result is FAILURE
Archiving artifacts
Recording test results
Updating HADOOP-11954
Updating HDFS-8855
Updating HDFS-8335
Updating HDFS-9434
Email was triggered for: Failure - Any
Sending email for trigger: Failure - Any



###################################################################################
############################## FAILED TESTS (if any) ##############################
2 tests failed.
FAILED:  org.apache.hadoop.mapreduce.v2.app.TestMRAppMaster.testMRAppMasterSuccessLock

Error Message:
java.io.FileNotFoundException: File file:/home/jenkins/jenkins-slave/workspace/Hadoop-Mapreduce-trunk-Java8/hadoop-mapreduce-project/hadoop-mapreduce-client/hadoop-mapreduce-client-app/staging/history/done_intermediate/TestAppMasterUser/job_1317529182569_0004_conf.xml_tmp does not exist

Stack Trace:
org.apache.hadoop.yarn.exceptions.YarnRuntimeException: java.io.FileNotFoundException: File file:/home/jenkins/jenkins-slave/workspace/Hadoop-Mapreduce-trunk-Java8/hadoop-mapreduce-project/hadoop-mapreduce-client/hadoop-mapreduce-client-app/staging/history/done_intermediate/TestAppMasterUser/job_1317529182569_0004_conf.xml_tmp does not exist
	at org.apache.hadoop.fs.RawLocalFileSystem.deprecatedGetFileStatus(RawLocalFileSystem.java:640)
	at org.apache.hadoop.fs.RawLocalFileSystem.getFileLinkStatusInternal(RawLocalFileSystem.java:866)
	at org.apache.hadoop.fs.RawLocalFileSystem.getFileStatus(RawLocalFileSystem.java:630)
	at org.apache.hadoop.fs.FileUtil.copy(FileUtil.java:340)
	at org.apache.hadoop.fs.FileUtil.copy(FileUtil.java:292)
	at org.apache.hadoop.fs.RawLocalFileSystem.rename(RawLocalFileSystem.java:372)
	at org.apache.hadoop.fs.ChecksumFileSystem.rename(ChecksumFileSystem.java:513)
	at org.apache.hadoop.mapreduce.jobhistory.JobHistoryEventHandler.moveTmpToDone(JobHistoryEventHandler.java:1346)
	at org.apache.hadoop.mapreduce.jobhistory.JobHistoryEventHandler.processDoneFiles(JobHistoryEventHandler.java:1153)
	at org.apache.hadoop.service.ServiceOperations.stop(ServiceOperations.java:52)
	at org.apache.hadoop.service.ServiceOperations.stopQuietly(ServiceOperations.java:80)
	at org.apache.hadoop.service.CompositeService.stop(CompositeService.java:157)
	at org.apache.hadoop.service.CompositeService.serviceStop(CompositeService.java:131)
	at org.apache.hadoop.mapreduce.v2.app.MRAppMaster.serviceStop(MRAppMaster.java:1756)
	at org.apache.hadoop.service.AbstractService.stop(AbstractService.java:221)
	at org.apache.hadoop.mapreduce.v2.app.MRAppMaster.stop(MRAppMaster.java:1248)
	at org.apache.hadoop.mapreduce.v2.app.TestMRAppMaster.testMRAppMasterSuccessLock(TestMRAppMaster.java:254)


FAILED:  org.apache.hadoop.mapreduce.v2.app.TestMRAppMaster.testMRAppMasterMidLock

Error Message:
null

Stack Trace:
java.lang.AssertionError: null
	at org.junit.Assert.fail(Assert.java:86)
	at org.junit.Assert.assertTrue(Assert.java:41)
	at org.junit.Assert.assertTrue(Assert.java:52)
	at org.apache.hadoop.mapreduce.v2.app.TestMRAppMaster.testMRAppMasterMidLock(TestMRAppMaster.java:174)



Hadoop-Mapreduce-trunk-Java8 - Build # 716 - Still Failing

Posted by Apache Jenkins Server <je...@builds.apache.org>.
See https://builds.apache.org/job/Hadoop-Mapreduce-trunk-Java8/716/

###################################################################################
########################## LAST 60 LINES OF THE CONSOLE ###########################
[...truncated 10090 lines...]
Java HotSpot(TM) 64-Bit Server VM warning: ignoring option MaxPermSize=768m; support was removed in 8.0
Running org.apache.hadoop.mapred.TestTaskAttemptListenerImpl
Tests run: 6, Failures: 0, Errors: 0, Skipped: 0, Time elapsed: 1.353 sec - in org.apache.hadoop.mapred.TestTaskAttemptListenerImpl
Java HotSpot(TM) 64-Bit Server VM warning: ignoring option MaxPermSize=768m; support was removed in 8.0
Running org.apache.hadoop.mapred.TestLocalContainerLauncher
Tests run: 2, Failures: 0, Errors: 0, Skipped: 0, Time elapsed: 1.694 sec - in org.apache.hadoop.mapred.TestLocalContainerLauncher

Results :

Failed tests: 
  TestTaskAttempt.testMRAppHistoryForTAFailedInAssigned:177->testTaskAttemptAssignedKilledHistory:388 No Ta Started JH Event
  TestMRAppMaster.testMRAppMasterMidLock:174 null

Tests in error: 
  TestMRAppMaster.testMRAppMasterSuccessLock:254 » YarnRuntime java.io.FileNotFo...

Tests run: 340, Failures: 2, Errors: 1, Skipped: 0

[INFO] ------------------------------------------------------------------------
[INFO] Reactor Summary:
[INFO] 
[INFO] Apache Hadoop MapReduce Client .................... SUCCESS [  2.396 s]
[INFO] Apache Hadoop MapReduce Core ...................... SUCCESS [01:30 min]
[INFO] Apache Hadoop MapReduce Common .................... SUCCESS [ 28.011 s]
[INFO] Apache Hadoop MapReduce Shuffle ................... SUCCESS [  4.287 s]
[INFO] Apache Hadoop MapReduce App ....................... FAILURE [11:54 min]
[INFO] Apache Hadoop MapReduce HistoryServer ............. SKIPPED
[INFO] Apache Hadoop MapReduce JobClient ................. SKIPPED
[INFO] Apache Hadoop MapReduce HistoryServer Plugins ..... SKIPPED
[INFO] Apache Hadoop MapReduce NativeTask ................ SKIPPED
[INFO] Apache Hadoop MapReduce Examples .................. SKIPPED
[INFO] Apache Hadoop MapReduce ........................... SKIPPED
[INFO] ------------------------------------------------------------------------
[INFO] BUILD FAILURE
[INFO] ------------------------------------------------------------------------
[INFO] Total time: 14:00 min
[INFO] Finished at: 2015-11-24T20:54:02+00:00
[INFO] Final Memory: 40M/257M
[INFO] ------------------------------------------------------------------------
[ERROR] Failed to execute goal org.apache.maven.plugins:maven-surefire-plugin:2.17:test (default-test) on project hadoop-mapreduce-client-app: There are test failures.
[ERROR] 
[ERROR] Please refer to /home/jenkins/jenkins-slave/workspace/Hadoop-Mapreduce-trunk-Java8/hadoop-mapreduce-project/hadoop-mapreduce-client/hadoop-mapreduce-client-app/target/surefire-reports for the individual test results.
[ERROR] -> [Help 1]
[ERROR] 
[ERROR] To see the full stack trace of the errors, re-run Maven with the -e switch.
[ERROR] Re-run Maven using the -X switch to enable full debug logging.
[ERROR] 
[ERROR] For more information about the errors and possible solutions, please read the following articles:
[ERROR] [Help 1] http://cwiki.apache.org/confluence/display/MAVEN/MojoFailureException
[ERROR] 
[ERROR] After correcting the problems, you can resume the build with the command
[ERROR]   mvn <goals> -rf :hadoop-mapreduce-client-app
Build step 'Execute shell' marked build as failure
[FINDBUGS] Skipping publisher since build result is FAILURE
Archiving artifacts
Recording test results
Updating HDFS-5165
Email was triggered for: Failure - Any
Sending email for trigger: Failure - Any



###################################################################################
############################## FAILED TESTS (if any) ##############################
3 tests failed.
FAILED:  org.apache.hadoop.mapreduce.v2.app.job.impl.TestTaskAttempt.testMRAppHistoryForTAFailedInAssigned

Error Message:
No Ta Started JH Event

Stack Trace:
java.lang.AssertionError: No Ta Started JH Event
	at org.junit.Assert.fail(Assert.java:88)
	at org.junit.Assert.assertTrue(Assert.java:41)
	at org.apache.hadoop.mapreduce.v2.app.job.impl.TestTaskAttempt.testTaskAttemptAssignedKilledHistory(TestTaskAttempt.java:388)
	at org.apache.hadoop.mapreduce.v2.app.job.impl.TestTaskAttempt.testMRAppHistoryForTAFailedInAssigned(TestTaskAttempt.java:177)


FAILED:  org.apache.hadoop.mapreduce.v2.app.TestMRAppMaster.testMRAppMasterSuccessLock

Error Message:
java.io.FileNotFoundException: File file:/home/jenkins/jenkins-slave/workspace/Hadoop-Mapreduce-trunk-Java8/hadoop-mapreduce-project/hadoop-mapreduce-client/hadoop-mapreduce-client-app/staging/history/done_intermediate/TestAppMasterUser/job_1317529182569_0004_conf.xml_tmp does not exist

Stack Trace:
org.apache.hadoop.yarn.exceptions.YarnRuntimeException: java.io.FileNotFoundException: File file:/home/jenkins/jenkins-slave/workspace/Hadoop-Mapreduce-trunk-Java8/hadoop-mapreduce-project/hadoop-mapreduce-client/hadoop-mapreduce-client-app/staging/history/done_intermediate/TestAppMasterUser/job_1317529182569_0004_conf.xml_tmp does not exist
	at org.apache.hadoop.fs.RawLocalFileSystem.deprecatedGetFileStatus(RawLocalFileSystem.java:640)
	at org.apache.hadoop.fs.RawLocalFileSystem.getFileLinkStatusInternal(RawLocalFileSystem.java:866)
	at org.apache.hadoop.fs.RawLocalFileSystem.getFileStatus(RawLocalFileSystem.java:630)
	at org.apache.hadoop.fs.FileUtil.copy(FileUtil.java:340)
	at org.apache.hadoop.fs.FileUtil.copy(FileUtil.java:292)
	at org.apache.hadoop.fs.RawLocalFileSystem.rename(RawLocalFileSystem.java:372)
	at org.apache.hadoop.fs.ChecksumFileSystem.rename(ChecksumFileSystem.java:513)
	at org.apache.hadoop.mapreduce.jobhistory.JobHistoryEventHandler.moveTmpToDone(JobHistoryEventHandler.java:1346)
	at org.apache.hadoop.mapreduce.jobhistory.JobHistoryEventHandler.processDoneFiles(JobHistoryEventHandler.java:1153)
	at org.apache.hadoop.service.ServiceOperations.stop(ServiceOperations.java:52)
	at org.apache.hadoop.service.ServiceOperations.stopQuietly(ServiceOperations.java:80)
	at org.apache.hadoop.service.CompositeService.stop(CompositeService.java:157)
	at org.apache.hadoop.service.CompositeService.serviceStop(CompositeService.java:131)
	at org.apache.hadoop.mapreduce.v2.app.MRAppMaster.serviceStop(MRAppMaster.java:1756)
	at org.apache.hadoop.service.AbstractService.stop(AbstractService.java:221)
	at org.apache.hadoop.mapreduce.v2.app.MRAppMaster.stop(MRAppMaster.java:1248)
	at org.apache.hadoop.mapreduce.v2.app.TestMRAppMaster.testMRAppMasterSuccessLock(TestMRAppMaster.java:254)


FAILED:  org.apache.hadoop.mapreduce.v2.app.TestMRAppMaster.testMRAppMasterMidLock

Error Message:
null

Stack Trace:
java.lang.AssertionError: null
	at org.junit.Assert.fail(Assert.java:86)
	at org.junit.Assert.assertTrue(Assert.java:41)
	at org.junit.Assert.assertTrue(Assert.java:52)
	at org.apache.hadoop.mapreduce.v2.app.TestMRAppMaster.testMRAppMasterMidLock(TestMRAppMaster.java:174)



Hadoop-Mapreduce-trunk-Java8 - Build # 715 - Still Failing

Posted by Apache Jenkins Server <je...@builds.apache.org>.
See https://builds.apache.org/job/Hadoop-Mapreduce-trunk-Java8/715/

###################################################################################
########################## LAST 60 LINES OF THE CONSOLE ###########################
[...truncated 10101 lines...]
Tests run: 4, Failures: 0, Errors: 0, Skipped: 0, Time elapsed: 8.821 sec - in org.apache.hadoop.mapreduce.v2.app.webapp.TestAMWebServicesAttempt
Java HotSpot(TM) 64-Bit Server VM warning: ignoring option MaxPermSize=768m; support was removed in 8.0
Running org.apache.hadoop.mapreduce.TestMapreduceConfigFields
Tests run: 2, Failures: 0, Errors: 0, Skipped: 0, Time elapsed: 1.059 sec - in org.apache.hadoop.mapreduce.TestMapreduceConfigFields

Results :

Failed tests: 
  TestMRAppMaster.testMRAppMasterMidLock:174 null
  TestRuntimeEstimators.testLegacyEstimator:248->coreTestEstimator:241 We got the wrong number of successful speculations. expected:<3> but was:<2>

Tests in error: 
  TestMRAppMaster.testMRAppMasterSuccessLock:254 » YarnRuntime java.io.FileNotFo...

Tests run: 340, Failures: 2, Errors: 1, Skipped: 0

[INFO] ------------------------------------------------------------------------
[INFO] Reactor Summary:
[INFO] 
[INFO] Apache Hadoop MapReduce Client .................... SUCCESS [  5.644 s]
[INFO] Apache Hadoop MapReduce Core ...................... SUCCESS [02:40 min]
[INFO] Apache Hadoop MapReduce Common .................... SUCCESS [ 47.116 s]
[INFO] Apache Hadoop MapReduce Shuffle ................... SUCCESS [  9.107 s]
[INFO] Apache Hadoop MapReduce App ....................... FAILURE [15:46 min]
[INFO] Apache Hadoop MapReduce HistoryServer ............. SKIPPED
[INFO] Apache Hadoop MapReduce JobClient ................. SKIPPED
[INFO] Apache Hadoop MapReduce HistoryServer Plugins ..... SKIPPED
[INFO] Apache Hadoop MapReduce NativeTask ................ SKIPPED
[INFO] Apache Hadoop MapReduce Examples .................. SKIPPED
[INFO] Apache Hadoop MapReduce ........................... SKIPPED
[INFO] ------------------------------------------------------------------------
[INFO] BUILD FAILURE
[INFO] ------------------------------------------------------------------------
[INFO] Total time: 19:30 min
[INFO] Finished at: 2015-11-24T20:04:40+00:00
[INFO] Final Memory: 41M/269M
[INFO] ------------------------------------------------------------------------
[ERROR] Failed to execute goal org.apache.maven.plugins:maven-surefire-plugin:2.17:test (default-test) on project hadoop-mapreduce-client-app: There are test failures.
[ERROR] 
[ERROR] Please refer to /home/jenkins/jenkins-slave/workspace/Hadoop-Mapreduce-trunk-Java8/hadoop-mapreduce-project/hadoop-mapreduce-client/hadoop-mapreduce-client-app/target/surefire-reports for the individual test results.
[ERROR] -> [Help 1]
[ERROR] 
[ERROR] To see the full stack trace of the errors, re-run Maven with the -e switch.
[ERROR] Re-run Maven using the -X switch to enable full debug logging.
[ERROR] 
[ERROR] For more information about the errors and possible solutions, please read the following articles:
[ERROR] [Help 1] http://cwiki.apache.org/confluence/display/MAVEN/MojoFailureException
[ERROR] 
[ERROR] After correcting the problems, you can resume the build with the command
[ERROR]   mvn <goals> -rf :hadoop-mapreduce-client-app
Build step 'Execute shell' marked build as failure
[FINDBUGS] Skipping publisher since build result is FAILURE
Archiving artifacts
Recording test results
Updating HDFS-9314
Updating HADOOP-11361
Updating HADOOP-12294
Email was triggered for: Failure - Any
Sending email for trigger: Failure - Any



###################################################################################
############################## FAILED TESTS (if any) ##############################
3 tests failed.
FAILED:  org.apache.hadoop.mapreduce.v2.app.TestRuntimeEstimators.testLegacyEstimator

Error Message:
We got the wrong number of successful speculations. expected:<3> but was:<2>

Stack Trace:
java.lang.AssertionError: We got the wrong number of successful speculations. expected:<3> but was:<2>
	at org.junit.Assert.fail(Assert.java:88)
	at org.junit.Assert.failNotEquals(Assert.java:743)
	at org.junit.Assert.assertEquals(Assert.java:118)
	at org.junit.Assert.assertEquals(Assert.java:555)
	at org.apache.hadoop.mapreduce.v2.app.TestRuntimeEstimators.coreTestEstimator(TestRuntimeEstimators.java:241)
	at org.apache.hadoop.mapreduce.v2.app.TestRuntimeEstimators.testLegacyEstimator(TestRuntimeEstimators.java:248)


FAILED:  org.apache.hadoop.mapreduce.v2.app.TestMRAppMaster.testMRAppMasterSuccessLock

Error Message:
java.io.FileNotFoundException: File file:/home/jenkins/jenkins-slave/workspace/Hadoop-Mapreduce-trunk-Java8/hadoop-mapreduce-project/hadoop-mapreduce-client/hadoop-mapreduce-client-app/staging/history/done_intermediate/TestAppMasterUser/job_1317529182569_0004-1448394751741-TestAppMasterUser-%3Cmissing+job+name%3E-1448394751978-0-0-SUCCEEDED-default-1448394751741.jhist_tmp does not exist

Stack Trace:
org.apache.hadoop.yarn.exceptions.YarnRuntimeException: java.io.FileNotFoundException: File file:/home/jenkins/jenkins-slave/workspace/Hadoop-Mapreduce-trunk-Java8/hadoop-mapreduce-project/hadoop-mapreduce-client/hadoop-mapreduce-client-app/staging/history/done_intermediate/TestAppMasterUser/job_1317529182569_0004-1448394751741-TestAppMasterUser-%3Cmissing+job+name%3E-1448394751978-0-0-SUCCEEDED-default-1448394751741.jhist_tmp does not exist
	at org.apache.hadoop.fs.RawLocalFileSystem.deprecatedGetFileStatus(RawLocalFileSystem.java:640)
	at org.apache.hadoop.fs.RawLocalFileSystem.getFileLinkStatusInternal(RawLocalFileSystem.java:866)
	at org.apache.hadoop.fs.RawLocalFileSystem.getFileStatus(RawLocalFileSystem.java:630)
	at org.apache.hadoop.fs.FileUtil.copy(FileUtil.java:340)
	at org.apache.hadoop.fs.FileUtil.copy(FileUtil.java:292)
	at org.apache.hadoop.fs.RawLocalFileSystem.rename(RawLocalFileSystem.java:372)
	at org.apache.hadoop.fs.ChecksumFileSystem.rename(ChecksumFileSystem.java:513)
	at org.apache.hadoop.mapreduce.jobhistory.JobHistoryEventHandler.moveTmpToDone(JobHistoryEventHandler.java:1346)
	at org.apache.hadoop.mapreduce.jobhistory.JobHistoryEventHandler.processDoneFiles(JobHistoryEventHandler.java:1154)
	at org.apache.hadoop.service.ServiceOperations.stop(ServiceOperations.java:52)
	at org.apache.hadoop.service.ServiceOperations.stopQuietly(ServiceOperations.java:80)
	at org.apache.hadoop.service.CompositeService.stop(CompositeService.java:157)
	at org.apache.hadoop.service.CompositeService.serviceStop(CompositeService.java:131)
	at org.apache.hadoop.mapreduce.v2.app.MRAppMaster.serviceStop(MRAppMaster.java:1756)
	at org.apache.hadoop.service.AbstractService.stop(AbstractService.java:221)
	at org.apache.hadoop.mapreduce.v2.app.MRAppMaster.stop(MRAppMaster.java:1248)
	at org.apache.hadoop.mapreduce.v2.app.TestMRAppMaster.testMRAppMasterSuccessLock(TestMRAppMaster.java:254)


FAILED:  org.apache.hadoop.mapreduce.v2.app.TestMRAppMaster.testMRAppMasterMidLock

Error Message:
null

Stack Trace:
java.lang.AssertionError: null
	at org.junit.Assert.fail(Assert.java:86)
	at org.junit.Assert.assertTrue(Assert.java:41)
	at org.junit.Assert.assertTrue(Assert.java:52)
	at org.apache.hadoop.mapreduce.v2.app.TestMRAppMaster.testMRAppMasterMidLock(TestMRAppMaster.java:174)



Hadoop-Mapreduce-trunk-Java8 - Build # 714 - Still Failing

Posted by Apache Jenkins Server <je...@builds.apache.org>.
See https://builds.apache.org/job/Hadoop-Mapreduce-trunk-Java8/714/

###################################################################################
########################## LAST 60 LINES OF THE CONSOLE ###########################
[...truncated 10086 lines...]
Tests run: 1, Failures: 0, Errors: 0, Skipped: 0, Time elapsed: 1.254 sec - in org.apache.hadoop.mapred.TestTaskAttemptFinishingMonitor
Java HotSpot(TM) 64-Bit Server VM warning: ignoring option MaxPermSize=768m; support was removed in 8.0
Running org.apache.hadoop.mapred.TestTaskAttemptListenerImpl
Tests run: 6, Failures: 0, Errors: 0, Skipped: 0, Time elapsed: 1.039 sec - in org.apache.hadoop.mapred.TestTaskAttemptListenerImpl
Java HotSpot(TM) 64-Bit Server VM warning: ignoring option MaxPermSize=768m; support was removed in 8.0
Running org.apache.hadoop.mapred.TestLocalContainerLauncher
Tests run: 2, Failures: 0, Errors: 0, Skipped: 0, Time elapsed: 1.49 sec - in org.apache.hadoop.mapred.TestLocalContainerLauncher

Results :

Failed tests: 
  TestMRAppMaster.testMRAppMasterMidLock:174 null

Tests in error: 
  TestMRAppMaster.testMRAppMasterSuccessLock:254 » YarnRuntime java.io.FileNotFo...

Tests run: 340, Failures: 1, Errors: 1, Skipped: 0

[INFO] ------------------------------------------------------------------------
[INFO] Reactor Summary:
[INFO] 
[INFO] Apache Hadoop MapReduce Client .................... SUCCESS [  2.253 s]
[INFO] Apache Hadoop MapReduce Core ...................... SUCCESS [01:24 min]
[INFO] Apache Hadoop MapReduce Common .................... SUCCESS [ 25.575 s]
[INFO] Apache Hadoop MapReduce Shuffle ................... SUCCESS [  4.119 s]
[INFO] Apache Hadoop MapReduce App ....................... FAILURE [10:54 min]
[INFO] Apache Hadoop MapReduce HistoryServer ............. SKIPPED
[INFO] Apache Hadoop MapReduce JobClient ................. SKIPPED
[INFO] Apache Hadoop MapReduce HistoryServer Plugins ..... SKIPPED
[INFO] Apache Hadoop MapReduce NativeTask ................ SKIPPED
[INFO] Apache Hadoop MapReduce Examples .................. SKIPPED
[INFO] Apache Hadoop MapReduce ........................... SKIPPED
[INFO] ------------------------------------------------------------------------
[INFO] BUILD FAILURE
[INFO] ------------------------------------------------------------------------
[INFO] Total time: 12:51 min
[INFO] Finished at: 2015-11-24T18:35:08+00:00
[INFO] Final Memory: 40M/262M
[INFO] ------------------------------------------------------------------------
[ERROR] Failed to execute goal org.apache.maven.plugins:maven-surefire-plugin:2.17:test (default-test) on project hadoop-mapreduce-client-app: There are test failures.
[ERROR] 
[ERROR] Please refer to /home/jenkins/jenkins-slave/workspace/Hadoop-Mapreduce-trunk-Java8/hadoop-mapreduce-project/hadoop-mapreduce-client/hadoop-mapreduce-client-app/target/surefire-reports for the individual test results.
[ERROR] -> [Help 1]
[ERROR] 
[ERROR] To see the full stack trace of the errors, re-run Maven with the -e switch.
[ERROR] Re-run Maven using the -X switch to enable full debug logging.
[ERROR] 
[ERROR] For more information about the errors and possible solutions, please read the following articles:
[ERROR] [Help 1] http://cwiki.apache.org/confluence/display/MAVEN/MojoFailureException
[ERROR] 
[ERROR] After correcting the problems, you can resume the build with the command
[ERROR]   mvn <goals> -rf :hadoop-mapreduce-client-app
Build step 'Execute shell' marked build as failure
[FINDBUGS] Skipping publisher since build result is FAILURE
Archiving artifacts
Recording test results
Updating HDFS-6101
Email was triggered for: Failure - Any
Sending email for trigger: Failure - Any



###################################################################################
############################## FAILED TESTS (if any) ##############################
2 tests failed.
FAILED:  org.apache.hadoop.mapreduce.v2.app.TestMRAppMaster.testMRAppMasterSuccessLock

Error Message:
java.io.FileNotFoundException: File file:/home/jenkins/jenkins-slave/workspace/Hadoop-Mapreduce-trunk-Java8/hadoop-mapreduce-project/hadoop-mapreduce-client/hadoop-mapreduce-client-app/staging/history/done_intermediate/TestAppMasterUser/job_1317529182569_0004-1448389487046-TestAppMasterUser-%3Cmissing+job+name%3E-1448389487149-0-0-SUCCEEDED-default-1448389487046.jhist_tmp does not exist

Stack Trace:
org.apache.hadoop.yarn.exceptions.YarnRuntimeException: java.io.FileNotFoundException: File file:/home/jenkins/jenkins-slave/workspace/Hadoop-Mapreduce-trunk-Java8/hadoop-mapreduce-project/hadoop-mapreduce-client/hadoop-mapreduce-client-app/staging/history/done_intermediate/TestAppMasterUser/job_1317529182569_0004-1448389487046-TestAppMasterUser-%3Cmissing+job+name%3E-1448389487149-0-0-SUCCEEDED-default-1448389487046.jhist_tmp does not exist
	at org.apache.hadoop.fs.RawLocalFileSystem.deprecatedGetFileStatus(RawLocalFileSystem.java:640)
	at org.apache.hadoop.fs.RawLocalFileSystem.getFileLinkStatusInternal(RawLocalFileSystem.java:866)
	at org.apache.hadoop.fs.RawLocalFileSystem.getFileStatus(RawLocalFileSystem.java:630)
	at org.apache.hadoop.fs.FileUtil.copy(FileUtil.java:340)
	at org.apache.hadoop.fs.FileUtil.copy(FileUtil.java:292)
	at org.apache.hadoop.fs.RawLocalFileSystem.rename(RawLocalFileSystem.java:372)
	at org.apache.hadoop.fs.ChecksumFileSystem.rename(ChecksumFileSystem.java:513)
	at org.apache.hadoop.mapreduce.jobhistory.JobHistoryEventHandler.moveTmpToDone(JobHistoryEventHandler.java:1346)
	at org.apache.hadoop.mapreduce.jobhistory.JobHistoryEventHandler.processDoneFiles(JobHistoryEventHandler.java:1154)
	at org.apache.hadoop.service.ServiceOperations.stop(ServiceOperations.java:52)
	at org.apache.hadoop.service.ServiceOperations.stopQuietly(ServiceOperations.java:80)
	at org.apache.hadoop.service.CompositeService.stop(CompositeService.java:157)
	at org.apache.hadoop.service.CompositeService.serviceStop(CompositeService.java:131)
	at org.apache.hadoop.mapreduce.v2.app.MRAppMaster.serviceStop(MRAppMaster.java:1756)
	at org.apache.hadoop.service.AbstractService.stop(AbstractService.java:221)
	at org.apache.hadoop.mapreduce.v2.app.MRAppMaster.stop(MRAppMaster.java:1248)
	at org.apache.hadoop.mapreduce.v2.app.TestMRAppMaster.testMRAppMasterSuccessLock(TestMRAppMaster.java:254)


FAILED:  org.apache.hadoop.mapreduce.v2.app.TestMRAppMaster.testMRAppMasterMidLock

Error Message:
null

Stack Trace:
java.lang.AssertionError: null
	at org.junit.Assert.fail(Assert.java:86)
	at org.junit.Assert.assertTrue(Assert.java:41)
	at org.junit.Assert.assertTrue(Assert.java:52)
	at org.apache.hadoop.mapreduce.v2.app.TestMRAppMaster.testMRAppMasterMidLock(TestMRAppMaster.java:174)



Hadoop-Mapreduce-trunk-Java8 - Build # 713 - Still Failing

Posted by Apache Jenkins Server <je...@builds.apache.org>.
See https://builds.apache.org/job/Hadoop-Mapreduce-trunk-Java8/713/

###################################################################################
########################## LAST 60 LINES OF THE CONSOLE ###########################
[...truncated 10067 lines...]
Tests run: 4, Failures: 0, Errors: 0, Skipped: 0, Time elapsed: 12.309 sec - in org.apache.hadoop.mapreduce.v2.app.webapp.TestAMWebServicesJobConf
Java HotSpot(TM) 64-Bit Server VM warning: ignoring option MaxPermSize=768m; support was removed in 8.0
Running org.apache.hadoop.mapred.TestTaskAttemptListenerImpl
Tests run: 6, Failures: 0, Errors: 0, Skipped: 0, Time elapsed: 2.343 sec - in org.apache.hadoop.mapred.TestTaskAttemptListenerImpl
Java HotSpot(TM) 64-Bit Server VM warning: ignoring option MaxPermSize=768m; support was removed in 8.0
Running org.apache.hadoop.mapred.TestTaskAttemptFinishingMonitor
Tests run: 1, Failures: 0, Errors: 0, Skipped: 0, Time elapsed: 2.897 sec - in org.apache.hadoop.mapred.TestTaskAttemptFinishingMonitor
Java HotSpot(TM) 64-Bit Server VM warning: ignoring option MaxPermSize=768m; support was removed in 8.0
Running org.apache.hadoop.mapred.TestLocalContainerLauncher
Tests run: 2, Failures: 0, Errors: 0, Skipped: 0, Time elapsed: 3.402 sec - in org.apache.hadoop.mapred.TestLocalContainerLauncher

Results :

Failed tests: 
  TestMRAppMaster.testMRAppMasterMidLock:174 null

Tests run: 340, Failures: 1, Errors: 0, Skipped: 0

[INFO] ------------------------------------------------------------------------
[INFO] Reactor Summary:
[INFO] 
[INFO] Apache Hadoop MapReduce Client .................... SUCCESS [  6.390 s]
[INFO] Apache Hadoop MapReduce Core ...................... SUCCESS [02:59 min]
[INFO] Apache Hadoop MapReduce Common .................... SUCCESS [ 50.262 s]
[INFO] Apache Hadoop MapReduce Shuffle ................... SUCCESS [  8.532 s]
[INFO] Apache Hadoop MapReduce App ....................... FAILURE [16:41 min]
[INFO] Apache Hadoop MapReduce HistoryServer ............. SKIPPED
[INFO] Apache Hadoop MapReduce JobClient ................. SKIPPED
[INFO] Apache Hadoop MapReduce HistoryServer Plugins ..... SKIPPED
[INFO] Apache Hadoop MapReduce NativeTask ................ SKIPPED
[INFO] Apache Hadoop MapReduce Examples .................. SKIPPED
[INFO] Apache Hadoop MapReduce ........................... SKIPPED
[INFO] ------------------------------------------------------------------------
[INFO] BUILD FAILURE
[INFO] ------------------------------------------------------------------------
[INFO] Total time: 20:49 min
[INFO] Finished at: 2015-11-24T11:59:36+00:00
[INFO] Final Memory: 40M/262M
[INFO] ------------------------------------------------------------------------
[ERROR] Failed to execute goal org.apache.maven.plugins:maven-surefire-plugin:2.17:test (default-test) on project hadoop-mapreduce-client-app: There are test failures.
[ERROR] 
[ERROR] Please refer to /home/jenkins/jenkins-slave/workspace/Hadoop-Mapreduce-trunk-Java8/hadoop-mapreduce-project/hadoop-mapreduce-client/hadoop-mapreduce-client-app/target/surefire-reports for the individual test results.
[ERROR] -> [Help 1]
[ERROR] 
[ERROR] To see the full stack trace of the errors, re-run Maven with the -e switch.
[ERROR] Re-run Maven using the -X switch to enable full debug logging.
[ERROR] 
[ERROR] For more information about the errors and possible solutions, please read the following articles:
[ERROR] [Help 1] http://cwiki.apache.org/confluence/display/MAVEN/MojoFailureException
[ERROR] 
[ERROR] After correcting the problems, you can resume the build with the command
[ERROR]   mvn <goals> -rf :hadoop-mapreduce-client-app
Build step 'Execute shell' marked build as failure
[FINDBUGS] Skipping publisher since build result is FAILURE
Archiving artifacts
Recording test results
Updating YARN-4387
Email was triggered for: Failure - Any
Sending email for trigger: Failure - Any



###################################################################################
############################## FAILED TESTS (if any) ##############################
1 tests failed.
FAILED:  org.apache.hadoop.mapreduce.v2.app.TestMRAppMaster.testMRAppMasterMidLock

Error Message:
null

Stack Trace:
java.lang.AssertionError: null
	at org.junit.Assert.fail(Assert.java:86)
	at org.junit.Assert.assertTrue(Assert.java:41)
	at org.junit.Assert.assertTrue(Assert.java:52)
	at org.apache.hadoop.mapreduce.v2.app.TestMRAppMaster.testMRAppMasterMidLock(TestMRAppMaster.java:174)



Hadoop-Mapreduce-trunk-Java8 - Build # 712 - Still Failing

Posted by Apache Jenkins Server <je...@builds.apache.org>.
See https://builds.apache.org/job/Hadoop-Mapreduce-trunk-Java8/712/

###################################################################################
########################## LAST 60 LINES OF THE CONSOLE ###########################
[...truncated 10107 lines...]
Running org.apache.hadoop.mapreduce.v2.app.webapp.TestAMWebServicesAttempt
Tests run: 4, Failures: 0, Errors: 0, Skipped: 0, Time elapsed: 8.192 sec - in org.apache.hadoop.mapreduce.v2.app.webapp.TestAMWebServicesAttempt
Java HotSpot(TM) 64-Bit Server VM warning: ignoring option MaxPermSize=768m; support was removed in 8.0
Running org.apache.hadoop.mapreduce.TestMapreduceConfigFields
Tests run: 2, Failures: 0, Errors: 0, Skipped: 0, Time elapsed: 1.334 sec - in org.apache.hadoop.mapreduce.TestMapreduceConfigFields

Results :

Failed tests: 
  TestMRAppMaster.testMRAppMasterMidLock:174 null
  TestKill.testKillJob:84 Task state not correct expected:<KILLED> but was:<NEW>
  TestKill.testKillTask:119 Job state is not correct (timedout) expected:<SUCCEEDED> but was:<ERROR>

Tests in error: 
  TestMRAppMaster.testMRAppMasterSuccessLock:254 » YarnRuntime java.io.FileNotFo...

Tests run: 340, Failures: 3, Errors: 1, Skipped: 0

[INFO] ------------------------------------------------------------------------
[INFO] Reactor Summary:
[INFO] 
[INFO] Apache Hadoop MapReduce Client .................... SUCCESS [  5.425 s]
[INFO] Apache Hadoop MapReduce Core ...................... SUCCESS [02:57 min]
[INFO] Apache Hadoop MapReduce Common .................... SUCCESS [ 48.398 s]
[INFO] Apache Hadoop MapReduce Shuffle ................... SUCCESS [  9.627 s]
[INFO] Apache Hadoop MapReduce App ....................... FAILURE [15:47 min]
[INFO] Apache Hadoop MapReduce HistoryServer ............. SKIPPED
[INFO] Apache Hadoop MapReduce JobClient ................. SKIPPED
[INFO] Apache Hadoop MapReduce HistoryServer Plugins ..... SKIPPED
[INFO] Apache Hadoop MapReduce NativeTask ................ SKIPPED
[INFO] Apache Hadoop MapReduce Examples .................. SKIPPED
[INFO] Apache Hadoop MapReduce ........................... SKIPPED
[INFO] ------------------------------------------------------------------------
[INFO] BUILD FAILURE
[INFO] ------------------------------------------------------------------------
[INFO] Total time: 19:51 min
[INFO] Finished at: 2015-11-24T10:48:30+00:00
[INFO] Final Memory: 40M/258M
[INFO] ------------------------------------------------------------------------
[ERROR] Failed to execute goal org.apache.maven.plugins:maven-surefire-plugin:2.17:test (default-test) on project hadoop-mapreduce-client-app: There are test failures.
[ERROR] 
[ERROR] Please refer to /home/jenkins/jenkins-slave/workspace/Hadoop-Mapreduce-trunk-Java8/hadoop-mapreduce-project/hadoop-mapreduce-client/hadoop-mapreduce-client-app/target/surefire-reports for the individual test results.
[ERROR] -> [Help 1]
[ERROR] 
[ERROR] To see the full stack trace of the errors, re-run Maven with the -e switch.
[ERROR] Re-run Maven using the -X switch to enable full debug logging.
[ERROR] 
[ERROR] For more information about the errors and possible solutions, please read the following articles:
[ERROR] [Help 1] http://cwiki.apache.org/confluence/display/MAVEN/MojoFailureException
[ERROR] 
[ERROR] After correcting the problems, you can resume the build with the command
[ERROR]   mvn <goals> -rf :hadoop-mapreduce-client-app
Build step 'Execute shell' marked build as failure
[FINDBUGS] Skipping publisher since build result is FAILURE
Archiving artifacts
Recording test results
Updating YARN-4298
Email was triggered for: Failure - Any
Sending email for trigger: Failure - Any



###################################################################################
############################## FAILED TESTS (if any) ##############################
4 tests failed.
FAILED:  org.apache.hadoop.mapreduce.v2.app.TestKill.testKillJob

Error Message:
Task state not correct expected:<KILLED> but was:<NEW>

Stack Trace:
java.lang.AssertionError: Task state not correct expected:<KILLED> but was:<NEW>
	at org.junit.Assert.fail(Assert.java:88)
	at org.junit.Assert.failNotEquals(Assert.java:743)
	at org.junit.Assert.assertEquals(Assert.java:118)
	at org.apache.hadoop.mapreduce.v2.app.TestKill.testKillJob(TestKill.java:84)


FAILED:  org.apache.hadoop.mapreduce.v2.app.TestKill.testKillTask

Error Message:
Job state is not correct (timedout) expected:<SUCCEEDED> but was:<ERROR>

Stack Trace:
java.lang.AssertionError: Job state is not correct (timedout) expected:<SUCCEEDED> but was:<ERROR>
	at org.junit.Assert.fail(Assert.java:88)
	at org.junit.Assert.failNotEquals(Assert.java:743)
	at org.junit.Assert.assertEquals(Assert.java:118)
	at org.apache.hadoop.mapreduce.v2.app.MRApp.waitForState(MRApp.java:411)
	at org.apache.hadoop.mapreduce.v2.app.TestKill.testKillTask(TestKill.java:119)


FAILED:  org.apache.hadoop.mapreduce.v2.app.TestMRAppMaster.testMRAppMasterMidLock

Error Message:
null

Stack Trace:
java.lang.AssertionError: null
	at org.junit.Assert.fail(Assert.java:86)
	at org.junit.Assert.assertTrue(Assert.java:41)
	at org.junit.Assert.assertTrue(Assert.java:52)
	at org.apache.hadoop.mapreduce.v2.app.TestMRAppMaster.testMRAppMasterMidLock(TestMRAppMaster.java:174)


FAILED:  org.apache.hadoop.mapreduce.v2.app.TestMRAppMaster.testMRAppMasterSuccessLock

Error Message:
java.io.FileNotFoundException: File file:/home/jenkins/jenkins-slave/workspace/Hadoop-Mapreduce-trunk-Java8/hadoop-mapreduce-project/hadoop-mapreduce-client/hadoop-mapreduce-client-app/staging/history/done_intermediate/TestAppMasterUser/job_1317529182569_0004-1448361406284-TestAppMasterUser-%3Cmissing+job+name%3E-1448361406621-0-0-SUCCEEDED-default-1448361406284.jhist_tmp does not exist

Stack Trace:
org.apache.hadoop.yarn.exceptions.YarnRuntimeException: java.io.FileNotFoundException: File file:/home/jenkins/jenkins-slave/workspace/Hadoop-Mapreduce-trunk-Java8/hadoop-mapreduce-project/hadoop-mapreduce-client/hadoop-mapreduce-client-app/staging/history/done_intermediate/TestAppMasterUser/job_1317529182569_0004-1448361406284-TestAppMasterUser-%3Cmissing+job+name%3E-1448361406621-0-0-SUCCEEDED-default-1448361406284.jhist_tmp does not exist
	at org.apache.hadoop.fs.RawLocalFileSystem.deprecatedGetFileStatus(RawLocalFileSystem.java:640)
	at org.apache.hadoop.fs.RawLocalFileSystem.getFileLinkStatusInternal(RawLocalFileSystem.java:866)
	at org.apache.hadoop.fs.RawLocalFileSystem.getFileStatus(RawLocalFileSystem.java:630)
	at org.apache.hadoop.fs.FileUtil.copy(FileUtil.java:340)
	at org.apache.hadoop.fs.FileUtil.copy(FileUtil.java:292)
	at org.apache.hadoop.fs.RawLocalFileSystem.rename(RawLocalFileSystem.java:372)
	at org.apache.hadoop.fs.ChecksumFileSystem.rename(ChecksumFileSystem.java:513)
	at org.apache.hadoop.mapreduce.jobhistory.JobHistoryEventHandler.moveTmpToDone(JobHistoryEventHandler.java:1346)
	at org.apache.hadoop.mapreduce.jobhistory.JobHistoryEventHandler.processDoneFiles(JobHistoryEventHandler.java:1154)
	at org.apache.hadoop.service.ServiceOperations.stop(ServiceOperations.java:52)
	at org.apache.hadoop.service.ServiceOperations.stopQuietly(ServiceOperations.java:80)
	at org.apache.hadoop.service.CompositeService.stop(CompositeService.java:157)
	at org.apache.hadoop.service.CompositeService.serviceStop(CompositeService.java:131)
	at org.apache.hadoop.mapreduce.v2.app.MRAppMaster.serviceStop(MRAppMaster.java:1756)
	at org.apache.hadoop.service.AbstractService.stop(AbstractService.java:221)
	at org.apache.hadoop.mapreduce.v2.app.MRAppMaster.stop(MRAppMaster.java:1248)
	at org.apache.hadoop.mapreduce.v2.app.TestMRAppMaster.testMRAppMasterSuccessLock(TestMRAppMaster.java:254)



Hadoop-Mapreduce-trunk-Java8 - Build # 711 - Still Failing

Posted by Apache Jenkins Server <je...@builds.apache.org>.
See https://builds.apache.org/job/Hadoop-Mapreduce-trunk-Java8/711/

###################################################################################
########################## LAST 60 LINES OF THE CONSOLE ###########################
[...truncated 10096 lines...]
Running org.apache.hadoop.mapred.TestTaskAttemptListenerImpl
Tests run: 6, Failures: 0, Errors: 0, Skipped: 0, Time elapsed: 1.108 sec - in org.apache.hadoop.mapred.TestTaskAttemptListenerImpl
Java HotSpot(TM) 64-Bit Server VM warning: ignoring option MaxPermSize=768m; support was removed in 8.0
Running org.apache.hadoop.mapred.TestLocalContainerLauncher
Tests run: 2, Failures: 0, Errors: 0, Skipped: 0, Time elapsed: 1.597 sec - in org.apache.hadoop.mapred.TestLocalContainerLauncher

Results :

Failed tests: 
  TestMRAppMaster.testMRAppMasterMidLock:174 null

Tests in error: 
  TestMRAppMaster.cleanup:119 » IO Unable to delete directory /home/jenkins/jenk...
  TestMRAppMaster.testMRAppMasterFailLock:292 » YarnRuntime java.io.FileNotFound...

Tests run: 340, Failures: 1, Errors: 2, Skipped: 0

[INFO] ------------------------------------------------------------------------
[INFO] Reactor Summary:
[INFO] 
[INFO] Apache Hadoop MapReduce Client .................... SUCCESS [  2.819 s]
[INFO] Apache Hadoop MapReduce Core ...................... SUCCESS [01:41 min]
[INFO] Apache Hadoop MapReduce Common .................... SUCCESS [ 29.495 s]
[INFO] Apache Hadoop MapReduce Shuffle ................... SUCCESS [  4.742 s]
[INFO] Apache Hadoop MapReduce App ....................... FAILURE [11:48 min]
[INFO] Apache Hadoop MapReduce HistoryServer ............. SKIPPED
[INFO] Apache Hadoop MapReduce JobClient ................. SKIPPED
[INFO] Apache Hadoop MapReduce HistoryServer Plugins ..... SKIPPED
[INFO] Apache Hadoop MapReduce NativeTask ................ SKIPPED
[INFO] Apache Hadoop MapReduce Examples .................. SKIPPED
[INFO] Apache Hadoop MapReduce ........................... SKIPPED
[INFO] ------------------------------------------------------------------------
[INFO] BUILD FAILURE
[INFO] ------------------------------------------------------------------------
[INFO] Total time: 14:08 min
[INFO] Finished at: 2015-11-24T09:38:07+00:00
[INFO] Final Memory: 40M/260M
[INFO] ------------------------------------------------------------------------
[ERROR] Failed to execute goal org.apache.maven.plugins:maven-surefire-plugin:2.17:test (default-test) on project hadoop-mapreduce-client-app: There are test failures.
[ERROR] 
[ERROR] Please refer to /home/jenkins/jenkins-slave/workspace/Hadoop-Mapreduce-trunk-Java8/hadoop-mapreduce-project/hadoop-mapreduce-client/hadoop-mapreduce-client-app/target/surefire-reports for the individual test results.
[ERROR] -> [Help 1]
[ERROR] 
[ERROR] To see the full stack trace of the errors, re-run Maven with the -e switch.
[ERROR] Re-run Maven using the -X switch to enable full debug logging.
[ERROR] 
[ERROR] For more information about the errors and possible solutions, please read the following articles:
[ERROR] [Help 1] http://cwiki.apache.org/confluence/display/MAVEN/MojoFailureException
[ERROR] 
[ERROR] After correcting the problems, you can resume the build with the command
[ERROR]   mvn <goals> -rf :hadoop-mapreduce-client-app
Build step 'Execute shell' marked build as failure
[FINDBUGS] Skipping publisher since build result is FAILURE
Archiving artifacts
Recording test results
Updating YARN-3980
Updating YARN-4367
Email was triggered for: Failure - Any
Sending email for trigger: Failure - Any



###################################################################################
############################## FAILED TESTS (if any) ##############################
3 tests failed.
FAILED:  org.apache.hadoop.mapreduce.v2.app.TestMRAppMaster.testMRAppMasterMidLock

Error Message:
null

Stack Trace:
java.lang.AssertionError: null
	at org.junit.Assert.fail(Assert.java:86)
	at org.junit.Assert.assertTrue(Assert.java:41)
	at org.junit.Assert.assertTrue(Assert.java:52)
	at org.apache.hadoop.mapreduce.v2.app.TestMRAppMaster.testMRAppMasterMidLock(TestMRAppMaster.java:174)


FAILED:  org.apache.hadoop.mapreduce.v2.app.TestMRAppMaster.testMRAppMasterSuccessLock

Error Message:
Unable to delete directory /home/jenkins/jenkins-slave/workspace/Hadoop-Mapreduce-trunk-Java8/hadoop-mapreduce-project/hadoop-mapreduce-client/hadoop-mapreduce-client-app/staging.

Stack Trace:
java.io.IOException: Unable to delete directory /home/jenkins/jenkins-slave/workspace/Hadoop-Mapreduce-trunk-Java8/hadoop-mapreduce-project/hadoop-mapreduce-client/hadoop-mapreduce-client-app/staging.
	at org.apache.commons.io.FileUtils.deleteDirectory(FileUtils.java:1541)
	at org.apache.hadoop.mapreduce.v2.app.TestMRAppMaster.cleanup(TestMRAppMaster.java:119)


FAILED:  org.apache.hadoop.mapreduce.v2.app.TestMRAppMaster.testMRAppMasterFailLock

Error Message:
java.io.FileNotFoundException: File file:/home/jenkins/jenkins-slave/workspace/Hadoop-Mapreduce-trunk-Java8/hadoop-mapreduce-project/hadoop-mapreduce-client/hadoop-mapreduce-client-app/staging/history/done_intermediate/TestAppMasterUser/job_1317529182569_0004_conf.xml_tmp does not exist

Stack Trace:
org.apache.hadoop.yarn.exceptions.YarnRuntimeException: java.io.FileNotFoundException: File file:/home/jenkins/jenkins-slave/workspace/Hadoop-Mapreduce-trunk-Java8/hadoop-mapreduce-project/hadoop-mapreduce-client/hadoop-mapreduce-client-app/staging/history/done_intermediate/TestAppMasterUser/job_1317529182569_0004_conf.xml_tmp does not exist
	at org.apache.hadoop.fs.RawLocalFileSystem.deprecatedGetFileStatus(RawLocalFileSystem.java:640)
	at org.apache.hadoop.fs.RawLocalFileSystem.getFileLinkStatusInternal(RawLocalFileSystem.java:866)
	at org.apache.hadoop.fs.RawLocalFileSystem.getFileStatus(RawLocalFileSystem.java:630)
	at org.apache.hadoop.fs.FileUtil.copy(FileUtil.java:340)
	at org.apache.hadoop.fs.FileUtil.copy(FileUtil.java:292)
	at org.apache.hadoop.fs.RawLocalFileSystem.rename(RawLocalFileSystem.java:372)
	at org.apache.hadoop.fs.ChecksumFileSystem.rename(ChecksumFileSystem.java:513)
	at org.apache.hadoop.mapreduce.jobhistory.JobHistoryEventHandler.moveTmpToDone(JobHistoryEventHandler.java:1346)
	at org.apache.hadoop.mapreduce.jobhistory.JobHistoryEventHandler.processDoneFiles(JobHistoryEventHandler.java:1153)
	at org.apache.hadoop.service.ServiceOperations.stop(ServiceOperations.java:52)
	at org.apache.hadoop.service.ServiceOperations.stopQuietly(ServiceOperations.java:80)
	at org.apache.hadoop.service.CompositeService.stop(CompositeService.java:157)
	at org.apache.hadoop.service.CompositeService.serviceStop(CompositeService.java:131)
	at org.apache.hadoop.mapreduce.v2.app.MRAppMaster.serviceStop(MRAppMaster.java:1756)
	at org.apache.hadoop.service.AbstractService.stop(AbstractService.java:221)
	at org.apache.hadoop.mapreduce.v2.app.MRAppMaster.stop(MRAppMaster.java:1248)
	at org.apache.hadoop.mapreduce.v2.app.TestMRAppMaster.testMRAppMasterFailLock(TestMRAppMaster.java:292)



Hadoop-Mapreduce-trunk-Java8 - Build # 710 - Still Failing

Posted by Apache Jenkins Server <je...@builds.apache.org>.
See https://builds.apache.org/job/Hadoop-Mapreduce-trunk-Java8/710/

###################################################################################
########################## LAST 60 LINES OF THE CONSOLE ###########################
[...truncated 9716 lines...]
Tests run: 4, Failures: 0, Errors: 0, Skipped: 0, Time elapsed: 1.824 sec - in org.apache.hadoop.mapred.TestJobAclsManager
Java HotSpot(TM) 64-Bit Server VM warning: ignoring option MaxPermSize=768m; support was removed in 8.0
Running org.apache.hadoop.mapred.TestLineRecordReader
Tests run: 12, Failures: 0, Errors: 0, Skipped: 0, Time elapsed: 11.116 sec - in org.apache.hadoop.mapred.TestLineRecordReader
Java HotSpot(TM) 64-Bit Server VM warning: ignoring option MaxPermSize=768m; support was removed in 8.0
Running org.apache.hadoop.mapred.TestClock
Tests run: 1, Failures: 0, Errors: 0, Skipped: 0, Time elapsed: 0.228 sec - in org.apache.hadoop.mapred.TestClock
Java HotSpot(TM) 64-Bit Server VM warning: ignoring option MaxPermSize=768m; support was removed in 8.0
Running org.apache.hadoop.mapred.TestJobQueueClient
Tests run: 1, Failures: 0, Errors: 0, Skipped: 0, Time elapsed: 0.2 sec - in org.apache.hadoop.mapred.TestJobQueueClient

Results :

Tests in error: 
  TestTaskProgressReporter.testTaskProgress:175 »  test timed out after 10000 mi...

Tests run: 218, Failures: 0, Errors: 1, Skipped: 0

[INFO] ------------------------------------------------------------------------
[INFO] Reactor Summary:
[INFO] 
[INFO] Apache Hadoop MapReduce Client .................... SUCCESS [  7.208 s]
[INFO] Apache Hadoop MapReduce Core ...................... FAILURE [03:09 min]
[INFO] Apache Hadoop MapReduce Common .................... SKIPPED
[INFO] Apache Hadoop MapReduce Shuffle ................... SKIPPED
[INFO] Apache Hadoop MapReduce App ....................... SKIPPED
[INFO] Apache Hadoop MapReduce HistoryServer ............. SKIPPED
[INFO] Apache Hadoop MapReduce JobClient ................. SKIPPED
[INFO] Apache Hadoop MapReduce HistoryServer Plugins ..... SKIPPED
[INFO] Apache Hadoop MapReduce NativeTask ................ SKIPPED
[INFO] Apache Hadoop MapReduce Examples .................. SKIPPED
[INFO] Apache Hadoop MapReduce ........................... SKIPPED
[INFO] ------------------------------------------------------------------------
[INFO] BUILD FAILURE
[INFO] ------------------------------------------------------------------------
[INFO] Total time: 03:19 min
[INFO] Finished at: 2015-11-24T06:28:56+00:00
[INFO] Final Memory: 36M/260M
[INFO] ------------------------------------------------------------------------
[ERROR] Failed to execute goal org.apache.maven.plugins:maven-surefire-plugin:2.17:test (default-test) on project hadoop-mapreduce-client-core: There are test failures.
[ERROR] 
[ERROR] Please refer to /home/jenkins/jenkins-slave/workspace/Hadoop-Mapreduce-trunk-Java8/hadoop-mapreduce-project/hadoop-mapreduce-client/hadoop-mapreduce-client-core/target/surefire-reports for the individual test results.
[ERROR] -> [Help 1]
[ERROR] 
[ERROR] To see the full stack trace of the errors, re-run Maven with the -e switch.
[ERROR] Re-run Maven using the -X switch to enable full debug logging.
[ERROR] 
[ERROR] For more information about the errors and possible solutions, please read the following articles:
[ERROR] [Help 1] http://cwiki.apache.org/confluence/display/MAVEN/MojoFailureException
[ERROR] 
[ERROR] After correcting the problems, you can resume the build with the command
[ERROR]   mvn <goals> -rf :hadoop-mapreduce-client-core
Build step 'Execute shell' marked build as failure
[FINDBUGS] Skipping publisher since build result is FAILURE
Archiving artifacts
Recording test results
Updating HDFS-9423
Email was triggered for: Failure - Any
Sending email for trigger: Failure - Any



###################################################################################
############################## FAILED TESTS (if any) ##############################
1 tests failed.
FAILED:  org.apache.hadoop.mapred.TestTaskProgressReporter.testTaskProgress

Error Message:
test timed out after 10000 milliseconds

Stack Trace:
java.lang.Exception: test timed out after 10000 milliseconds
	at java.lang.Thread.sleep(Native Method)
	at org.apache.hadoop.mapred.TestTaskProgressReporter.testTaskProgress(TestTaskProgressReporter.java:175)



Hadoop-Mapreduce-trunk-Java8 - Build # 709 - Still Failing

Posted by Apache Jenkins Server <je...@builds.apache.org>.
See https://builds.apache.org/job/Hadoop-Mapreduce-trunk-Java8/709/

###################################################################################
########################## LAST 60 LINES OF THE CONSOLE ###########################
[...truncated 10105 lines...]
Tests run: 1, Failures: 0, Errors: 0, Skipped: 0, Time elapsed: 0.571 sec - in org.apache.hadoop.mapreduce.jobhistory.TestJobSummary
Java HotSpot(TM) 64-Bit Server VM warning: ignoring option MaxPermSize=768m; support was removed in 8.0
Running org.apache.hadoop.mapreduce.jobhistory.TestJobHistoryEventHandler
Tests run: 13, Failures: 0, Errors: 0, Skipped: 0, Time elapsed: 27.812 sec - in org.apache.hadoop.mapreduce.jobhistory.TestJobHistoryEventHandler

Results :

Failed tests: 
  TestKill.testKillJob:84 Task state not correct expected:<KILLED> but was:<NEW>
  TestMRAppMaster.testMRAppMasterMidLock:174 null
  TestMRApp.testUpdatedNodes:262 Expecting 2 more completion events for killed expected:<4> but was:<2>

Tests in error: 
  TestMRAppMaster.testMRAppMasterSuccessLock:254 » YarnRuntime java.io.FileNotFo...

Tests run: 340, Failures: 3, Errors: 1, Skipped: 0

[INFO] ------------------------------------------------------------------------
[INFO] Reactor Summary:
[INFO] 
[INFO] Apache Hadoop MapReduce Client .................... SUCCESS [  4.725 s]
[INFO] Apache Hadoop MapReduce Core ...................... SUCCESS [02:17 min]
[INFO] Apache Hadoop MapReduce Common .................... SUCCESS [ 41.176 s]
[INFO] Apache Hadoop MapReduce Shuffle ................... SUCCESS [  7.845 s]
[INFO] Apache Hadoop MapReduce App ....................... FAILURE [14:11 min]
[INFO] Apache Hadoop MapReduce HistoryServer ............. SKIPPED
[INFO] Apache Hadoop MapReduce JobClient ................. SKIPPED
[INFO] Apache Hadoop MapReduce HistoryServer Plugins ..... SKIPPED
[INFO] Apache Hadoop MapReduce NativeTask ................ SKIPPED
[INFO] Apache Hadoop MapReduce Examples .................. SKIPPED
[INFO] Apache Hadoop MapReduce ........................... SKIPPED
[INFO] ------------------------------------------------------------------------
[INFO] BUILD FAILURE
[INFO] ------------------------------------------------------------------------
[INFO] Total time: 17:24 min
[INFO] Finished at: 2015-11-24T02:47:33+00:00
[INFO] Final Memory: 41M/273M
[INFO] ------------------------------------------------------------------------
[ERROR] Failed to execute goal org.apache.maven.plugins:maven-surefire-plugin:2.17:test (default-test) on project hadoop-mapreduce-client-app: There are test failures.
[ERROR] 
[ERROR] Please refer to /home/jenkins/jenkins-slave/workspace/Hadoop-Mapreduce-trunk-Java8/hadoop-mapreduce-project/hadoop-mapreduce-client/hadoop-mapreduce-client-app/target/surefire-reports for the individual test results.
[ERROR] -> [Help 1]
[ERROR] 
[ERROR] To see the full stack trace of the errors, re-run Maven with the -e switch.
[ERROR] Re-run Maven using the -X switch to enable full debug logging.
[ERROR] 
[ERROR] For more information about the errors and possible solutions, please read the following articles:
[ERROR] [Help 1] http://cwiki.apache.org/confluence/display/MAVEN/MojoFailureException
[ERROR] 
[ERROR] After correcting the problems, you can resume the build with the command
[ERROR]   mvn <goals> -rf :hadoop-mapreduce-client-app
Build step 'Execute shell' marked build as failure
[FINDBUGS] Skipping publisher since build result is FAILURE
Archiving artifacts
Recording test results
Updating HDFS-9433
Updating YARN-4349
Email was triggered for: Failure - Any
Sending email for trigger: Failure - Any



###################################################################################
############################## FAILED TESTS (if any) ##############################
4 tests failed.
FAILED:  org.apache.hadoop.mapreduce.v2.app.TestKill.testKillJob

Error Message:
Task state not correct expected:<KILLED> but was:<NEW>

Stack Trace:
java.lang.AssertionError: Task state not correct expected:<KILLED> but was:<NEW>
	at org.junit.Assert.fail(Assert.java:88)
	at org.junit.Assert.failNotEquals(Assert.java:743)
	at org.junit.Assert.assertEquals(Assert.java:118)
	at org.apache.hadoop.mapreduce.v2.app.TestKill.testKillJob(TestKill.java:84)


FAILED:  org.apache.hadoop.mapreduce.v2.app.TestMRApp.testUpdatedNodes

Error Message:
Expecting 2 more completion events for killed expected:<4> but was:<2>

Stack Trace:
java.lang.AssertionError: Expecting 2 more completion events for killed expected:<4> but was:<2>
	at org.junit.Assert.fail(Assert.java:88)
	at org.junit.Assert.failNotEquals(Assert.java:743)
	at org.junit.Assert.assertEquals(Assert.java:118)
	at org.junit.Assert.assertEquals(Assert.java:555)
	at org.apache.hadoop.mapreduce.v2.app.TestMRApp.testUpdatedNodes(TestMRApp.java:262)


FAILED:  org.apache.hadoop.mapreduce.v2.app.TestMRAppMaster.testMRAppMasterSuccessLock

Error Message:
java.io.FileNotFoundException: File file:/home/jenkins/jenkins-slave/workspace/Hadoop-Mapreduce-trunk-Java8/hadoop-mapreduce-project/hadoop-mapreduce-client/hadoop-mapreduce-client-app/staging/history/done_intermediate/TestAppMasterUser/job_1317529182569_0004-1448332617575-TestAppMasterUser-%3Cmissing+job+name%3E-1448332617860-0-0-SUCCEEDED-default-1448332617576.jhist_tmp does not exist

Stack Trace:
org.apache.hadoop.yarn.exceptions.YarnRuntimeException: java.io.FileNotFoundException: File file:/home/jenkins/jenkins-slave/workspace/Hadoop-Mapreduce-trunk-Java8/hadoop-mapreduce-project/hadoop-mapreduce-client/hadoop-mapreduce-client-app/staging/history/done_intermediate/TestAppMasterUser/job_1317529182569_0004-1448332617575-TestAppMasterUser-%3Cmissing+job+name%3E-1448332617860-0-0-SUCCEEDED-default-1448332617576.jhist_tmp does not exist
	at org.apache.hadoop.fs.RawLocalFileSystem.deprecatedGetFileStatus(RawLocalFileSystem.java:640)
	at org.apache.hadoop.fs.RawLocalFileSystem.getFileLinkStatusInternal(RawLocalFileSystem.java:866)
	at org.apache.hadoop.fs.RawLocalFileSystem.getFileStatus(RawLocalFileSystem.java:630)
	at org.apache.hadoop.fs.FileUtil.copy(FileUtil.java:340)
	at org.apache.hadoop.fs.FileUtil.copy(FileUtil.java:292)
	at org.apache.hadoop.fs.RawLocalFileSystem.rename(RawLocalFileSystem.java:372)
	at org.apache.hadoop.fs.ChecksumFileSystem.rename(ChecksumFileSystem.java:513)
	at org.apache.hadoop.mapreduce.jobhistory.JobHistoryEventHandler.moveTmpToDone(JobHistoryEventHandler.java:1346)
	at org.apache.hadoop.mapreduce.jobhistory.JobHistoryEventHandler.processDoneFiles(JobHistoryEventHandler.java:1154)
	at org.apache.hadoop.service.ServiceOperations.stop(ServiceOperations.java:52)
	at org.apache.hadoop.service.ServiceOperations.stopQuietly(ServiceOperations.java:80)
	at org.apache.hadoop.service.CompositeService.stop(CompositeService.java:157)
	at org.apache.hadoop.service.CompositeService.serviceStop(CompositeService.java:131)
	at org.apache.hadoop.mapreduce.v2.app.MRAppMaster.serviceStop(MRAppMaster.java:1756)
	at org.apache.hadoop.service.AbstractService.stop(AbstractService.java:221)
	at org.apache.hadoop.mapreduce.v2.app.MRAppMaster.stop(MRAppMaster.java:1248)
	at org.apache.hadoop.mapreduce.v2.app.TestMRAppMaster.testMRAppMasterSuccessLock(TestMRAppMaster.java:254)


FAILED:  org.apache.hadoop.mapreduce.v2.app.TestMRAppMaster.testMRAppMasterMidLock

Error Message:
null

Stack Trace:
java.lang.AssertionError: null
	at org.junit.Assert.fail(Assert.java:86)
	at org.junit.Assert.assertTrue(Assert.java:41)
	at org.junit.Assert.assertTrue(Assert.java:52)
	at org.apache.hadoop.mapreduce.v2.app.TestMRAppMaster.testMRAppMasterMidLock(TestMRAppMaster.java:174)



Hadoop-Mapreduce-trunk-Java8 - Build # 708 - Still Failing

Posted by Apache Jenkins Server <je...@builds.apache.org>.
See https://builds.apache.org/job/Hadoop-Mapreduce-trunk-Java8/708/

###################################################################################
########################## LAST 60 LINES OF THE CONSOLE ###########################
[...truncated 10088 lines...]
Tests run: 1, Failures: 0, Errors: 0, Skipped: 0, Time elapsed: 1.469 sec - in org.apache.hadoop.mapred.TestTaskAttemptFinishingMonitor
Java HotSpot(TM) 64-Bit Server VM warning: ignoring option MaxPermSize=768m; support was removed in 8.0
Running org.apache.hadoop.mapred.TestTaskAttemptListenerImpl
Tests run: 6, Failures: 0, Errors: 0, Skipped: 0, Time elapsed: 1.033 sec - in org.apache.hadoop.mapred.TestTaskAttemptListenerImpl
Java HotSpot(TM) 64-Bit Server VM warning: ignoring option MaxPermSize=768m; support was removed in 8.0
Running org.apache.hadoop.mapred.TestLocalContainerLauncher
Tests run: 2, Failures: 0, Errors: 0, Skipped: 0, Time elapsed: 1.526 sec - in org.apache.hadoop.mapred.TestLocalContainerLauncher

Results :

Failed tests: 
  TestMRAppMaster.testMRAppMasterMidLock:174 null

Tests in error: 
  TestMRAppMaster.testMRAppMasterSuccessLock:254 » YarnRuntime java.io.FileNotFo...

Tests run: 340, Failures: 1, Errors: 1, Skipped: 0

[INFO] ------------------------------------------------------------------------
[INFO] Reactor Summary:
[INFO] 
[INFO] Apache Hadoop MapReduce Client .................... SUCCESS [  2.162 s]
[INFO] Apache Hadoop MapReduce Core ...................... SUCCESS [01:25 min]
[INFO] Apache Hadoop MapReduce Common .................... SUCCESS [ 26.380 s]
[INFO] Apache Hadoop MapReduce Shuffle ................... SUCCESS [  4.055 s]
[INFO] Apache Hadoop MapReduce App ....................... FAILURE [10:52 min]
[INFO] Apache Hadoop MapReduce HistoryServer ............. SKIPPED
[INFO] Apache Hadoop MapReduce JobClient ................. SKIPPED
[INFO] Apache Hadoop MapReduce HistoryServer Plugins ..... SKIPPED
[INFO] Apache Hadoop MapReduce NativeTask ................ SKIPPED
[INFO] Apache Hadoop MapReduce Examples .................. SKIPPED
[INFO] Apache Hadoop MapReduce ........................... SKIPPED
[INFO] ------------------------------------------------------------------------
[INFO] BUILD FAILURE
[INFO] ------------------------------------------------------------------------
[INFO] Total time: 12:51 min
[INFO] Finished at: 2015-11-23T23:35:05+00:00
[INFO] Final Memory: 41M/279M
[INFO] ------------------------------------------------------------------------
[ERROR] Failed to execute goal org.apache.maven.plugins:maven-surefire-plugin:2.17:test (default-test) on project hadoop-mapreduce-client-app: There are test failures.
[ERROR] 
[ERROR] Please refer to /home/jenkins/jenkins-slave/workspace/Hadoop-Mapreduce-trunk-Java8/hadoop-mapreduce-project/hadoop-mapreduce-client/hadoop-mapreduce-client-app/target/surefire-reports for the individual test results.
[ERROR] -> [Help 1]
[ERROR] 
[ERROR] To see the full stack trace of the errors, re-run Maven with the -e switch.
[ERROR] Re-run Maven using the -X switch to enable full debug logging.
[ERROR] 
[ERROR] For more information about the errors and possible solutions, please read the following articles:
[ERROR] [Help 1] http://cwiki.apache.org/confluence/display/MAVEN/MojoFailureException
[ERROR] 
[ERROR] After correcting the problems, you can resume the build with the command
[ERROR]   mvn <goals> -rf :hadoop-mapreduce-client-app
Build step 'Execute shell' marked build as failure
[FINDBUGS] Skipping publisher since build result is FAILURE
Archiving artifacts
Recording test results
Updating HADOOP-12572
Email was triggered for: Failure - Any
Sending email for trigger: Failure - Any



###################################################################################
############################## FAILED TESTS (if any) ##############################
2 tests failed.
FAILED:  org.apache.hadoop.mapreduce.v2.app.TestMRAppMaster.testMRAppMasterSuccessLock

Error Message:
java.io.FileNotFoundException: File file:/home/jenkins/jenkins-slave/workspace/Hadoop-Mapreduce-trunk-Java8/hadoop-mapreduce-project/hadoop-mapreduce-client/hadoop-mapreduce-client-app/staging/history/done_intermediate/TestAppMasterUser/job_1317529182569_0004_conf.xml_tmp does not exist

Stack Trace:
org.apache.hadoop.yarn.exceptions.YarnRuntimeException: java.io.FileNotFoundException: File file:/home/jenkins/jenkins-slave/workspace/Hadoop-Mapreduce-trunk-Java8/hadoop-mapreduce-project/hadoop-mapreduce-client/hadoop-mapreduce-client-app/staging/history/done_intermediate/TestAppMasterUser/job_1317529182569_0004_conf.xml_tmp does not exist
	at org.apache.hadoop.fs.RawLocalFileSystem.deprecatedGetFileStatus(RawLocalFileSystem.java:640)
	at org.apache.hadoop.fs.RawLocalFileSystem.getFileLinkStatusInternal(RawLocalFileSystem.java:866)
	at org.apache.hadoop.fs.RawLocalFileSystem.getFileStatus(RawLocalFileSystem.java:630)
	at org.apache.hadoop.fs.FileUtil.copy(FileUtil.java:340)
	at org.apache.hadoop.fs.FileUtil.copy(FileUtil.java:292)
	at org.apache.hadoop.fs.RawLocalFileSystem.rename(RawLocalFileSystem.java:372)
	at org.apache.hadoop.fs.ChecksumFileSystem.rename(ChecksumFileSystem.java:513)
	at org.apache.hadoop.mapreduce.jobhistory.JobHistoryEventHandler.moveTmpToDone(JobHistoryEventHandler.java:1346)
	at org.apache.hadoop.mapreduce.jobhistory.JobHistoryEventHandler.processDoneFiles(JobHistoryEventHandler.java:1153)
	at org.apache.hadoop.service.ServiceOperations.stop(ServiceOperations.java:52)
	at org.apache.hadoop.service.ServiceOperations.stopQuietly(ServiceOperations.java:80)
	at org.apache.hadoop.service.CompositeService.stop(CompositeService.java:157)
	at org.apache.hadoop.service.CompositeService.serviceStop(CompositeService.java:131)
	at org.apache.hadoop.mapreduce.v2.app.MRAppMaster.serviceStop(MRAppMaster.java:1751)
	at org.apache.hadoop.service.AbstractService.stop(AbstractService.java:221)
	at org.apache.hadoop.mapreduce.v2.app.MRAppMaster.stop(MRAppMaster.java:1247)
	at org.apache.hadoop.mapreduce.v2.app.TestMRAppMaster.testMRAppMasterSuccessLock(TestMRAppMaster.java:254)


FAILED:  org.apache.hadoop.mapreduce.v2.app.TestMRAppMaster.testMRAppMasterMidLock

Error Message:
null

Stack Trace:
java.lang.AssertionError: null
	at org.junit.Assert.fail(Assert.java:86)
	at org.junit.Assert.assertTrue(Assert.java:41)
	at org.junit.Assert.assertTrue(Assert.java:52)
	at org.apache.hadoop.mapreduce.v2.app.TestMRAppMaster.testMRAppMasterMidLock(TestMRAppMaster.java:174)



Hadoop-Mapreduce-trunk-Java8 - Build # 707 - Still Failing

Posted by Apache Jenkins Server <je...@builds.apache.org>.
See https://builds.apache.org/job/Hadoop-Mapreduce-trunk-Java8/707/

###################################################################################
########################## LAST 60 LINES OF THE CONSOLE ###########################
[...truncated 10090 lines...]
Tests run: 13, Failures: 0, Errors: 0, Skipped: 0, Time elapsed: 22.482 sec - in org.apache.hadoop.mapreduce.jobhistory.TestJobHistoryEventHandler
Java HotSpot(TM) 64-Bit Server VM warning: ignoring option MaxPermSize=768m; support was removed in 8.0
Running org.apache.hadoop.mapreduce.jobhistory.TestJobSummary
Tests run: 1, Failures: 0, Errors: 0, Skipped: 0, Time elapsed: 0.366 sec - in org.apache.hadoop.mapreduce.jobhistory.TestJobSummary
Java HotSpot(TM) 64-Bit Server VM warning: ignoring option MaxPermSize=768m; support was removed in 8.0
Running org.apache.hadoop.mapreduce.jobhistory.TestEvents
Tests run: 5, Failures: 0, Errors: 0, Skipped: 0, Time elapsed: 0.647 sec - in org.apache.hadoop.mapreduce.jobhistory.TestEvents

Results :

Failed tests: 
  TestMRAppMaster.testMRAppMasterMidLock:174 null

Tests in error: 
  TestMRAppMaster.testMRAppMasterSuccessLock:254 » YarnRuntime java.io.FileNotFo...

Tests run: 340, Failures: 1, Errors: 1, Skipped: 0

[INFO] ------------------------------------------------------------------------
[INFO] Reactor Summary:
[INFO] 
[INFO] Apache Hadoop MapReduce Client .................... SUCCESS [  2.982 s]
[INFO] Apache Hadoop MapReduce Core ...................... SUCCESS [01:39 min]
[INFO] Apache Hadoop MapReduce Common .................... SUCCESS [ 30.823 s]
[INFO] Apache Hadoop MapReduce Shuffle ................... SUCCESS [  4.784 s]
[INFO] Apache Hadoop MapReduce App ....................... FAILURE [11:33 min]
[INFO] Apache Hadoop MapReduce HistoryServer ............. SKIPPED
[INFO] Apache Hadoop MapReduce JobClient ................. SKIPPED
[INFO] Apache Hadoop MapReduce HistoryServer Plugins ..... SKIPPED
[INFO] Apache Hadoop MapReduce NativeTask ................ SKIPPED
[INFO] Apache Hadoop MapReduce Examples .................. SKIPPED
[INFO] Apache Hadoop MapReduce ........................... SKIPPED
[INFO] ------------------------------------------------------------------------
[INFO] BUILD FAILURE
[INFO] ------------------------------------------------------------------------
[INFO] Total time: 13:52 min
[INFO] Finished at: 2015-11-23T22:36:45+00:00
[INFO] Final Memory: 40M/281M
[INFO] ------------------------------------------------------------------------
[ERROR] Failed to execute goal org.apache.maven.plugins:maven-surefire-plugin:2.17:test (default-test) on project hadoop-mapreduce-client-app: There are test failures.
[ERROR] 
[ERROR] Please refer to /home/jenkins/jenkins-slave/workspace/Hadoop-Mapreduce-trunk-Java8/hadoop-mapreduce-project/hadoop-mapreduce-client/hadoop-mapreduce-client-app/target/surefire-reports for the individual test results.
[ERROR] -> [Help 1]
[ERROR] 
[ERROR] To see the full stack trace of the errors, re-run Maven with the -e switch.
[ERROR] Re-run Maven using the -X switch to enable full debug logging.
[ERROR] 
[ERROR] For more information about the errors and possible solutions, please read the following articles:
[ERROR] [Help 1] http://cwiki.apache.org/confluence/display/MAVEN/MojoFailureException
[ERROR] 
[ERROR] After correcting the problems, you can resume the build with the command
[ERROR]   mvn <goals> -rf :hadoop-mapreduce-client-app
Build step 'Execute shell' marked build as failure
[FINDBUGS] Skipping publisher since build result is FAILURE
Archiving artifacts
Recording test results
Updating HADOOP-9822
Email was triggered for: Failure - Any
Sending email for trigger: Failure - Any



###################################################################################
############################## FAILED TESTS (if any) ##############################
2 tests failed.
FAILED:  org.apache.hadoop.mapreduce.v2.app.TestMRAppMaster.testMRAppMasterSuccessLock

Error Message:
java.io.FileNotFoundException: File file:/home/jenkins/jenkins-slave/workspace/Hadoop-Mapreduce-trunk-Java8/hadoop-mapreduce-project/hadoop-mapreduce-client/hadoop-mapreduce-client-app/staging/history/done_intermediate/TestAppMasterUser/job_1317529182569_0004_conf.xml_tmp does not exist

Stack Trace:
org.apache.hadoop.yarn.exceptions.YarnRuntimeException: java.io.FileNotFoundException: File file:/home/jenkins/jenkins-slave/workspace/Hadoop-Mapreduce-trunk-Java8/hadoop-mapreduce-project/hadoop-mapreduce-client/hadoop-mapreduce-client-app/staging/history/done_intermediate/TestAppMasterUser/job_1317529182569_0004_conf.xml_tmp does not exist
	at org.apache.hadoop.fs.RawLocalFileSystem.deprecatedGetFileStatus(RawLocalFileSystem.java:640)
	at org.apache.hadoop.fs.RawLocalFileSystem.getFileLinkStatusInternal(RawLocalFileSystem.java:866)
	at org.apache.hadoop.fs.RawLocalFileSystem.getFileStatus(RawLocalFileSystem.java:630)
	at org.apache.hadoop.fs.FileUtil.copy(FileUtil.java:340)
	at org.apache.hadoop.fs.FileUtil.copy(FileUtil.java:292)
	at org.apache.hadoop.fs.RawLocalFileSystem.rename(RawLocalFileSystem.java:372)
	at org.apache.hadoop.fs.ChecksumFileSystem.rename(ChecksumFileSystem.java:513)
	at org.apache.hadoop.mapreduce.jobhistory.JobHistoryEventHandler.moveTmpToDone(JobHistoryEventHandler.java:1346)
	at org.apache.hadoop.mapreduce.jobhistory.JobHistoryEventHandler.processDoneFiles(JobHistoryEventHandler.java:1153)
	at org.apache.hadoop.service.ServiceOperations.stop(ServiceOperations.java:52)
	at org.apache.hadoop.service.ServiceOperations.stopQuietly(ServiceOperations.java:80)
	at org.apache.hadoop.service.CompositeService.stop(CompositeService.java:157)
	at org.apache.hadoop.service.CompositeService.serviceStop(CompositeService.java:131)
	at org.apache.hadoop.mapreduce.v2.app.MRAppMaster.serviceStop(MRAppMaster.java:1751)
	at org.apache.hadoop.service.AbstractService.stop(AbstractService.java:221)
	at org.apache.hadoop.mapreduce.v2.app.MRAppMaster.stop(MRAppMaster.java:1247)
	at org.apache.hadoop.mapreduce.v2.app.TestMRAppMaster.testMRAppMasterSuccessLock(TestMRAppMaster.java:254)


FAILED:  org.apache.hadoop.mapreduce.v2.app.TestMRAppMaster.testMRAppMasterMidLock

Error Message:
null

Stack Trace:
java.lang.AssertionError: null
	at org.junit.Assert.fail(Assert.java:86)
	at org.junit.Assert.assertTrue(Assert.java:41)
	at org.junit.Assert.assertTrue(Assert.java:52)
	at org.apache.hadoop.mapreduce.v2.app.TestMRAppMaster.testMRAppMasterMidLock(TestMRAppMaster.java:174)



Hadoop-Mapreduce-trunk-Java8 - Build # 706 - Still Failing

Posted by Apache Jenkins Server <je...@builds.apache.org>.
See https://builds.apache.org/job/Hadoop-Mapreduce-trunk-Java8/706/

###################################################################################
########################## LAST 60 LINES OF THE CONSOLE ###########################
[...truncated 10088 lines...]
Tests run: 1, Failures: 0, Errors: 0, Skipped: 0, Time elapsed: 0.35 sec - in org.apache.hadoop.mapreduce.jobhistory.TestJobSummary
Java HotSpot(TM) 64-Bit Server VM warning: ignoring option MaxPermSize=768m; support was removed in 8.0
Running org.apache.hadoop.mapreduce.jobhistory.TestJobHistoryEventHandler
Tests run: 13, Failures: 0, Errors: 0, Skipped: 0, Time elapsed: 21.601 sec - in org.apache.hadoop.mapreduce.jobhistory.TestJobHistoryEventHandler
Java HotSpot(TM) 64-Bit Server VM warning: ignoring option MaxPermSize=768m; support was removed in 8.0
Running org.apache.hadoop.mapreduce.jobhistory.TestEvents
Tests run: 5, Failures: 0, Errors: 0, Skipped: 0, Time elapsed: 0.622 sec - in org.apache.hadoop.mapreduce.jobhistory.TestEvents

Results :

Failed tests: 
  TestMRAppMaster.testMRAppMasterMidLock:174 null

Tests in error: 
  TestMRAppMaster.testMRAppMasterSuccessLock:254 » YarnRuntime java.io.FileNotFo...

Tests run: 340, Failures: 1, Errors: 1, Skipped: 0

[INFO] ------------------------------------------------------------------------
[INFO] Reactor Summary:
[INFO] 
[INFO] Apache Hadoop MapReduce Client .................... SUCCESS [  2.043 s]
[INFO] Apache Hadoop MapReduce Core ...................... SUCCESS [01:25 min]
[INFO] Apache Hadoop MapReduce Common .................... SUCCESS [ 25.860 s]
[INFO] Apache Hadoop MapReduce Shuffle ................... SUCCESS [  4.173 s]
[INFO] Apache Hadoop MapReduce App ....................... FAILURE [10:53 min]
[INFO] Apache Hadoop MapReduce HistoryServer ............. SKIPPED
[INFO] Apache Hadoop MapReduce JobClient ................. SKIPPED
[INFO] Apache Hadoop MapReduce HistoryServer Plugins ..... SKIPPED
[INFO] Apache Hadoop MapReduce NativeTask ................ SKIPPED
[INFO] Apache Hadoop MapReduce Examples .................. SKIPPED
[INFO] Apache Hadoop MapReduce ........................... SKIPPED
[INFO] ------------------------------------------------------------------------
[INFO] BUILD FAILURE
[INFO] ------------------------------------------------------------------------
[INFO] Total time: 12:52 min
[INFO] Finished at: 2015-11-23T21:43:05+00:00
[INFO] Final Memory: 41M/264M
[INFO] ------------------------------------------------------------------------
[ERROR] Failed to execute goal org.apache.maven.plugins:maven-surefire-plugin:2.17:test (default-test) on project hadoop-mapreduce-client-app: There are test failures.
[ERROR] 
[ERROR] Please refer to /home/jenkins/jenkins-slave/workspace/Hadoop-Mapreduce-trunk-Java8/hadoop-mapreduce-project/hadoop-mapreduce-client/hadoop-mapreduce-client-app/target/surefire-reports for the individual test results.
[ERROR] -> [Help 1]
[ERROR] 
[ERROR] To see the full stack trace of the errors, re-run Maven with the -e switch.
[ERROR] Re-run Maven using the -X switch to enable full debug logging.
[ERROR] 
[ERROR] For more information about the errors and possible solutions, please read the following articles:
[ERROR] [Help 1] http://cwiki.apache.org/confluence/display/MAVEN/MojoFailureException
[ERROR] 
[ERROR] After correcting the problems, you can resume the build with the command
[ERROR]   mvn <goals> -rf :hadoop-mapreduce-client-app
Build step 'Execute shell' marked build as failure
[FINDBUGS] Skipping publisher since build result is FAILURE
Archiving artifacts
Recording test results
Updating YARN-4344
Email was triggered for: Failure - Any
Sending email for trigger: Failure - Any



###################################################################################
############################## FAILED TESTS (if any) ##############################
2 tests failed.
FAILED:  org.apache.hadoop.mapreduce.v2.app.TestMRAppMaster.testMRAppMasterSuccessLock

Error Message:
java.io.FileNotFoundException: File file:/home/jenkins/jenkins-slave/workspace/Hadoop-Mapreduce-trunk-Java8/hadoop-mapreduce-project/hadoop-mapreduce-client/hadoop-mapreduce-client-app/staging/history/done_intermediate/TestAppMasterUser/job_1317529182569_0004_conf.xml_tmp does not exist

Stack Trace:
org.apache.hadoop.yarn.exceptions.YarnRuntimeException: java.io.FileNotFoundException: File file:/home/jenkins/jenkins-slave/workspace/Hadoop-Mapreduce-trunk-Java8/hadoop-mapreduce-project/hadoop-mapreduce-client/hadoop-mapreduce-client-app/staging/history/done_intermediate/TestAppMasterUser/job_1317529182569_0004_conf.xml_tmp does not exist
	at org.apache.hadoop.fs.RawLocalFileSystem.deprecatedGetFileStatus(RawLocalFileSystem.java:640)
	at org.apache.hadoop.fs.RawLocalFileSystem.getFileLinkStatusInternal(RawLocalFileSystem.java:866)
	at org.apache.hadoop.fs.RawLocalFileSystem.getFileStatus(RawLocalFileSystem.java:630)
	at org.apache.hadoop.fs.FileUtil.copy(FileUtil.java:340)
	at org.apache.hadoop.fs.FileUtil.copy(FileUtil.java:292)
	at org.apache.hadoop.fs.RawLocalFileSystem.rename(RawLocalFileSystem.java:372)
	at org.apache.hadoop.fs.ChecksumFileSystem.rename(ChecksumFileSystem.java:513)
	at org.apache.hadoop.mapreduce.jobhistory.JobHistoryEventHandler.moveTmpToDone(JobHistoryEventHandler.java:1346)
	at org.apache.hadoop.mapreduce.jobhistory.JobHistoryEventHandler.processDoneFiles(JobHistoryEventHandler.java:1153)
	at org.apache.hadoop.service.ServiceOperations.stop(ServiceOperations.java:52)
	at org.apache.hadoop.service.ServiceOperations.stopQuietly(ServiceOperations.java:80)
	at org.apache.hadoop.service.CompositeService.stop(CompositeService.java:157)
	at org.apache.hadoop.service.CompositeService.serviceStop(CompositeService.java:131)
	at org.apache.hadoop.mapreduce.v2.app.MRAppMaster.serviceStop(MRAppMaster.java:1751)
	at org.apache.hadoop.service.AbstractService.stop(AbstractService.java:221)
	at org.apache.hadoop.mapreduce.v2.app.MRAppMaster.stop(MRAppMaster.java:1247)
	at org.apache.hadoop.mapreduce.v2.app.TestMRAppMaster.testMRAppMasterSuccessLock(TestMRAppMaster.java:254)


FAILED:  org.apache.hadoop.mapreduce.v2.app.TestMRAppMaster.testMRAppMasterMidLock

Error Message:
null

Stack Trace:
java.lang.AssertionError: null
	at org.junit.Assert.fail(Assert.java:86)
	at org.junit.Assert.assertTrue(Assert.java:41)
	at org.junit.Assert.assertTrue(Assert.java:52)
	at org.apache.hadoop.mapreduce.v2.app.TestMRAppMaster.testMRAppMasterMidLock(TestMRAppMaster.java:174)



Hadoop-Mapreduce-trunk-Java8 - Build # 705 - Still Failing

Posted by Apache Jenkins Server <je...@builds.apache.org>.
See https://builds.apache.org/job/Hadoop-Mapreduce-trunk-Java8/705/

###################################################################################
########################## LAST 60 LINES OF THE CONSOLE ###########################
[...truncated 10084 lines...]
Tests run: 1, Failures: 0, Errors: 0, Skipped: 0, Time elapsed: 0.385 sec - in org.apache.hadoop.mapreduce.jobhistory.TestJobSummary
Java HotSpot(TM) 64-Bit Server VM warning: ignoring option MaxPermSize=768m; support was removed in 8.0
Running org.apache.hadoop.mapreduce.jobhistory.TestJobHistoryEventHandler
Tests run: 13, Failures: 0, Errors: 0, Skipped: 0, Time elapsed: 21.524 sec - in org.apache.hadoop.mapreduce.jobhistory.TestJobHistoryEventHandler
Java HotSpot(TM) 64-Bit Server VM warning: ignoring option MaxPermSize=768m; support was removed in 8.0
Running org.apache.hadoop.mapreduce.jobhistory.TestEvents
Tests run: 5, Failures: 0, Errors: 0, Skipped: 0, Time elapsed: 0.657 sec - in org.apache.hadoop.mapreduce.jobhistory.TestEvents

Results :

Failed tests: 
  TestMRAppMaster.testMRAppMasterMidLock:174 null

Tests in error: 
  TestMRAppMaster.testMRAppMasterSuccessLock:254 » YarnRuntime java.io.FileNotFo...

Tests run: 340, Failures: 1, Errors: 1, Skipped: 0

[INFO] ------------------------------------------------------------------------
[INFO] Reactor Summary:
[INFO] 
[INFO] Apache Hadoop MapReduce Client .................... SUCCESS [  2.190 s]
[INFO] Apache Hadoop MapReduce Core ...................... SUCCESS [01:23 min]
[INFO] Apache Hadoop MapReduce Common .................... SUCCESS [ 29.111 s]
[INFO] Apache Hadoop MapReduce Shuffle ................... SUCCESS [  4.057 s]
[INFO] Apache Hadoop MapReduce App ....................... FAILURE [10:58 min]
[INFO] Apache Hadoop MapReduce HistoryServer ............. SKIPPED
[INFO] Apache Hadoop MapReduce JobClient ................. SKIPPED
[INFO] Apache Hadoop MapReduce HistoryServer Plugins ..... SKIPPED
[INFO] Apache Hadoop MapReduce NativeTask ................ SKIPPED
[INFO] Apache Hadoop MapReduce Examples .................. SKIPPED
[INFO] Apache Hadoop MapReduce ........................... SKIPPED
[INFO] ------------------------------------------------------------------------
[INFO] BUILD FAILURE
[INFO] ------------------------------------------------------------------------
[INFO] Total time: 12:58 min
[INFO] Finished at: 2015-11-23T19:46:36+00:00
[INFO] Final Memory: 40M/260M
[INFO] ------------------------------------------------------------------------
[ERROR] Failed to execute goal org.apache.maven.plugins:maven-surefire-plugin:2.17:test (default-test) on project hadoop-mapreduce-client-app: There are test failures.
[ERROR] 
[ERROR] Please refer to /home/jenkins/jenkins-slave/workspace/Hadoop-Mapreduce-trunk-Java8/hadoop-mapreduce-project/hadoop-mapreduce-client/hadoop-mapreduce-client-app/target/surefire-reports for the individual test results.
[ERROR] -> [Help 1]
[ERROR] 
[ERROR] To see the full stack trace of the errors, re-run Maven with the -e switch.
[ERROR] Re-run Maven using the -X switch to enable full debug logging.
[ERROR] 
[ERROR] For more information about the errors and possible solutions, please read the following articles:
[ERROR] [Help 1] http://cwiki.apache.org/confluence/display/MAVEN/MojoFailureException
[ERROR] 
[ERROR] After correcting the problems, you can resume the build with the command
[ERROR]   mvn <goals> -rf :hadoop-mapreduce-client-app
Build step 'Execute shell' marked build as failure
[FINDBUGS] Skipping publisher since build result is FAILURE
Archiving artifacts
Recording test results
Updating HDFS-7988
Email was triggered for: Failure - Any
Sending email for trigger: Failure - Any



###################################################################################
############################## FAILED TESTS (if any) ##############################
2 tests failed.
FAILED:  org.apache.hadoop.mapreduce.v2.app.TestMRAppMaster.testMRAppMasterSuccessLock

Error Message:
java.io.FileNotFoundException: File file:/home/jenkins/jenkins-slave/workspace/Hadoop-Mapreduce-trunk-Java8/hadoop-mapreduce-project/hadoop-mapreduce-client/hadoop-mapreduce-client-app/staging/history/done_intermediate/TestAppMasterUser/job_1317529182569_0004_conf.xml_tmp does not exist

Stack Trace:
org.apache.hadoop.yarn.exceptions.YarnRuntimeException: java.io.FileNotFoundException: File file:/home/jenkins/jenkins-slave/workspace/Hadoop-Mapreduce-trunk-Java8/hadoop-mapreduce-project/hadoop-mapreduce-client/hadoop-mapreduce-client-app/staging/history/done_intermediate/TestAppMasterUser/job_1317529182569_0004_conf.xml_tmp does not exist
	at org.apache.hadoop.fs.RawLocalFileSystem.deprecatedGetFileStatus(RawLocalFileSystem.java:640)
	at org.apache.hadoop.fs.RawLocalFileSystem.getFileLinkStatusInternal(RawLocalFileSystem.java:866)
	at org.apache.hadoop.fs.RawLocalFileSystem.getFileStatus(RawLocalFileSystem.java:630)
	at org.apache.hadoop.fs.FileUtil.copy(FileUtil.java:340)
	at org.apache.hadoop.fs.FileUtil.copy(FileUtil.java:292)
	at org.apache.hadoop.fs.RawLocalFileSystem.rename(RawLocalFileSystem.java:372)
	at org.apache.hadoop.fs.ChecksumFileSystem.rename(ChecksumFileSystem.java:513)
	at org.apache.hadoop.mapreduce.jobhistory.JobHistoryEventHandler.moveTmpToDone(JobHistoryEventHandler.java:1346)
	at org.apache.hadoop.mapreduce.jobhistory.JobHistoryEventHandler.processDoneFiles(JobHistoryEventHandler.java:1153)
	at org.apache.hadoop.service.ServiceOperations.stop(ServiceOperations.java:52)
	at org.apache.hadoop.service.ServiceOperations.stopQuietly(ServiceOperations.java:80)
	at org.apache.hadoop.service.CompositeService.stop(CompositeService.java:157)
	at org.apache.hadoop.service.CompositeService.serviceStop(CompositeService.java:131)
	at org.apache.hadoop.mapreduce.v2.app.MRAppMaster.serviceStop(MRAppMaster.java:1751)
	at org.apache.hadoop.service.AbstractService.stop(AbstractService.java:221)
	at org.apache.hadoop.mapreduce.v2.app.MRAppMaster.stop(MRAppMaster.java:1247)
	at org.apache.hadoop.mapreduce.v2.app.TestMRAppMaster.testMRAppMasterSuccessLock(TestMRAppMaster.java:254)


FAILED:  org.apache.hadoop.mapreduce.v2.app.TestMRAppMaster.testMRAppMasterMidLock

Error Message:
null

Stack Trace:
java.lang.AssertionError: null
	at org.junit.Assert.fail(Assert.java:86)
	at org.junit.Assert.assertTrue(Assert.java:41)
	at org.junit.Assert.assertTrue(Assert.java:52)
	at org.apache.hadoop.mapreduce.v2.app.TestMRAppMaster.testMRAppMasterMidLock(TestMRAppMaster.java:174)



Hadoop-Mapreduce-trunk-Java8 - Build # 704 - Still Failing

Posted by Apache Jenkins Server <je...@builds.apache.org>.
See https://builds.apache.org/job/Hadoop-Mapreduce-trunk-Java8/704/

###################################################################################
########################## LAST 60 LINES OF THE CONSOLE ###########################
[...truncated 10262 lines...]
Tests run: 1, Failures: 0, Errors: 0, Skipped: 0, Time elapsed: 1.281 sec - in org.apache.hadoop.mapred.TestTaskAttemptFinishingMonitor
Java HotSpot(TM) 64-Bit Server VM warning: ignoring option MaxPermSize=768m; support was removed in 8.0
Running org.apache.hadoop.mapred.TestTaskAttemptListenerImpl
Tests run: 6, Failures: 0, Errors: 0, Skipped: 0, Time elapsed: 1.004 sec - in org.apache.hadoop.mapred.TestTaskAttemptListenerImpl
Java HotSpot(TM) 64-Bit Server VM warning: ignoring option MaxPermSize=768m; support was removed in 8.0
Running org.apache.hadoop.mapred.TestLocalContainerLauncher
Tests run: 2, Failures: 0, Errors: 0, Skipped: 0, Time elapsed: 1.515 sec - in org.apache.hadoop.mapred.TestLocalContainerLauncher

Results :

Failed tests: 
  TestMRAppMaster.testMRAppMasterMidLock:174 null

Tests in error: 
  TestMRAppMaster.testMRAppMasterSuccessLock:254 » YarnRuntime java.io.FileNotFo...

Tests run: 340, Failures: 1, Errors: 1, Skipped: 0

[INFO] ------------------------------------------------------------------------
[INFO] Reactor Summary:
[INFO] 
[INFO] Apache Hadoop MapReduce Client .................... SUCCESS [  2.710 s]
[INFO] Apache Hadoop MapReduce Core ...................... SUCCESS [01:25 min]
[INFO] Apache Hadoop MapReduce Common .................... SUCCESS [ 26.377 s]
[INFO] Apache Hadoop MapReduce Shuffle ................... SUCCESS [  4.106 s]
[INFO] Apache Hadoop MapReduce App ....................... FAILURE [10:46 min]
[INFO] Apache Hadoop MapReduce HistoryServer ............. SKIPPED
[INFO] Apache Hadoop MapReduce JobClient ................. SKIPPED
[INFO] Apache Hadoop MapReduce HistoryServer Plugins ..... SKIPPED
[INFO] Apache Hadoop MapReduce NativeTask ................ SKIPPED
[INFO] Apache Hadoop MapReduce Examples .................. SKIPPED
[INFO] Apache Hadoop MapReduce ........................... SKIPPED
[INFO] ------------------------------------------------------------------------
[INFO] BUILD FAILURE
[INFO] ------------------------------------------------------------------------
[INFO] Total time: 12:46 min
[INFO] Finished at: 2015-11-23T18:34:48+00:00
[INFO] Final Memory: 40M/258M
[INFO] ------------------------------------------------------------------------
[ERROR] Failed to execute goal org.apache.maven.plugins:maven-surefire-plugin:2.17:test (default-test) on project hadoop-mapreduce-client-app: There are test failures.
[ERROR] 
[ERROR] Please refer to /home/jenkins/jenkins-slave/workspace/Hadoop-Mapreduce-trunk-Java8/hadoop-mapreduce-project/hadoop-mapreduce-client/hadoop-mapreduce-client-app/target/surefire-reports for the individual test results.
[ERROR] -> [Help 1]
[ERROR] 
[ERROR] To see the full stack trace of the errors, re-run Maven with the -e switch.
[ERROR] Re-run Maven using the -X switch to enable full debug logging.
[ERROR] 
[ERROR] For more information about the errors and possible solutions, please read the following articles:
[ERROR] [Help 1] http://cwiki.apache.org/confluence/display/MAVEN/MojoFailureException
[ERROR] 
[ERROR] After correcting the problems, you can resume the build with the command
[ERROR]   mvn <goals> -rf :hadoop-mapreduce-client-app
Build step 'Execute shell' marked build as failure
[FINDBUGS] Skipping publisher since build result is FAILURE
Archiving artifacts
Recording test results
Updating HADOOP-12577
Email was triggered for: Failure - Any
Sending email for trigger: Failure - Any



###################################################################################
############################## FAILED TESTS (if any) ##############################
2 tests failed.
FAILED:  org.apache.hadoop.mapreduce.v2.app.TestMRAppMaster.testMRAppMasterSuccessLock

Error Message:
java.io.FileNotFoundException: File file:/home/jenkins/jenkins-slave/workspace/Hadoop-Mapreduce-trunk-Java8/hadoop-mapreduce-project/hadoop-mapreduce-client/hadoop-mapreduce-client-app/staging/history/done_intermediate/TestAppMasterUser/job_1317529182569_0004_conf.xml_tmp does not exist

Stack Trace:
org.apache.hadoop.yarn.exceptions.YarnRuntimeException: java.io.FileNotFoundException: File file:/home/jenkins/jenkins-slave/workspace/Hadoop-Mapreduce-trunk-Java8/hadoop-mapreduce-project/hadoop-mapreduce-client/hadoop-mapreduce-client-app/staging/history/done_intermediate/TestAppMasterUser/job_1317529182569_0004_conf.xml_tmp does not exist
	at org.apache.hadoop.fs.RawLocalFileSystem.deprecatedGetFileStatus(RawLocalFileSystem.java:640)
	at org.apache.hadoop.fs.RawLocalFileSystem.getFileLinkStatusInternal(RawLocalFileSystem.java:866)
	at org.apache.hadoop.fs.RawLocalFileSystem.getFileStatus(RawLocalFileSystem.java:630)
	at org.apache.hadoop.fs.FileUtil.copy(FileUtil.java:340)
	at org.apache.hadoop.fs.FileUtil.copy(FileUtil.java:292)
	at org.apache.hadoop.fs.RawLocalFileSystem.rename(RawLocalFileSystem.java:372)
	at org.apache.hadoop.fs.ChecksumFileSystem.rename(ChecksumFileSystem.java:513)
	at org.apache.hadoop.mapreduce.jobhistory.JobHistoryEventHandler.moveTmpToDone(JobHistoryEventHandler.java:1346)
	at org.apache.hadoop.mapreduce.jobhistory.JobHistoryEventHandler.processDoneFiles(JobHistoryEventHandler.java:1153)
	at org.apache.hadoop.service.ServiceOperations.stop(ServiceOperations.java:52)
	at org.apache.hadoop.service.ServiceOperations.stopQuietly(ServiceOperations.java:80)
	at org.apache.hadoop.service.CompositeService.stop(CompositeService.java:157)
	at org.apache.hadoop.service.CompositeService.serviceStop(CompositeService.java:131)
	at org.apache.hadoop.mapreduce.v2.app.MRAppMaster.serviceStop(MRAppMaster.java:1751)
	at org.apache.hadoop.service.AbstractService.stop(AbstractService.java:221)
	at org.apache.hadoop.mapreduce.v2.app.MRAppMaster.stop(MRAppMaster.java:1247)
	at org.apache.hadoop.mapreduce.v2.app.TestMRAppMaster.testMRAppMasterSuccessLock(TestMRAppMaster.java:254)


FAILED:  org.apache.hadoop.mapreduce.v2.app.TestMRAppMaster.testMRAppMasterMidLock

Error Message:
null

Stack Trace:
java.lang.AssertionError: null
	at org.junit.Assert.fail(Assert.java:86)
	at org.junit.Assert.assertTrue(Assert.java:41)
	at org.junit.Assert.assertTrue(Assert.java:52)
	at org.apache.hadoop.mapreduce.v2.app.TestMRAppMaster.testMRAppMasterMidLock(TestMRAppMaster.java:174)



Hadoop-Mapreduce-trunk-Java8 - Build # 703 - Still Failing

Posted by Apache Jenkins Server <je...@builds.apache.org>.
See https://builds.apache.org/job/Hadoop-Mapreduce-trunk-Java8/703/

###################################################################################
########################## LAST 60 LINES OF THE CONSOLE ###########################
[...truncated 10087 lines...]
Tests run: 1, Failures: 0, Errors: 0, Skipped: 0, Time elapsed: 1.271 sec - in org.apache.hadoop.mapred.TestTaskAttemptFinishingMonitor
Java HotSpot(TM) 64-Bit Server VM warning: ignoring option MaxPermSize=768m; support was removed in 8.0
Running org.apache.hadoop.mapred.TestTaskAttemptListenerImpl
Tests run: 6, Failures: 0, Errors: 0, Skipped: 0, Time elapsed: 1.031 sec - in org.apache.hadoop.mapred.TestTaskAttemptListenerImpl
Java HotSpot(TM) 64-Bit Server VM warning: ignoring option MaxPermSize=768m; support was removed in 8.0
Running org.apache.hadoop.mapred.TestLocalContainerLauncher
Tests run: 2, Failures: 0, Errors: 0, Skipped: 0, Time elapsed: 1.504 sec - in org.apache.hadoop.mapred.TestLocalContainerLauncher

Results :

Failed tests: 
  TestMRAppMaster.testMRAppMasterMidLock:174 null

Tests in error: 
  TestMRAppMaster.testMRAppMasterSuccessLock:254 » YarnRuntime java.io.FileNotFo...

Tests run: 340, Failures: 1, Errors: 1, Skipped: 0

[INFO] ------------------------------------------------------------------------
[INFO] Reactor Summary:
[INFO] 
[INFO] Apache Hadoop MapReduce Client .................... SUCCESS [  2.089 s]
[INFO] Apache Hadoop MapReduce Core ...................... SUCCESS [01:25 min]
[INFO] Apache Hadoop MapReduce Common .................... SUCCESS [ 25.685 s]
[INFO] Apache Hadoop MapReduce Shuffle ................... SUCCESS [  4.157 s]
[INFO] Apache Hadoop MapReduce App ....................... FAILURE [10:49 min]
[INFO] Apache Hadoop MapReduce HistoryServer ............. SKIPPED
[INFO] Apache Hadoop MapReduce JobClient ................. SKIPPED
[INFO] Apache Hadoop MapReduce HistoryServer Plugins ..... SKIPPED
[INFO] Apache Hadoop MapReduce NativeTask ................ SKIPPED
[INFO] Apache Hadoop MapReduce Examples .................. SKIPPED
[INFO] Apache Hadoop MapReduce ........................... SKIPPED
[INFO] ------------------------------------------------------------------------
[INFO] BUILD FAILURE
[INFO] ------------------------------------------------------------------------
[INFO] Total time: 12:48 min
[INFO] Finished at: 2015-11-23T11:34:39+00:00
[INFO] Final Memory: 40M/247M
[INFO] ------------------------------------------------------------------------
[ERROR] Failed to execute goal org.apache.maven.plugins:maven-surefire-plugin:2.17:test (default-test) on project hadoop-mapreduce-client-app: There are test failures.
[ERROR] 
[ERROR] Please refer to /home/jenkins/jenkins-slave/workspace/Hadoop-Mapreduce-trunk-Java8/hadoop-mapreduce-project/hadoop-mapreduce-client/hadoop-mapreduce-client-app/target/surefire-reports for the individual test results.
[ERROR] -> [Help 1]
[ERROR] 
[ERROR] To see the full stack trace of the errors, re-run Maven with the -e switch.
[ERROR] Re-run Maven using the -X switch to enable full debug logging.
[ERROR] 
[ERROR] For more information about the errors and possible solutions, please read the following articles:
[ERROR] [Help 1] http://cwiki.apache.org/confluence/display/MAVEN/MojoFailureException
[ERROR] 
[ERROR] After correcting the problems, you can resume the build with the command
[ERROR]   mvn <goals> -rf :hadoop-mapreduce-client-app
Build step 'Execute shell' marked build as failure
[FINDBUGS] Skipping publisher since build result is FAILURE
Archiving artifacts
Recording test results
Updating HDFS-9423
Email was triggered for: Failure - Any
Sending email for trigger: Failure - Any



###################################################################################
############################## FAILED TESTS (if any) ##############################
2 tests failed.
FAILED:  org.apache.hadoop.mapreduce.v2.app.TestMRAppMaster.testMRAppMasterSuccessLock

Error Message:
java.io.FileNotFoundException: File file:/home/jenkins/jenkins-slave/workspace/Hadoop-Mapreduce-trunk-Java8/hadoop-mapreduce-project/hadoop-mapreduce-client/hadoop-mapreduce-client-app/staging/history/done_intermediate/TestAppMasterUser/job_1317529182569_0004_conf.xml_tmp does not exist

Stack Trace:
org.apache.hadoop.yarn.exceptions.YarnRuntimeException: java.io.FileNotFoundException: File file:/home/jenkins/jenkins-slave/workspace/Hadoop-Mapreduce-trunk-Java8/hadoop-mapreduce-project/hadoop-mapreduce-client/hadoop-mapreduce-client-app/staging/history/done_intermediate/TestAppMasterUser/job_1317529182569_0004_conf.xml_tmp does not exist
	at org.apache.hadoop.fs.RawLocalFileSystem.deprecatedGetFileStatus(RawLocalFileSystem.java:640)
	at org.apache.hadoop.fs.RawLocalFileSystem.getFileLinkStatusInternal(RawLocalFileSystem.java:866)
	at org.apache.hadoop.fs.RawLocalFileSystem.getFileStatus(RawLocalFileSystem.java:630)
	at org.apache.hadoop.fs.FileUtil.copy(FileUtil.java:340)
	at org.apache.hadoop.fs.FileUtil.copy(FileUtil.java:292)
	at org.apache.hadoop.fs.RawLocalFileSystem.rename(RawLocalFileSystem.java:372)
	at org.apache.hadoop.fs.ChecksumFileSystem.rename(ChecksumFileSystem.java:513)
	at org.apache.hadoop.mapreduce.jobhistory.JobHistoryEventHandler.moveTmpToDone(JobHistoryEventHandler.java:1346)
	at org.apache.hadoop.mapreduce.jobhistory.JobHistoryEventHandler.processDoneFiles(JobHistoryEventHandler.java:1153)
	at org.apache.hadoop.service.ServiceOperations.stop(ServiceOperations.java:52)
	at org.apache.hadoop.service.ServiceOperations.stopQuietly(ServiceOperations.java:80)
	at org.apache.hadoop.service.CompositeService.stop(CompositeService.java:157)
	at org.apache.hadoop.service.CompositeService.serviceStop(CompositeService.java:131)
	at org.apache.hadoop.mapreduce.v2.app.MRAppMaster.serviceStop(MRAppMaster.java:1751)
	at org.apache.hadoop.service.AbstractService.stop(AbstractService.java:221)
	at org.apache.hadoop.mapreduce.v2.app.MRAppMaster.stop(MRAppMaster.java:1247)
	at org.apache.hadoop.mapreduce.v2.app.TestMRAppMaster.testMRAppMasterSuccessLock(TestMRAppMaster.java:254)


FAILED:  org.apache.hadoop.mapreduce.v2.app.TestMRAppMaster.testMRAppMasterMidLock

Error Message:
null

Stack Trace:
java.lang.AssertionError: null
	at org.junit.Assert.fail(Assert.java:86)
	at org.junit.Assert.assertTrue(Assert.java:41)
	at org.junit.Assert.assertTrue(Assert.java:52)
	at org.apache.hadoop.mapreduce.v2.app.TestMRAppMaster.testMRAppMasterMidLock(TestMRAppMaster.java:174)



Hadoop-Mapreduce-trunk-Java8 - Build # 702 - Still Failing

Posted by Apache Jenkins Server <je...@builds.apache.org>.
See https://builds.apache.org/job/Hadoop-Mapreduce-trunk-Java8/702/

###################################################################################
########################## LAST 60 LINES OF THE CONSOLE ###########################
[...truncated 10088 lines...]
Java HotSpot(TM) 64-Bit Server VM warning: ignoring option MaxPermSize=768m; support was removed in 8.0
Running org.apache.hadoop.mapreduce.jobhistory.TestJobSummary
Tests run: 1, Failures: 0, Errors: 0, Skipped: 0, Time elapsed: 0.364 sec - in org.apache.hadoop.mapreduce.jobhistory.TestJobSummary
Java HotSpot(TM) 64-Bit Server VM warning: ignoring option MaxPermSize=768m; support was removed in 8.0
Running org.apache.hadoop.mapreduce.jobhistory.TestEvents
Tests run: 5, Failures: 0, Errors: 0, Skipped: 0, Time elapsed: 0.638 sec - in org.apache.hadoop.mapreduce.jobhistory.TestEvents

Results :

Failed tests: 
  TestMRAppMaster.testMRAppMasterMidLock:174 null

Tests in error: 
  TestMRAppMaster.testMRAppMasterSuccessLock:254 » YarnRuntime java.io.FileNotFo...

Tests run: 340, Failures: 1, Errors: 1, Skipped: 0

[INFO] ------------------------------------------------------------------------
[INFO] Reactor Summary:
[INFO] 
[INFO] Apache Hadoop MapReduce Client .................... SUCCESS [  3.079 s]
[INFO] Apache Hadoop MapReduce Core ...................... SUCCESS [01:45 min]
[INFO] Apache Hadoop MapReduce Common .................... SUCCESS [ 34.348 s]
[INFO] Apache Hadoop MapReduce Shuffle ................... SUCCESS [  5.506 s]
[INFO] Apache Hadoop MapReduce App ....................... FAILURE [11:36 min]
[INFO] Apache Hadoop MapReduce HistoryServer ............. SKIPPED
[INFO] Apache Hadoop MapReduce JobClient ................. SKIPPED
[INFO] Apache Hadoop MapReduce HistoryServer Plugins ..... SKIPPED
[INFO] Apache Hadoop MapReduce NativeTask ................ SKIPPED
[INFO] Apache Hadoop MapReduce Examples .................. SKIPPED
[INFO] Apache Hadoop MapReduce ........................... SKIPPED
[INFO] ------------------------------------------------------------------------
[INFO] BUILD FAILURE
[INFO] ------------------------------------------------------------------------
[INFO] Total time: 14:06 min
[INFO] Finished at: 2015-11-23T08:37:28+00:00
[INFO] Final Memory: 40M/264M
[INFO] ------------------------------------------------------------------------
[ERROR] Failed to execute goal org.apache.maven.plugins:maven-surefire-plugin:2.17:test (default-test) on project hadoop-mapreduce-client-app: There are test failures.
[ERROR] 
[ERROR] Please refer to /home/jenkins/jenkins-slave/workspace/Hadoop-Mapreduce-trunk-Java8/hadoop-mapreduce-project/hadoop-mapreduce-client/hadoop-mapreduce-client-app/target/surefire-reports for the individual test results.
[ERROR] -> [Help 1]
[ERROR] 
[ERROR] To see the full stack trace of the errors, re-run Maven with the -e switch.
[ERROR] Re-run Maven using the -X switch to enable full debug logging.
[ERROR] 
[ERROR] For more information about the errors and possible solutions, please read the following articles:
[ERROR] [Help 1] http://cwiki.apache.org/confluence/display/MAVEN/MojoFailureException
[ERROR] 
[ERROR] After correcting the problems, you can resume the build with the command
[ERROR]   mvn <goals> -rf :hadoop-mapreduce-client-app
Build step 'Execute shell' marked build as failure
[FINDBUGS] Skipping publisher since build result is FAILURE
Archiving artifacts
Recording test results
Updating HDFS-9428
Updating HDFS-9435
Email was triggered for: Failure - Any
Sending email for trigger: Failure - Any



###################################################################################
############################## FAILED TESTS (if any) ##############################
2 tests failed.
FAILED:  org.apache.hadoop.mapreduce.v2.app.TestMRAppMaster.testMRAppMasterSuccessLock

Error Message:
java.io.FileNotFoundException: File file:/home/jenkins/jenkins-slave/workspace/Hadoop-Mapreduce-trunk-Java8/hadoop-mapreduce-project/hadoop-mapreduce-client/hadoop-mapreduce-client-app/staging/history/done_intermediate/TestAppMasterUser/job_1317529182569_0004_conf.xml_tmp does not exist

Stack Trace:
org.apache.hadoop.yarn.exceptions.YarnRuntimeException: java.io.FileNotFoundException: File file:/home/jenkins/jenkins-slave/workspace/Hadoop-Mapreduce-trunk-Java8/hadoop-mapreduce-project/hadoop-mapreduce-client/hadoop-mapreduce-client-app/staging/history/done_intermediate/TestAppMasterUser/job_1317529182569_0004_conf.xml_tmp does not exist
	at org.apache.hadoop.fs.RawLocalFileSystem.deprecatedGetFileStatus(RawLocalFileSystem.java:640)
	at org.apache.hadoop.fs.RawLocalFileSystem.getFileLinkStatusInternal(RawLocalFileSystem.java:866)
	at org.apache.hadoop.fs.RawLocalFileSystem.getFileStatus(RawLocalFileSystem.java:630)
	at org.apache.hadoop.fs.FileUtil.copy(FileUtil.java:340)
	at org.apache.hadoop.fs.FileUtil.copy(FileUtil.java:292)
	at org.apache.hadoop.fs.RawLocalFileSystem.rename(RawLocalFileSystem.java:372)
	at org.apache.hadoop.fs.ChecksumFileSystem.rename(ChecksumFileSystem.java:513)
	at org.apache.hadoop.mapreduce.jobhistory.JobHistoryEventHandler.moveTmpToDone(JobHistoryEventHandler.java:1346)
	at org.apache.hadoop.mapreduce.jobhistory.JobHistoryEventHandler.processDoneFiles(JobHistoryEventHandler.java:1153)
	at org.apache.hadoop.service.ServiceOperations.stop(ServiceOperations.java:52)
	at org.apache.hadoop.service.ServiceOperations.stopQuietly(ServiceOperations.java:80)
	at org.apache.hadoop.service.CompositeService.stop(CompositeService.java:157)
	at org.apache.hadoop.service.CompositeService.serviceStop(CompositeService.java:131)
	at org.apache.hadoop.mapreduce.v2.app.MRAppMaster.serviceStop(MRAppMaster.java:1751)
	at org.apache.hadoop.service.AbstractService.stop(AbstractService.java:221)
	at org.apache.hadoop.mapreduce.v2.app.MRAppMaster.stop(MRAppMaster.java:1247)
	at org.apache.hadoop.mapreduce.v2.app.TestMRAppMaster.testMRAppMasterSuccessLock(TestMRAppMaster.java:254)


FAILED:  org.apache.hadoop.mapreduce.v2.app.TestMRAppMaster.testMRAppMasterMidLock

Error Message:
null

Stack Trace:
java.lang.AssertionError: null
	at org.junit.Assert.fail(Assert.java:86)
	at org.junit.Assert.assertTrue(Assert.java:41)
	at org.junit.Assert.assertTrue(Assert.java:52)
	at org.apache.hadoop.mapreduce.v2.app.TestMRAppMaster.testMRAppMasterMidLock(TestMRAppMaster.java:174)



Hadoop-Mapreduce-trunk-Java8 - Build # 701 - Still Failing

Posted by Apache Jenkins Server <je...@builds.apache.org>.
See https://builds.apache.org/job/Hadoop-Mapreduce-trunk-Java8/701/

###################################################################################
########################## LAST 60 LINES OF THE CONSOLE ###########################
[...truncated 10088 lines...]
Running org.apache.hadoop.mapred.TestTaskAttemptListenerImpl
Tests run: 6, Failures: 0, Errors: 0, Skipped: 0, Time elapsed: 1.006 sec - in org.apache.hadoop.mapred.TestTaskAttemptListenerImpl
Java HotSpot(TM) 64-Bit Server VM warning: ignoring option MaxPermSize=768m; support was removed in 8.0
Running org.apache.hadoop.mapred.TestLocalContainerLauncher
Tests run: 2, Failures: 0, Errors: 0, Skipped: 0, Time elapsed: 1.475 sec - in org.apache.hadoop.mapred.TestLocalContainerLauncher

Results :

Failed tests: 
  TestMRAppMaster.testMRAppMasterMidLock:174 null

Tests in error: 
  TestMRAppMaster.testMRAppMasterSuccessLock:254 » YarnRuntime java.io.FileNotFo...

Tests run: 340, Failures: 1, Errors: 1, Skipped: 0

[INFO] ------------------------------------------------------------------------
[INFO] Reactor Summary:
[INFO] 
[INFO] Apache Hadoop MapReduce Client .................... SUCCESS [  2.081 s]
[INFO] Apache Hadoop MapReduce Core ...................... SUCCESS [01:24 min]
[INFO] Apache Hadoop MapReduce Common .................... SUCCESS [ 25.919 s]
[INFO] Apache Hadoop MapReduce Shuffle ................... SUCCESS [  4.142 s]
[INFO] Apache Hadoop MapReduce App ....................... FAILURE [11:03 min]
[INFO] Apache Hadoop MapReduce HistoryServer ............. SKIPPED
[INFO] Apache Hadoop MapReduce JobClient ................. SKIPPED
[INFO] Apache Hadoop MapReduce HistoryServer Plugins ..... SKIPPED
[INFO] Apache Hadoop MapReduce NativeTask ................ SKIPPED
[INFO] Apache Hadoop MapReduce Examples .................. SKIPPED
[INFO] Apache Hadoop MapReduce ........................... SKIPPED
[INFO] ------------------------------------------------------------------------
[INFO] BUILD FAILURE
[INFO] ------------------------------------------------------------------------
[INFO] Total time: 13:01 min
[INFO] Finished at: 2015-11-23T07:35:12+00:00
[INFO] Final Memory: 41M/322M
[INFO] ------------------------------------------------------------------------
[ERROR] Failed to execute goal org.apache.maven.plugins:maven-surefire-plugin:2.17:test (default-test) on project hadoop-mapreduce-client-app: There are test failures.
[ERROR] 
[ERROR] Please refer to /home/jenkins/jenkins-slave/workspace/Hadoop-Mapreduce-trunk-Java8/hadoop-mapreduce-project/hadoop-mapreduce-client/hadoop-mapreduce-client-app/target/surefire-reports for the individual test results.
[ERROR] -> [Help 1]
[ERROR] 
[ERROR] To see the full stack trace of the errors, re-run Maven with the -e switch.
[ERROR] Re-run Maven using the -X switch to enable full debug logging.
[ERROR] 
[ERROR] For more information about the errors and possible solutions, please read the following articles:
[ERROR] [Help 1] http://cwiki.apache.org/confluence/display/MAVEN/MojoFailureException
[ERROR] 
[ERROR] After correcting the problems, you can resume the build with the command
[ERROR]   mvn <goals> -rf :hadoop-mapreduce-client-app
Build step 'Execute shell' marked build as failure
[FINDBUGS] Skipping publisher since build result is FAILURE
Archiving artifacts
Recording test results
Updating HDFS-9356
Updating HADOOP-12313
Updating HDFS-9024
Email was triggered for: Failure - Any
Sending email for trigger: Failure - Any



###################################################################################
############################## FAILED TESTS (if any) ##############################
2 tests failed.
FAILED:  org.apache.hadoop.mapreduce.v2.app.TestMRAppMaster.testMRAppMasterSuccessLock

Error Message:
java.io.FileNotFoundException: File file:/home/jenkins/jenkins-slave/workspace/Hadoop-Mapreduce-trunk-Java8/hadoop-mapreduce-project/hadoop-mapreduce-client/hadoop-mapreduce-client-app/staging/history/done_intermediate/TestAppMasterUser/job_1317529182569_0004_conf.xml_tmp does not exist

Stack Trace:
org.apache.hadoop.yarn.exceptions.YarnRuntimeException: java.io.FileNotFoundException: File file:/home/jenkins/jenkins-slave/workspace/Hadoop-Mapreduce-trunk-Java8/hadoop-mapreduce-project/hadoop-mapreduce-client/hadoop-mapreduce-client-app/staging/history/done_intermediate/TestAppMasterUser/job_1317529182569_0004_conf.xml_tmp does not exist
	at org.apache.hadoop.fs.RawLocalFileSystem.deprecatedGetFileStatus(RawLocalFileSystem.java:640)
	at org.apache.hadoop.fs.RawLocalFileSystem.getFileLinkStatusInternal(RawLocalFileSystem.java:866)
	at org.apache.hadoop.fs.RawLocalFileSystem.getFileStatus(RawLocalFileSystem.java:630)
	at org.apache.hadoop.fs.FileUtil.copy(FileUtil.java:340)
	at org.apache.hadoop.fs.FileUtil.copy(FileUtil.java:292)
	at org.apache.hadoop.fs.RawLocalFileSystem.rename(RawLocalFileSystem.java:372)
	at org.apache.hadoop.fs.ChecksumFileSystem.rename(ChecksumFileSystem.java:513)
	at org.apache.hadoop.mapreduce.jobhistory.JobHistoryEventHandler.moveTmpToDone(JobHistoryEventHandler.java:1346)
	at org.apache.hadoop.mapreduce.jobhistory.JobHistoryEventHandler.processDoneFiles(JobHistoryEventHandler.java:1153)
	at org.apache.hadoop.service.ServiceOperations.stop(ServiceOperations.java:52)
	at org.apache.hadoop.service.ServiceOperations.stopQuietly(ServiceOperations.java:80)
	at org.apache.hadoop.service.CompositeService.stop(CompositeService.java:157)
	at org.apache.hadoop.service.CompositeService.serviceStop(CompositeService.java:131)
	at org.apache.hadoop.mapreduce.v2.app.MRAppMaster.serviceStop(MRAppMaster.java:1751)
	at org.apache.hadoop.service.AbstractService.stop(AbstractService.java:221)
	at org.apache.hadoop.mapreduce.v2.app.MRAppMaster.stop(MRAppMaster.java:1247)
	at org.apache.hadoop.mapreduce.v2.app.TestMRAppMaster.testMRAppMasterSuccessLock(TestMRAppMaster.java:254)


FAILED:  org.apache.hadoop.mapreduce.v2.app.TestMRAppMaster.testMRAppMasterMidLock

Error Message:
null

Stack Trace:
java.lang.AssertionError: null
	at org.junit.Assert.fail(Assert.java:86)
	at org.junit.Assert.assertTrue(Assert.java:41)
	at org.junit.Assert.assertTrue(Assert.java:52)
	at org.apache.hadoop.mapreduce.v2.app.TestMRAppMaster.testMRAppMasterMidLock(TestMRAppMaster.java:174)



Hadoop-Mapreduce-trunk-Java8 - Build # 700 - Still Failing

Posted by Apache Jenkins Server <je...@builds.apache.org>.
See https://builds.apache.org/job/Hadoop-Mapreduce-trunk-Java8/700/

###################################################################################
########################## LAST 60 LINES OF THE CONSOLE ###########################
[...truncated 10097 lines...]
Running org.apache.hadoop.mapreduce.jobhistory.TestJobSummary
Tests run: 1, Failures: 0, Errors: 0, Skipped: 0, Time elapsed: 0.355 sec - in org.apache.hadoop.mapreduce.jobhistory.TestJobSummary
Java HotSpot(TM) 64-Bit Server VM warning: ignoring option MaxPermSize=768m; support was removed in 8.0
Running org.apache.hadoop.mapreduce.jobhistory.TestEvents
Tests run: 5, Failures: 0, Errors: 0, Skipped: 0, Time elapsed: 0.684 sec - in org.apache.hadoop.mapreduce.jobhistory.TestEvents

Results :

Failed tests: 
  TestMRAppMaster.testMRAppMasterMidLock:174 null
  TestTaskAttempt.testMRAppHistoryForTAFailedInAssigned:177->testTaskAttemptAssignedKilledHistory:388 No Ta Started JH Event

Tests in error: 
  TestMRAppMaster.testMRAppMasterSuccessLock:254 » YarnRuntime java.io.FileNotFo...

Tests run: 340, Failures: 2, Errors: 1, Skipped: 0

[INFO] ------------------------------------------------------------------------
[INFO] Reactor Summary:
[INFO] 
[INFO] Apache Hadoop MapReduce Client .................... SUCCESS [  2.937 s]
[INFO] Apache Hadoop MapReduce Core ...................... SUCCESS [01:34 min]
[INFO] Apache Hadoop MapReduce Common .................... SUCCESS [ 29.718 s]
[INFO] Apache Hadoop MapReduce Shuffle ................... SUCCESS [  4.826 s]
[INFO] Apache Hadoop MapReduce App ....................... FAILURE [11:30 min]
[INFO] Apache Hadoop MapReduce HistoryServer ............. SKIPPED
[INFO] Apache Hadoop MapReduce JobClient ................. SKIPPED
[INFO] Apache Hadoop MapReduce HistoryServer Plugins ..... SKIPPED
[INFO] Apache Hadoop MapReduce NativeTask ................ SKIPPED
[INFO] Apache Hadoop MapReduce Examples .................. SKIPPED
[INFO] Apache Hadoop MapReduce ........................... SKIPPED
[INFO] ------------------------------------------------------------------------
[INFO] BUILD FAILURE
[INFO] ------------------------------------------------------------------------
[INFO] Total time: 13:43 min
[INFO] Finished at: 2015-11-23T04:36:42+00:00
[INFO] Final Memory: 40M/264M
[INFO] ------------------------------------------------------------------------
[ERROR] Failed to execute goal org.apache.maven.plugins:maven-surefire-plugin:2.17:test (default-test) on project hadoop-mapreduce-client-app: There are test failures.
[ERROR] 
[ERROR] Please refer to /home/jenkins/jenkins-slave/workspace/Hadoop-Mapreduce-trunk-Java8/hadoop-mapreduce-project/hadoop-mapreduce-client/hadoop-mapreduce-client-app/target/surefire-reports for the individual test results.
[ERROR] -> [Help 1]
[ERROR] 
[ERROR] To see the full stack trace of the errors, re-run Maven with the -e switch.
[ERROR] Re-run Maven using the -X switch to enable full debug logging.
[ERROR] 
[ERROR] For more information about the errors and possible solutions, please read the following articles:
[ERROR] [Help 1] http://cwiki.apache.org/confluence/display/MAVEN/MojoFailureException
[ERROR] 
[ERROR] After correcting the problems, you can resume the build with the command
[ERROR]   mvn <goals> -rf :hadoop-mapreduce-client-app
Build step 'Execute shell' marked build as failure
[FINDBUGS] Skipping publisher since build result is FAILURE
Archiving artifacts
Recording test results
Updating HADOOP-11677
Updating HADOOP-11149
Email was triggered for: Failure - Any
Sending email for trigger: Failure - Any



###################################################################################
############################## FAILED TESTS (if any) ##############################
3 tests failed.
FAILED:  org.apache.hadoop.mapreduce.v2.app.job.impl.TestTaskAttempt.testMRAppHistoryForTAFailedInAssigned

Error Message:
No Ta Started JH Event

Stack Trace:
java.lang.AssertionError: No Ta Started JH Event
	at org.junit.Assert.fail(Assert.java:88)
	at org.junit.Assert.assertTrue(Assert.java:41)
	at org.apache.hadoop.mapreduce.v2.app.job.impl.TestTaskAttempt.testTaskAttemptAssignedKilledHistory(TestTaskAttempt.java:388)
	at org.apache.hadoop.mapreduce.v2.app.job.impl.TestTaskAttempt.testMRAppHistoryForTAFailedInAssigned(TestTaskAttempt.java:177)


FAILED:  org.apache.hadoop.mapreduce.v2.app.TestMRAppMaster.testMRAppMasterSuccessLock

Error Message:
java.io.FileNotFoundException: File file:/home/jenkins/jenkins-slave/workspace/Hadoop-Mapreduce-trunk-Java8/hadoop-mapreduce-project/hadoop-mapreduce-client/hadoop-mapreduce-client-app/staging/history/done_intermediate/TestAppMasterUser/job_1317529182569_0004_conf.xml_tmp does not exist

Stack Trace:
org.apache.hadoop.yarn.exceptions.YarnRuntimeException: java.io.FileNotFoundException: File file:/home/jenkins/jenkins-slave/workspace/Hadoop-Mapreduce-trunk-Java8/hadoop-mapreduce-project/hadoop-mapreduce-client/hadoop-mapreduce-client-app/staging/history/done_intermediate/TestAppMasterUser/job_1317529182569_0004_conf.xml_tmp does not exist
	at org.apache.hadoop.fs.RawLocalFileSystem.deprecatedGetFileStatus(RawLocalFileSystem.java:640)
	at org.apache.hadoop.fs.RawLocalFileSystem.getFileLinkStatusInternal(RawLocalFileSystem.java:866)
	at org.apache.hadoop.fs.RawLocalFileSystem.getFileStatus(RawLocalFileSystem.java:630)
	at org.apache.hadoop.fs.FileUtil.copy(FileUtil.java:340)
	at org.apache.hadoop.fs.FileUtil.copy(FileUtil.java:292)
	at org.apache.hadoop.fs.RawLocalFileSystem.rename(RawLocalFileSystem.java:372)
	at org.apache.hadoop.fs.ChecksumFileSystem.rename(ChecksumFileSystem.java:513)
	at org.apache.hadoop.mapreduce.jobhistory.JobHistoryEventHandler.moveTmpToDone(JobHistoryEventHandler.java:1346)
	at org.apache.hadoop.mapreduce.jobhistory.JobHistoryEventHandler.processDoneFiles(JobHistoryEventHandler.java:1153)
	at org.apache.hadoop.service.ServiceOperations.stop(ServiceOperations.java:52)
	at org.apache.hadoop.service.ServiceOperations.stopQuietly(ServiceOperations.java:80)
	at org.apache.hadoop.service.CompositeService.stop(CompositeService.java:157)
	at org.apache.hadoop.service.CompositeService.serviceStop(CompositeService.java:131)
	at org.apache.hadoop.mapreduce.v2.app.MRAppMaster.serviceStop(MRAppMaster.java:1751)
	at org.apache.hadoop.service.AbstractService.stop(AbstractService.java:221)
	at org.apache.hadoop.mapreduce.v2.app.MRAppMaster.stop(MRAppMaster.java:1247)
	at org.apache.hadoop.mapreduce.v2.app.TestMRAppMaster.testMRAppMasterSuccessLock(TestMRAppMaster.java:254)


FAILED:  org.apache.hadoop.mapreduce.v2.app.TestMRAppMaster.testMRAppMasterMidLock

Error Message:
null

Stack Trace:
java.lang.AssertionError: null
	at org.junit.Assert.fail(Assert.java:86)
	at org.junit.Assert.assertTrue(Assert.java:41)
	at org.junit.Assert.assertTrue(Assert.java:52)
	at org.apache.hadoop.mapreduce.v2.app.TestMRAppMaster.testMRAppMasterMidLock(TestMRAppMaster.java:174)



Hadoop-Mapreduce-trunk-Java8 - Build # 699 - Still Failing

Posted by Apache Jenkins Server <je...@builds.apache.org>.
See https://builds.apache.org/job/Hadoop-Mapreduce-trunk-Java8/699/

###################################################################################
########################## LAST 60 LINES OF THE CONSOLE ###########################
[...truncated 10090 lines...]
Java HotSpot(TM) 64-Bit Server VM warning: ignoring option MaxPermSize=768m; support was removed in 8.0
Running org.apache.hadoop.mapred.TestTaskAttemptListenerImpl
Tests run: 6, Failures: 0, Errors: 0, Skipped: 0, Time elapsed: 1.023 sec - in org.apache.hadoop.mapred.TestTaskAttemptListenerImpl
Java HotSpot(TM) 64-Bit Server VM warning: ignoring option MaxPermSize=768m; support was removed in 8.0
Running org.apache.hadoop.mapred.TestLocalContainerLauncher
Tests run: 2, Failures: 0, Errors: 0, Skipped: 0, Time elapsed: 1.54 sec - in org.apache.hadoop.mapred.TestLocalContainerLauncher

Results :

Failed tests: 
  TestMRAppMaster.testMRAppMasterMidLock:174 null

Tests in error: 
  TestMRAppMaster.testMRAppMasterSuccessLock:254 » YarnRuntime java.io.FileNotFo...

Tests run: 340, Failures: 1, Errors: 1, Skipped: 0

[INFO] ------------------------------------------------------------------------
[INFO] Reactor Summary:
[INFO] 
[INFO] Apache Hadoop MapReduce Client .................... SUCCESS [  2.318 s]
[INFO] Apache Hadoop MapReduce Core ...................... SUCCESS [01:27 min]
[INFO] Apache Hadoop MapReduce Common .................... SUCCESS [ 26.407 s]
[INFO] Apache Hadoop MapReduce Shuffle ................... SUCCESS [  4.223 s]
[INFO] Apache Hadoop MapReduce App ....................... FAILURE [10:32 min]
[INFO] Apache Hadoop MapReduce HistoryServer ............. SKIPPED
[INFO] Apache Hadoop MapReduce JobClient ................. SKIPPED
[INFO] Apache Hadoop MapReduce HistoryServer Plugins ..... SKIPPED
[INFO] Apache Hadoop MapReduce NativeTask ................ SKIPPED
[INFO] Apache Hadoop MapReduce Examples .................. SKIPPED
[INFO] Apache Hadoop MapReduce ........................... SKIPPED
[INFO] ------------------------------------------------------------------------
[INFO] BUILD FAILURE
[INFO] ------------------------------------------------------------------------
[INFO] Total time: 12:33 min
[INFO] Finished at: 2015-11-23T03:34:21+00:00
[INFO] Final Memory: 40M/252M
[INFO] ------------------------------------------------------------------------
[ERROR] Failed to execute goal org.apache.maven.plugins:maven-surefire-plugin:2.17:test (default-test) on project hadoop-mapreduce-client-app: There are test failures.
[ERROR] 
[ERROR] Please refer to /home/jenkins/jenkins-slave/workspace/Hadoop-Mapreduce-trunk-Java8/hadoop-mapreduce-project/hadoop-mapreduce-client/hadoop-mapreduce-client-app/target/surefire-reports for the individual test results.
[ERROR] -> [Help 1]
[ERROR] 
[ERROR] To see the full stack trace of the errors, re-run Maven with the -e switch.
[ERROR] Re-run Maven using the -X switch to enable full debug logging.
[ERROR] 
[ERROR] For more information about the errors and possible solutions, please read the following articles:
[ERROR] [Help 1] http://cwiki.apache.org/confluence/display/MAVEN/MojoFailureException
[ERROR] 
[ERROR] After correcting the problems, you can resume the build with the command
[ERROR]   mvn <goals> -rf :hadoop-mapreduce-client-app
Build step 'Execute shell' marked build as failure
[FINDBUGS] Skipping publisher since build result is FAILURE
Archiving artifacts
Recording test results
Updating HDFS-7897
Updating HADOOP-10068
Email was triggered for: Failure - Any
Sending email for trigger: Failure - Any



###################################################################################
############################## FAILED TESTS (if any) ##############################
2 tests failed.
FAILED:  org.apache.hadoop.mapreduce.v2.app.TestMRAppMaster.testMRAppMasterSuccessLock

Error Message:
java.io.FileNotFoundException: File file:/home/jenkins/jenkins-slave/workspace/Hadoop-Mapreduce-trunk-Java8/hadoop-mapreduce-project/hadoop-mapreduce-client/hadoop-mapreduce-client-app/staging/history/done_intermediate/TestAppMasterUser/job_1317529182569_0004_conf.xml_tmp does not exist

Stack Trace:
org.apache.hadoop.yarn.exceptions.YarnRuntimeException: java.io.FileNotFoundException: File file:/home/jenkins/jenkins-slave/workspace/Hadoop-Mapreduce-trunk-Java8/hadoop-mapreduce-project/hadoop-mapreduce-client/hadoop-mapreduce-client-app/staging/history/done_intermediate/TestAppMasterUser/job_1317529182569_0004_conf.xml_tmp does not exist
	at org.apache.hadoop.fs.RawLocalFileSystem.deprecatedGetFileStatus(RawLocalFileSystem.java:640)
	at org.apache.hadoop.fs.RawLocalFileSystem.getFileLinkStatusInternal(RawLocalFileSystem.java:866)
	at org.apache.hadoop.fs.RawLocalFileSystem.getFileStatus(RawLocalFileSystem.java:630)
	at org.apache.hadoop.fs.FileUtil.copy(FileUtil.java:340)
	at org.apache.hadoop.fs.FileUtil.copy(FileUtil.java:292)
	at org.apache.hadoop.fs.RawLocalFileSystem.rename(RawLocalFileSystem.java:372)
	at org.apache.hadoop.fs.ChecksumFileSystem.rename(ChecksumFileSystem.java:513)
	at org.apache.hadoop.mapreduce.jobhistory.JobHistoryEventHandler.moveTmpToDone(JobHistoryEventHandler.java:1346)
	at org.apache.hadoop.mapreduce.jobhistory.JobHistoryEventHandler.processDoneFiles(JobHistoryEventHandler.java:1153)
	at org.apache.hadoop.service.ServiceOperations.stop(ServiceOperations.java:52)
	at org.apache.hadoop.service.ServiceOperations.stopQuietly(ServiceOperations.java:80)
	at org.apache.hadoop.service.CompositeService.stop(CompositeService.java:157)
	at org.apache.hadoop.service.CompositeService.serviceStop(CompositeService.java:131)
	at org.apache.hadoop.mapreduce.v2.app.MRAppMaster.serviceStop(MRAppMaster.java:1751)
	at org.apache.hadoop.service.AbstractService.stop(AbstractService.java:221)
	at org.apache.hadoop.mapreduce.v2.app.MRAppMaster.stop(MRAppMaster.java:1247)
	at org.apache.hadoop.mapreduce.v2.app.TestMRAppMaster.testMRAppMasterSuccessLock(TestMRAppMaster.java:254)


FAILED:  org.apache.hadoop.mapreduce.v2.app.TestMRAppMaster.testMRAppMasterMidLock

Error Message:
null

Stack Trace:
java.lang.AssertionError: null
	at org.junit.Assert.fail(Assert.java:86)
	at org.junit.Assert.assertTrue(Assert.java:41)
	at org.junit.Assert.assertTrue(Assert.java:52)
	at org.apache.hadoop.mapreduce.v2.app.TestMRAppMaster.testMRAppMasterMidLock(TestMRAppMaster.java:174)



Hadoop-Mapreduce-trunk-Java8 - Build # 698 - Still Failing

Posted by Apache Jenkins Server <je...@builds.apache.org>.
See https://builds.apache.org/job/Hadoop-Mapreduce-trunk-Java8/698/

###################################################################################
########################## LAST 60 LINES OF THE CONSOLE ###########################
[...truncated 10071 lines...]
Java HotSpot(TM) 64-Bit Server VM warning: ignoring option MaxPermSize=768m; support was removed in 8.0
Running org.apache.hadoop.mapred.TestTaskAttemptFinishingMonitor
Tests run: 1, Failures: 0, Errors: 0, Skipped: 0, Time elapsed: 2.327 sec - in org.apache.hadoop.mapred.TestTaskAttemptFinishingMonitor
Java HotSpot(TM) 64-Bit Server VM warning: ignoring option MaxPermSize=768m; support was removed in 8.0
Running org.apache.hadoop.mapred.TestLocalContainerLauncher
Tests run: 2, Failures: 0, Errors: 0, Skipped: 0, Time elapsed: 3.052 sec - in org.apache.hadoop.mapred.TestLocalContainerLauncher

Results :

Failed tests: 
  TestMRAppMaster.testMRAppMasterMidLock:174 null

Tests run: 340, Failures: 1, Errors: 0, Skipped: 0

[INFO] ------------------------------------------------------------------------
[INFO] Reactor Summary:
[INFO] 
[INFO] Apache Hadoop MapReduce Client .................... SUCCESS [  4.513 s]
[INFO] Apache Hadoop MapReduce Core ...................... SUCCESS [02:43 min]
[INFO] Apache Hadoop MapReduce Common .................... SUCCESS [ 47.580 s]
[INFO] Apache Hadoop MapReduce Shuffle ................... SUCCESS [  8.163 s]
[INFO] Apache Hadoop MapReduce App ....................... FAILURE [14:27 min]
[INFO] Apache Hadoop MapReduce HistoryServer ............. SKIPPED
[INFO] Apache Hadoop MapReduce JobClient ................. SKIPPED
[INFO] Apache Hadoop MapReduce HistoryServer Plugins ..... SKIPPED
[INFO] Apache Hadoop MapReduce NativeTask ................ SKIPPED
[INFO] Apache Hadoop MapReduce Examples .................. SKIPPED
[INFO] Apache Hadoop MapReduce ........................... SKIPPED
[INFO] ------------------------------------------------------------------------
[INFO] BUILD FAILURE
[INFO] ------------------------------------------------------------------------
[INFO] Total time: 18:14 min
[INFO] Finished at: 2015-11-23T02:43:18+00:00
[INFO] Final Memory: 41M/284M
[INFO] ------------------------------------------------------------------------
[ERROR] Failed to execute goal org.apache.maven.plugins:maven-surefire-plugin:2.17:test (default-test) on project hadoop-mapreduce-client-app: There are test failures.
[ERROR] 
[ERROR] Please refer to /home/jenkins/jenkins-slave/workspace/Hadoop-Mapreduce-trunk-Java8/hadoop-mapreduce-project/hadoop-mapreduce-client/hadoop-mapreduce-client-app/target/surefire-reports for the individual test results.
[ERROR] -> [Help 1]
[ERROR] 
[ERROR] To see the full stack trace of the errors, re-run Maven with the -e switch.
[ERROR] Re-run Maven using the -X switch to enable full debug logging.
[ERROR] 
[ERROR] For more information about the errors and possible solutions, please read the following articles:
[ERROR] [Help 1] http://cwiki.apache.org/confluence/display/MAVEN/MojoFailureException
[ERROR] 
[ERROR] After correcting the problems, you can resume the build with the command
[ERROR]   mvn <goals> -rf :hadoop-mapreduce-client-app
Build step 'Execute shell' marked build as failure
[FINDBUGS] Skipping publisher since build result is FAILURE
Archiving artifacts
Recording test results
Updating HADOOP-10035
Updating HADOOP-10465
Updating HADOOP-12098
Updating HADOOP-10555
Updating HDFS-6885
Email was triggered for: Failure - Any
Sending email for trigger: Failure - Any



###################################################################################
############################## FAILED TESTS (if any) ##############################
1 tests failed.
FAILED:  org.apache.hadoop.mapreduce.v2.app.TestMRAppMaster.testMRAppMasterMidLock

Error Message:
null

Stack Trace:
java.lang.AssertionError: null
	at org.junit.Assert.fail(Assert.java:86)
	at org.junit.Assert.assertTrue(Assert.java:41)
	at org.junit.Assert.assertTrue(Assert.java:52)
	at org.apache.hadoop.mapreduce.v2.app.TestMRAppMaster.testMRAppMasterMidLock(TestMRAppMaster.java:174)



Hadoop-Mapreduce-trunk-Java8 - Build # 697 - Still Failing

Posted by Apache Jenkins Server <je...@builds.apache.org>.
See https://builds.apache.org/job/Hadoop-Mapreduce-trunk-Java8/697/

###################################################################################
########################## LAST 60 LINES OF THE CONSOLE ###########################
[...truncated 10115 lines...]
Tests run: 2, Failures: 0, Errors: 0, Skipped: 0, Time elapsed: 1.577 sec - in org.apache.hadoop.mapred.TestLocalContainerLauncher

Results :

Failed tests: 
  TestMRAppMaster.testMRAppMasterMidLock:174 null

Tests in error: 
  TestMRAppMaster.cleanup:119 » IO Unable to delete directory /home/jenkins/jenk...
  TestMRAppMaster.testMRAppMasterFailLock:292 » YarnRuntime java.io.FileNotFound...
  TestContainerLauncher.testSlowNM:258 NoClassDefFound org/apache/hadoop/net/Net...

Tests run: 340, Failures: 1, Errors: 3, Skipped: 0

[INFO] ------------------------------------------------------------------------
[INFO] Reactor Summary:
[INFO] 
[INFO] Apache Hadoop MapReduce Client .................... SUCCESS [  2.672 s]
[INFO] Apache Hadoop MapReduce Core ...................... SUCCESS [01:25 min]
[INFO] Apache Hadoop MapReduce Common .................... SUCCESS [ 27.559 s]
[INFO] Apache Hadoop MapReduce Shuffle ................... SUCCESS [  4.162 s]
[INFO] Apache Hadoop MapReduce App ....................... FAILURE [10:41 min]
[INFO] Apache Hadoop MapReduce HistoryServer ............. SKIPPED
[INFO] Apache Hadoop MapReduce JobClient ................. SKIPPED
[INFO] Apache Hadoop MapReduce HistoryServer Plugins ..... SKIPPED
[INFO] Apache Hadoop MapReduce NativeTask ................ SKIPPED
[INFO] Apache Hadoop MapReduce Examples .................. SKIPPED
[INFO] Apache Hadoop MapReduce ........................... SKIPPED
[INFO] ------------------------------------------------------------------------
[INFO] BUILD FAILURE
[INFO] ------------------------------------------------------------------------
[INFO] Total time: 12:42 min
[INFO] Finished at: 2015-11-23T01:34:27+00:00
[INFO] Final Memory: 41M/285M
[INFO] ------------------------------------------------------------------------
[ERROR] Failed to execute goal org.apache.maven.plugins:maven-surefire-plugin:2.17:test (default-test) on project hadoop-mapreduce-client-app: There are test failures.
[ERROR] 
[ERROR] Please refer to /home/jenkins/jenkins-slave/workspace/Hadoop-Mapreduce-trunk-Java8/hadoop-mapreduce-project/hadoop-mapreduce-client/hadoop-mapreduce-client-app/target/surefire-reports for the individual test results.
[ERROR] -> [Help 1]
[ERROR] 
[ERROR] To see the full stack trace of the errors, re-run Maven with the -e switch.
[ERROR] Re-run Maven using the -X switch to enable full debug logging.
[ERROR] 
[ERROR] For more information about the errors and possible solutions, please read the following articles:
[ERROR] [Help 1] http://cwiki.apache.org/confluence/display/MAVEN/MojoFailureException
[ERROR] 
[ERROR] After correcting the problems, you can resume the build with the command
[ERROR]   mvn <goals> -rf :hadoop-mapreduce-client-app
Build step 'Execute shell' marked build as failure
[FINDBUGS] Skipping publisher since build result is FAILURE
Archiving artifacts
Recording test results
Updating HDFS-7796
Updating HDFS-9153
Updating HDFS-3302
Updating HADOOP-12294
Updating HADOOP-12181
Email was triggered for: Failure - Any
Sending email for trigger: Failure - Any



###################################################################################
############################## FAILED TESTS (if any) ##############################
4 tests failed.
FAILED:  org.apache.hadoop.mapreduce.v2.app.TestMRAppMaster.testMRAppMasterFailLock

Error Message:
java.io.FileNotFoundException: File file:/home/jenkins/jenkins-slave/workspace/Hadoop-Mapreduce-trunk-Java8/hadoop-mapreduce-project/hadoop-mapreduce-client/hadoop-mapreduce-client-app/staging/history/done_intermediate/TestAppMasterUser/job_1317529182569_0004_conf.xml_tmp does not exist

Stack Trace:
org.apache.hadoop.yarn.exceptions.YarnRuntimeException: java.io.FileNotFoundException: File file:/home/jenkins/jenkins-slave/workspace/Hadoop-Mapreduce-trunk-Java8/hadoop-mapreduce-project/hadoop-mapreduce-client/hadoop-mapreduce-client-app/staging/history/done_intermediate/TestAppMasterUser/job_1317529182569_0004_conf.xml_tmp does not exist
	at org.apache.hadoop.fs.RawLocalFileSystem.deprecatedGetFileStatus(RawLocalFileSystem.java:640)
	at org.apache.hadoop.fs.RawLocalFileSystem.getFileLinkStatusInternal(RawLocalFileSystem.java:866)
	at org.apache.hadoop.fs.RawLocalFileSystem.getFileStatus(RawLocalFileSystem.java:630)
	at org.apache.hadoop.fs.FileUtil.copy(FileUtil.java:340)
	at org.apache.hadoop.fs.FileUtil.copy(FileUtil.java:292)
	at org.apache.hadoop.fs.RawLocalFileSystem.rename(RawLocalFileSystem.java:372)
	at org.apache.hadoop.fs.ChecksumFileSystem.rename(ChecksumFileSystem.java:513)
	at org.apache.hadoop.mapreduce.jobhistory.JobHistoryEventHandler.moveTmpToDone(JobHistoryEventHandler.java:1346)
	at org.apache.hadoop.mapreduce.jobhistory.JobHistoryEventHandler.processDoneFiles(JobHistoryEventHandler.java:1153)
	at org.apache.hadoop.service.ServiceOperations.stop(ServiceOperations.java:52)
	at org.apache.hadoop.service.ServiceOperations.stopQuietly(ServiceOperations.java:80)
	at org.apache.hadoop.service.CompositeService.stop(CompositeService.java:157)
	at org.apache.hadoop.service.CompositeService.serviceStop(CompositeService.java:131)
	at org.apache.hadoop.mapreduce.v2.app.MRAppMaster.serviceStop(MRAppMaster.java:1751)
	at org.apache.hadoop.service.AbstractService.stop(AbstractService.java:221)
	at org.apache.hadoop.mapreduce.v2.app.MRAppMaster.stop(MRAppMaster.java:1247)
	at org.apache.hadoop.mapreduce.v2.app.TestMRAppMaster.testMRAppMasterFailLock(TestMRAppMaster.java:292)


FAILED:  org.apache.hadoop.mapreduce.v2.app.launcher.TestContainerLauncher.testSlowNM

Error Message:
org/apache/hadoop/net/NetUtils

Stack Trace:
java.lang.NoClassDefFoundError: org/apache/hadoop/net/NetUtils
	at java.net.URLClassLoader$1.run(URLClassLoader.java:372)
	at java.net.URLClassLoader$1.run(URLClassLoader.java:361)
	at java.security.AccessController.doPrivileged(Native Method)
	at java.net.URLClassLoader.findClass(URLClassLoader.java:360)
	at java.lang.ClassLoader.loadClass(ClassLoader.java:424)
	at sun.misc.Launcher$AppClassLoader.loadClass(Launcher.java:308)
	at java.lang.ClassLoader.loadClass(ClassLoader.java:357)
	at org.apache.hadoop.mapreduce.v2.app.launcher.TestContainerLauncher.testSlowNM(TestContainerLauncher.java:258)


FAILED:  org.apache.hadoop.mapreduce.v2.app.TestMRAppMaster.testMRAppMasterSuccessLock

Error Message:
Unable to delete directory /home/jenkins/jenkins-slave/workspace/Hadoop-Mapreduce-trunk-Java8/hadoop-mapreduce-project/hadoop-mapreduce-client/hadoop-mapreduce-client-app/staging/TestAppMasterUser/.staging.

Stack Trace:
java.io.IOException: Unable to delete directory /home/jenkins/jenkins-slave/workspace/Hadoop-Mapreduce-trunk-Java8/hadoop-mapreduce-project/hadoop-mapreduce-client/hadoop-mapreduce-client-app/staging/TestAppMasterUser/.staging.
	at org.apache.commons.io.FileUtils.deleteDirectory(FileUtils.java:1541)
	at org.apache.commons.io.FileUtils.forceDelete(FileUtils.java:2270)
	at org.apache.commons.io.FileUtils.cleanDirectory(FileUtils.java:1653)
	at org.apache.commons.io.FileUtils.deleteDirectory(FileUtils.java:1535)
	at org.apache.commons.io.FileUtils.forceDelete(FileUtils.java:2270)
	at org.apache.commons.io.FileUtils.cleanDirectory(FileUtils.java:1653)
	at org.apache.commons.io.FileUtils.deleteDirectory(FileUtils.java:1535)
	at org.apache.hadoop.mapreduce.v2.app.TestMRAppMaster.cleanup(TestMRAppMaster.java:119)


FAILED:  org.apache.hadoop.mapreduce.v2.app.TestMRAppMaster.testMRAppMasterMidLock

Error Message:
null

Stack Trace:
java.lang.AssertionError: null
	at org.junit.Assert.fail(Assert.java:86)
	at org.junit.Assert.assertTrue(Assert.java:41)
	at org.junit.Assert.assertTrue(Assert.java:52)
	at org.apache.hadoop.mapreduce.v2.app.TestMRAppMaster.testMRAppMasterMidLock(TestMRAppMaster.java:174)



Hadoop-Mapreduce-trunk-Java8 - Build # 696 - Still Failing

Posted by Apache Jenkins Server <je...@builds.apache.org>.
See https://builds.apache.org/job/Hadoop-Mapreduce-trunk-Java8/696/

###################################################################################
########################## LAST 60 LINES OF THE CONSOLE ###########################
[...truncated 10088 lines...]
Tests run: 6, Failures: 0, Errors: 0, Skipped: 0, Time elapsed: 1.008 sec - in org.apache.hadoop.mapred.TestTaskAttemptListenerImpl
Java HotSpot(TM) 64-Bit Server VM warning: ignoring option MaxPermSize=768m; support was removed in 8.0
Running org.apache.hadoop.mapred.TestLocalContainerLauncher
Tests run: 2, Failures: 0, Errors: 0, Skipped: 0, Time elapsed: 1.539 sec - in org.apache.hadoop.mapred.TestLocalContainerLauncher

Results :

Failed tests: 
  TestMRAppMaster.testMRAppMasterMidLock:174 null

Tests in error: 
  TestMRAppMaster.testMRAppMasterSuccessLock:254 » YarnRuntime java.io.FileNotFo...

Tests run: 337, Failures: 1, Errors: 1, Skipped: 0

[INFO] ------------------------------------------------------------------------
[INFO] Reactor Summary:
[INFO] 
[INFO] Apache Hadoop MapReduce Client .................... SUCCESS [  2.149 s]
[INFO] Apache Hadoop MapReduce Core ...................... SUCCESS [01:23 min]
[INFO] Apache Hadoop MapReduce Common .................... SUCCESS [ 25.684 s]
[INFO] Apache Hadoop MapReduce Shuffle ................... SUCCESS [  4.140 s]
[INFO] Apache Hadoop MapReduce App ....................... FAILURE [10:55 min]
[INFO] Apache Hadoop MapReduce HistoryServer ............. SKIPPED
[INFO] Apache Hadoop MapReduce JobClient ................. SKIPPED
[INFO] Apache Hadoop MapReduce HistoryServer Plugins ..... SKIPPED
[INFO] Apache Hadoop MapReduce NativeTask ................ SKIPPED
[INFO] Apache Hadoop MapReduce Examples .................. SKIPPED
[INFO] Apache Hadoop MapReduce ........................... SKIPPED
[INFO] ------------------------------------------------------------------------
[INFO] BUILD FAILURE
[INFO] ------------------------------------------------------------------------
[INFO] Total time: 12:51 min
[INFO] Finished at: 2015-11-23T00:34:39+00:00
[INFO] Final Memory: 40M/261M
[INFO] ------------------------------------------------------------------------
[ERROR] Failed to execute goal org.apache.maven.plugins:maven-surefire-plugin:2.17:test (default-test) on project hadoop-mapreduce-client-app: ExecutionException: java.lang.RuntimeException: The forked VM terminated without properly saying goodbye. VM crash or System.exit called?
[ERROR] Command was /bin/sh -c cd /home/jenkins/jenkins-slave/workspace/Hadoop-Mapreduce-trunk-Java8/hadoop-mapreduce-project/hadoop-mapreduce-client/hadoop-mapreduce-client-app && /home/jenkins/tools/java/jdk1.8.0/jre/bin/java -Xmx2048m -XX:MaxPermSize=768m -XX:+HeapDumpOnOutOfMemoryError -jar /home/jenkins/jenkins-slave/workspace/Hadoop-Mapreduce-trunk-Java8/hadoop-mapreduce-project/hadoop-mapreduce-client/hadoop-mapreduce-client-app/target/surefire/surefirebooter4525431769385347656.jar /home/jenkins/jenkins-slave/workspace/Hadoop-Mapreduce-trunk-Java8/hadoop-mapreduce-project/hadoop-mapreduce-client/hadoop-mapreduce-client-app/target/surefire/surefire1008402052119045504tmp /home/jenkins/jenkins-slave/workspace/Hadoop-Mapreduce-trunk-Java8/hadoop-mapreduce-project/hadoop-mapreduce-client/hadoop-mapreduce-client-app/target/surefire/surefire_1047890559932587646722tmp
[ERROR] -> [Help 1]
[ERROR] 
[ERROR] To see the full stack trace of the errors, re-run Maven with the -e switch.
[ERROR] Re-run Maven using the -X switch to enable full debug logging.
[ERROR] 
[ERROR] For more information about the errors and possible solutions, please read the following articles:
[ERROR] [Help 1] http://cwiki.apache.org/confluence/display/MAVEN/MojoFailureException
[ERROR] 
[ERROR] After correcting the problems, you can resume the build with the command
[ERROR]   mvn <goals> -rf :hadoop-mapreduce-client-app
Build step 'Execute shell' marked build as failure
[FINDBUGS] Skipping publisher since build result is FAILURE
Archiving artifacts
Recording test results
Updating HDFS-8914
Updating HDFS-9402
Updating HADOOP-12572
Updating HADOOP-12467
Updating HADOOP-11218
Email was triggered for: Failure - Any
Sending email for trigger: Failure - Any



###################################################################################
############################## FAILED TESTS (if any) ##############################
2 tests failed.
FAILED:  org.apache.hadoop.mapreduce.v2.app.TestMRAppMaster.testMRAppMasterSuccessLock

Error Message:
java.io.FileNotFoundException: File file:/home/jenkins/jenkins-slave/workspace/Hadoop-Mapreduce-trunk-Java8/hadoop-mapreduce-project/hadoop-mapreduce-client/hadoop-mapreduce-client-app/staging/history/done_intermediate/TestAppMasterUser/job_1317529182569_0004_conf.xml_tmp does not exist

Stack Trace:
org.apache.hadoop.yarn.exceptions.YarnRuntimeException: java.io.FileNotFoundException: File file:/home/jenkins/jenkins-slave/workspace/Hadoop-Mapreduce-trunk-Java8/hadoop-mapreduce-project/hadoop-mapreduce-client/hadoop-mapreduce-client-app/staging/history/done_intermediate/TestAppMasterUser/job_1317529182569_0004_conf.xml_tmp does not exist
	at org.apache.hadoop.fs.RawLocalFileSystem.deprecatedGetFileStatus(RawLocalFileSystem.java:640)
	at org.apache.hadoop.fs.RawLocalFileSystem.getFileLinkStatusInternal(RawLocalFileSystem.java:866)
	at org.apache.hadoop.fs.RawLocalFileSystem.getFileStatus(RawLocalFileSystem.java:630)
	at org.apache.hadoop.fs.FileUtil.copy(FileUtil.java:340)
	at org.apache.hadoop.fs.FileUtil.copy(FileUtil.java:292)
	at org.apache.hadoop.fs.RawLocalFileSystem.rename(RawLocalFileSystem.java:372)
	at org.apache.hadoop.fs.ChecksumFileSystem.rename(ChecksumFileSystem.java:513)
	at org.apache.hadoop.mapreduce.jobhistory.JobHistoryEventHandler.moveTmpToDone(JobHistoryEventHandler.java:1346)
	at org.apache.hadoop.mapreduce.jobhistory.JobHistoryEventHandler.processDoneFiles(JobHistoryEventHandler.java:1153)
	at org.apache.hadoop.service.ServiceOperations.stop(ServiceOperations.java:52)
	at org.apache.hadoop.service.ServiceOperations.stopQuietly(ServiceOperations.java:80)
	at org.apache.hadoop.service.CompositeService.stop(CompositeService.java:157)
	at org.apache.hadoop.service.CompositeService.serviceStop(CompositeService.java:131)
	at org.apache.hadoop.mapreduce.v2.app.MRAppMaster.serviceStop(MRAppMaster.java:1751)
	at org.apache.hadoop.service.AbstractService.stop(AbstractService.java:221)
	at org.apache.hadoop.mapreduce.v2.app.MRAppMaster.stop(MRAppMaster.java:1247)
	at org.apache.hadoop.mapreduce.v2.app.TestMRAppMaster.testMRAppMasterSuccessLock(TestMRAppMaster.java:254)


FAILED:  org.apache.hadoop.mapreduce.v2.app.TestMRAppMaster.testMRAppMasterMidLock

Error Message:
null

Stack Trace:
java.lang.AssertionError: null
	at org.junit.Assert.fail(Assert.java:86)
	at org.junit.Assert.assertTrue(Assert.java:41)
	at org.junit.Assert.assertTrue(Assert.java:52)
	at org.apache.hadoop.mapreduce.v2.app.TestMRAppMaster.testMRAppMasterMidLock(TestMRAppMaster.java:174)



Hadoop-Mapreduce-trunk-Java8 - Build # 695 - Still Failing

Posted by Apache Jenkins Server <je...@builds.apache.org>.
See https://builds.apache.org/job/Hadoop-Mapreduce-trunk-Java8/695/

###################################################################################
########################## LAST 60 LINES OF THE CONSOLE ###########################
[...truncated 10086 lines...]
Tests run: 1, Failures: 0, Errors: 0, Skipped: 0, Time elapsed: 1.266 sec - in org.apache.hadoop.mapred.TestTaskAttemptFinishingMonitor
Java HotSpot(TM) 64-Bit Server VM warning: ignoring option MaxPermSize=768m; support was removed in 8.0
Running org.apache.hadoop.mapred.TestTaskAttemptListenerImpl
Tests run: 6, Failures: 0, Errors: 0, Skipped: 0, Time elapsed: 1.045 sec - in org.apache.hadoop.mapred.TestTaskAttemptListenerImpl
Java HotSpot(TM) 64-Bit Server VM warning: ignoring option MaxPermSize=768m; support was removed in 8.0
Running org.apache.hadoop.mapred.TestLocalContainerLauncher
Tests run: 2, Failures: 0, Errors: 0, Skipped: 0, Time elapsed: 1.526 sec - in org.apache.hadoop.mapred.TestLocalContainerLauncher

Results :

Failed tests: 
  TestMRAppMaster.testMRAppMasterMidLock:174 null

Tests in error: 
  TestMRAppMaster.testMRAppMasterSuccessLock:254 » YarnRuntime java.io.FileNotFo...

Tests run: 340, Failures: 1, Errors: 1, Skipped: 0

[INFO] ------------------------------------------------------------------------
[INFO] Reactor Summary:
[INFO] 
[INFO] Apache Hadoop MapReduce Client .................... SUCCESS [  2.236 s]
[INFO] Apache Hadoop MapReduce Core ...................... SUCCESS [01:25 min]
[INFO] Apache Hadoop MapReduce Common .................... SUCCESS [ 25.922 s]
[INFO] Apache Hadoop MapReduce Shuffle ................... SUCCESS [  4.146 s]
[INFO] Apache Hadoop MapReduce App ....................... FAILURE [10:56 min]
[INFO] Apache Hadoop MapReduce HistoryServer ............. SKIPPED
[INFO] Apache Hadoop MapReduce JobClient ................. SKIPPED
[INFO] Apache Hadoop MapReduce HistoryServer Plugins ..... SKIPPED
[INFO] Apache Hadoop MapReduce NativeTask ................ SKIPPED
[INFO] Apache Hadoop MapReduce Examples .................. SKIPPED
[INFO] Apache Hadoop MapReduce ........................... SKIPPED
[INFO] ------------------------------------------------------------------------
[INFO] BUILD FAILURE
[INFO] ------------------------------------------------------------------------
[INFO] Total time: 12:55 min
[INFO] Finished at: 2015-11-22T23:34:48+00:00
[INFO] Final Memory: 40M/261M
[INFO] ------------------------------------------------------------------------
[ERROR] Failed to execute goal org.apache.maven.plugins:maven-surefire-plugin:2.17:test (default-test) on project hadoop-mapreduce-client-app: There are test failures.
[ERROR] 
[ERROR] Please refer to /home/jenkins/jenkins-slave/workspace/Hadoop-Mapreduce-trunk-Java8/hadoop-mapreduce-project/hadoop-mapreduce-client/hadoop-mapreduce-client-app/target/surefire-reports for the individual test results.
[ERROR] -> [Help 1]
[ERROR] 
[ERROR] To see the full stack trace of the errors, re-run Maven with the -e switch.
[ERROR] Re-run Maven using the -X switch to enable full debug logging.
[ERROR] 
[ERROR] For more information about the errors and possible solutions, please read the following articles:
[ERROR] [Help 1] http://cwiki.apache.org/confluence/display/MAVEN/MojoFailureException
[ERROR] 
[ERROR] After correcting the problems, you can resume the build with the command
[ERROR]   mvn <goals> -rf :hadoop-mapreduce-client-app
Build step 'Execute shell' marked build as failure
[FINDBUGS] Skipping publisher since build result is FAILURE
Archiving artifacts
Recording test results
Updating HDFS-9443
Email was triggered for: Failure - Any
Sending email for trigger: Failure - Any



###################################################################################
############################## FAILED TESTS (if any) ##############################
2 tests failed.
FAILED:  org.apache.hadoop.mapreduce.v2.app.TestMRAppMaster.testMRAppMasterSuccessLock

Error Message:
java.io.FileNotFoundException: File file:/home/jenkins/jenkins-slave/workspace/Hadoop-Mapreduce-trunk-Java8/hadoop-mapreduce-project/hadoop-mapreduce-client/hadoop-mapreduce-client-app/staging/history/done_intermediate/TestAppMasterUser/job_1317529182569_0004_conf.xml_tmp does not exist

Stack Trace:
org.apache.hadoop.yarn.exceptions.YarnRuntimeException: java.io.FileNotFoundException: File file:/home/jenkins/jenkins-slave/workspace/Hadoop-Mapreduce-trunk-Java8/hadoop-mapreduce-project/hadoop-mapreduce-client/hadoop-mapreduce-client-app/staging/history/done_intermediate/TestAppMasterUser/job_1317529182569_0004_conf.xml_tmp does not exist
	at org.apache.hadoop.fs.RawLocalFileSystem.deprecatedGetFileStatus(RawLocalFileSystem.java:640)
	at org.apache.hadoop.fs.RawLocalFileSystem.getFileLinkStatusInternal(RawLocalFileSystem.java:866)
	at org.apache.hadoop.fs.RawLocalFileSystem.getFileStatus(RawLocalFileSystem.java:630)
	at org.apache.hadoop.fs.FileUtil.copy(FileUtil.java:340)
	at org.apache.hadoop.fs.FileUtil.copy(FileUtil.java:292)
	at org.apache.hadoop.fs.RawLocalFileSystem.rename(RawLocalFileSystem.java:372)
	at org.apache.hadoop.fs.ChecksumFileSystem.rename(ChecksumFileSystem.java:513)
	at org.apache.hadoop.mapreduce.jobhistory.JobHistoryEventHandler.moveTmpToDone(JobHistoryEventHandler.java:1346)
	at org.apache.hadoop.mapreduce.jobhistory.JobHistoryEventHandler.processDoneFiles(JobHistoryEventHandler.java:1153)
	at org.apache.hadoop.service.ServiceOperations.stop(ServiceOperations.java:52)
	at org.apache.hadoop.service.ServiceOperations.stopQuietly(ServiceOperations.java:80)
	at org.apache.hadoop.service.CompositeService.stop(CompositeService.java:157)
	at org.apache.hadoop.service.CompositeService.serviceStop(CompositeService.java:131)
	at org.apache.hadoop.mapreduce.v2.app.MRAppMaster.serviceStop(MRAppMaster.java:1751)
	at org.apache.hadoop.service.AbstractService.stop(AbstractService.java:221)
	at org.apache.hadoop.mapreduce.v2.app.MRAppMaster.stop(MRAppMaster.java:1247)
	at org.apache.hadoop.mapreduce.v2.app.TestMRAppMaster.testMRAppMasterSuccessLock(TestMRAppMaster.java:254)


FAILED:  org.apache.hadoop.mapreduce.v2.app.TestMRAppMaster.testMRAppMasterMidLock

Error Message:
null

Stack Trace:
java.lang.AssertionError: null
	at org.junit.Assert.fail(Assert.java:86)
	at org.junit.Assert.assertTrue(Assert.java:41)
	at org.junit.Assert.assertTrue(Assert.java:52)
	at org.apache.hadoop.mapreduce.v2.app.TestMRAppMaster.testMRAppMasterMidLock(TestMRAppMaster.java:174)



Hadoop-Mapreduce-trunk-Java8 - Build # 694 - Still Failing

Posted by Apache Jenkins Server <je...@builds.apache.org>.
See https://builds.apache.org/job/Hadoop-Mapreduce-trunk-Java8/694/

###################################################################################
########################## LAST 60 LINES OF THE CONSOLE ###########################
[...truncated 10087 lines...]
Tests run: 1, Failures: 0, Errors: 0, Skipped: 0, Time elapsed: 1.261 sec - in org.apache.hadoop.mapred.TestTaskAttemptFinishingMonitor
Java HotSpot(TM) 64-Bit Server VM warning: ignoring option MaxPermSize=768m; support was removed in 8.0
Running org.apache.hadoop.mapred.TestTaskAttemptListenerImpl
Tests run: 6, Failures: 0, Errors: 0, Skipped: 0, Time elapsed: 1.011 sec - in org.apache.hadoop.mapred.TestTaskAttemptListenerImpl
Java HotSpot(TM) 64-Bit Server VM warning: ignoring option MaxPermSize=768m; support was removed in 8.0
Running org.apache.hadoop.mapred.TestLocalContainerLauncher
Tests run: 2, Failures: 0, Errors: 0, Skipped: 0, Time elapsed: 1.481 sec - in org.apache.hadoop.mapred.TestLocalContainerLauncher

Results :

Failed tests: 
  TestMRAppMaster.testMRAppMasterMidLock:174 null

Tests in error: 
  TestMRAppMaster.testMRAppMasterSuccessLock:254 » YarnRuntime java.io.FileNotFo...

Tests run: 340, Failures: 1, Errors: 1, Skipped: 0

[INFO] ------------------------------------------------------------------------
[INFO] Reactor Summary:
[INFO] 
[INFO] Apache Hadoop MapReduce Client .................... SUCCESS [  2.041 s]
[INFO] Apache Hadoop MapReduce Core ...................... SUCCESS [01:24 min]
[INFO] Apache Hadoop MapReduce Common .................... SUCCESS [ 25.590 s]
[INFO] Apache Hadoop MapReduce Shuffle ................... SUCCESS [  4.021 s]
[INFO] Apache Hadoop MapReduce App ....................... FAILURE [10:47 min]
[INFO] Apache Hadoop MapReduce HistoryServer ............. SKIPPED
[INFO] Apache Hadoop MapReduce JobClient ................. SKIPPED
[INFO] Apache Hadoop MapReduce HistoryServer Plugins ..... SKIPPED
[INFO] Apache Hadoop MapReduce NativeTask ................ SKIPPED
[INFO] Apache Hadoop MapReduce Examples .................. SKIPPED
[INFO] Apache Hadoop MapReduce ........................... SKIPPED
[INFO] ------------------------------------------------------------------------
[INFO] BUILD FAILURE
[INFO] ------------------------------------------------------------------------
[INFO] Total time: 12:44 min
[INFO] Finished at: 2015-11-22T12:34:32+00:00
[INFO] Final Memory: 41M/251M
[INFO] ------------------------------------------------------------------------
[ERROR] Failed to execute goal org.apache.maven.plugins:maven-surefire-plugin:2.17:test (default-test) on project hadoop-mapreduce-client-app: There are test failures.
[ERROR] 
[ERROR] Please refer to /home/jenkins/jenkins-slave/workspace/Hadoop-Mapreduce-trunk-Java8/hadoop-mapreduce-project/hadoop-mapreduce-client/hadoop-mapreduce-client-app/target/surefire-reports for the individual test results.
[ERROR] -> [Help 1]
[ERROR] 
[ERROR] To see the full stack trace of the errors, re-run Maven with the -e switch.
[ERROR] Re-run Maven using the -X switch to enable full debug logging.
[ERROR] 
[ERROR] For more information about the errors and possible solutions, please read the following articles:
[ERROR] [Help 1] http://cwiki.apache.org/confluence/display/MAVEN/MojoFailureException
[ERROR] 
[ERROR] After correcting the problems, you can resume the build with the command
[ERROR]   mvn <goals> -rf :hadoop-mapreduce-client-app
Build step 'Execute shell' marked build as failure
[FINDBUGS] Skipping publisher since build result is FAILURE
Archiving artifacts
Recording test results
Updating HADOOP-12584
Email was triggered for: Failure - Any
Sending email for trigger: Failure - Any



###################################################################################
############################## FAILED TESTS (if any) ##############################
2 tests failed.
FAILED:  org.apache.hadoop.mapreduce.v2.app.TestMRAppMaster.testMRAppMasterSuccessLock

Error Message:
java.io.FileNotFoundException: File file:/home/jenkins/jenkins-slave/workspace/Hadoop-Mapreduce-trunk-Java8/hadoop-mapreduce-project/hadoop-mapreduce-client/hadoop-mapreduce-client-app/staging/history/done_intermediate/TestAppMasterUser/job_1317529182569_0004_conf.xml_tmp does not exist

Stack Trace:
org.apache.hadoop.yarn.exceptions.YarnRuntimeException: java.io.FileNotFoundException: File file:/home/jenkins/jenkins-slave/workspace/Hadoop-Mapreduce-trunk-Java8/hadoop-mapreduce-project/hadoop-mapreduce-client/hadoop-mapreduce-client-app/staging/history/done_intermediate/TestAppMasterUser/job_1317529182569_0004_conf.xml_tmp does not exist
	at org.apache.hadoop.fs.RawLocalFileSystem.deprecatedGetFileStatus(RawLocalFileSystem.java:640)
	at org.apache.hadoop.fs.RawLocalFileSystem.getFileLinkStatusInternal(RawLocalFileSystem.java:866)
	at org.apache.hadoop.fs.RawLocalFileSystem.getFileStatus(RawLocalFileSystem.java:630)
	at org.apache.hadoop.fs.FileUtil.copy(FileUtil.java:340)
	at org.apache.hadoop.fs.FileUtil.copy(FileUtil.java:292)
	at org.apache.hadoop.fs.RawLocalFileSystem.rename(RawLocalFileSystem.java:372)
	at org.apache.hadoop.fs.ChecksumFileSystem.rename(ChecksumFileSystem.java:513)
	at org.apache.hadoop.mapreduce.jobhistory.JobHistoryEventHandler.moveTmpToDone(JobHistoryEventHandler.java:1346)
	at org.apache.hadoop.mapreduce.jobhistory.JobHistoryEventHandler.processDoneFiles(JobHistoryEventHandler.java:1153)
	at org.apache.hadoop.service.ServiceOperations.stop(ServiceOperations.java:52)
	at org.apache.hadoop.service.ServiceOperations.stopQuietly(ServiceOperations.java:80)
	at org.apache.hadoop.service.CompositeService.stop(CompositeService.java:157)
	at org.apache.hadoop.service.CompositeService.serviceStop(CompositeService.java:131)
	at org.apache.hadoop.mapreduce.v2.app.MRAppMaster.serviceStop(MRAppMaster.java:1751)
	at org.apache.hadoop.service.AbstractService.stop(AbstractService.java:221)
	at org.apache.hadoop.mapreduce.v2.app.MRAppMaster.stop(MRAppMaster.java:1247)
	at org.apache.hadoop.mapreduce.v2.app.TestMRAppMaster.testMRAppMasterSuccessLock(TestMRAppMaster.java:254)


FAILED:  org.apache.hadoop.mapreduce.v2.app.TestMRAppMaster.testMRAppMasterMidLock

Error Message:
null

Stack Trace:
java.lang.AssertionError: null
	at org.junit.Assert.fail(Assert.java:86)
	at org.junit.Assert.assertTrue(Assert.java:41)
	at org.junit.Assert.assertTrue(Assert.java:52)
	at org.apache.hadoop.mapreduce.v2.app.TestMRAppMaster.testMRAppMasterMidLock(TestMRAppMaster.java:174)



Hadoop-Mapreduce-trunk-Java8 - Build # 693 - Still Failing

Posted by Apache Jenkins Server <je...@builds.apache.org>.
See https://builds.apache.org/job/Hadoop-Mapreduce-trunk-Java8/693/

###################################################################################
########################## LAST 60 LINES OF THE CONSOLE ###########################
[...truncated 10087 lines...]
Tests run: 1, Failures: 0, Errors: 0, Skipped: 0, Time elapsed: 1.229 sec - in org.apache.hadoop.mapred.TestTaskAttemptFinishingMonitor
Java HotSpot(TM) 64-Bit Server VM warning: ignoring option MaxPermSize=768m; support was removed in 8.0
Running org.apache.hadoop.mapred.TestTaskAttemptListenerImpl
Tests run: 6, Failures: 0, Errors: 0, Skipped: 0, Time elapsed: 1.013 sec - in org.apache.hadoop.mapred.TestTaskAttemptListenerImpl
Java HotSpot(TM) 64-Bit Server VM warning: ignoring option MaxPermSize=768m; support was removed in 8.0
Running org.apache.hadoop.mapred.TestLocalContainerLauncher
Tests run: 2, Failures: 0, Errors: 0, Skipped: 0, Time elapsed: 1.499 sec - in org.apache.hadoop.mapred.TestLocalContainerLauncher

Results :

Failed tests: 
  TestMRAppMaster.testMRAppMasterMidLock:174 null

Tests in error: 
  TestMRAppMaster.testMRAppMasterSuccessLock:254 » YarnRuntime java.io.FileNotFo...

Tests run: 340, Failures: 1, Errors: 1, Skipped: 0

[INFO] ------------------------------------------------------------------------
[INFO] Reactor Summary:
[INFO] 
[INFO] Apache Hadoop MapReduce Client .................... SUCCESS [  2.172 s]
[INFO] Apache Hadoop MapReduce Core ...................... SUCCESS [01:24 min]
[INFO] Apache Hadoop MapReduce Common .................... SUCCESS [ 25.926 s]
[INFO] Apache Hadoop MapReduce Shuffle ................... SUCCESS [  4.141 s]
[INFO] Apache Hadoop MapReduce App ....................... FAILURE [10:49 min]
[INFO] Apache Hadoop MapReduce HistoryServer ............. SKIPPED
[INFO] Apache Hadoop MapReduce JobClient ................. SKIPPED
[INFO] Apache Hadoop MapReduce HistoryServer Plugins ..... SKIPPED
[INFO] Apache Hadoop MapReduce NativeTask ................ SKIPPED
[INFO] Apache Hadoop MapReduce Examples .................. SKIPPED
[INFO] Apache Hadoop MapReduce ........................... SKIPPED
[INFO] ------------------------------------------------------------------------
[INFO] BUILD FAILURE
[INFO] ------------------------------------------------------------------------
[INFO] Total time: 12:47 min
[INFO] Finished at: 2015-11-22T07:34:39+00:00
[INFO] Final Memory: 41M/287M
[INFO] ------------------------------------------------------------------------
[ERROR] Failed to execute goal org.apache.maven.plugins:maven-surefire-plugin:2.17:test (default-test) on project hadoop-mapreduce-client-app: There are test failures.
[ERROR] 
[ERROR] Please refer to /home/jenkins/jenkins-slave/workspace/Hadoop-Mapreduce-trunk-Java8/hadoop-mapreduce-project/hadoop-mapreduce-client/hadoop-mapreduce-client-app/target/surefire-reports for the individual test results.
[ERROR] -> [Help 1]
[ERROR] 
[ERROR] To see the full stack trace of the errors, re-run Maven with the -e switch.
[ERROR] Re-run Maven using the -X switch to enable full debug logging.
[ERROR] 
[ERROR] For more information about the errors and possible solutions, please read the following articles:
[ERROR] [Help 1] http://cwiki.apache.org/confluence/display/MAVEN/MojoFailureException
[ERROR] 
[ERROR] After correcting the problems, you can resume the build with the command
[ERROR]   mvn <goals> -rf :hadoop-mapreduce-client-app
Build step 'Execute shell' marked build as failure
[FINDBUGS] Skipping publisher since build result is FAILURE
Archiving artifacts
Recording test results
Updating HDFS-9348
Email was triggered for: Failure - Any
Sending email for trigger: Failure - Any



###################################################################################
############################## FAILED TESTS (if any) ##############################
2 tests failed.
FAILED:  org.apache.hadoop.mapreduce.v2.app.TestMRAppMaster.testMRAppMasterSuccessLock

Error Message:
java.io.FileNotFoundException: File file:/home/jenkins/jenkins-slave/workspace/Hadoop-Mapreduce-trunk-Java8/hadoop-mapreduce-project/hadoop-mapreduce-client/hadoop-mapreduce-client-app/staging/history/done_intermediate/TestAppMasterUser/job_1317529182569_0004_conf.xml_tmp does not exist

Stack Trace:
org.apache.hadoop.yarn.exceptions.YarnRuntimeException: java.io.FileNotFoundException: File file:/home/jenkins/jenkins-slave/workspace/Hadoop-Mapreduce-trunk-Java8/hadoop-mapreduce-project/hadoop-mapreduce-client/hadoop-mapreduce-client-app/staging/history/done_intermediate/TestAppMasterUser/job_1317529182569_0004_conf.xml_tmp does not exist
	at org.apache.hadoop.fs.RawLocalFileSystem.deprecatedGetFileStatus(RawLocalFileSystem.java:640)
	at org.apache.hadoop.fs.RawLocalFileSystem.getFileLinkStatusInternal(RawLocalFileSystem.java:866)
	at org.apache.hadoop.fs.RawLocalFileSystem.getFileStatus(RawLocalFileSystem.java:630)
	at org.apache.hadoop.fs.FileUtil.copy(FileUtil.java:340)
	at org.apache.hadoop.fs.FileUtil.copy(FileUtil.java:292)
	at org.apache.hadoop.fs.RawLocalFileSystem.rename(RawLocalFileSystem.java:372)
	at org.apache.hadoop.fs.ChecksumFileSystem.rename(ChecksumFileSystem.java:513)
	at org.apache.hadoop.mapreduce.jobhistory.JobHistoryEventHandler.moveTmpToDone(JobHistoryEventHandler.java:1346)
	at org.apache.hadoop.mapreduce.jobhistory.JobHistoryEventHandler.processDoneFiles(JobHistoryEventHandler.java:1153)
	at org.apache.hadoop.service.ServiceOperations.stop(ServiceOperations.java:52)
	at org.apache.hadoop.service.ServiceOperations.stopQuietly(ServiceOperations.java:80)
	at org.apache.hadoop.service.CompositeService.stop(CompositeService.java:157)
	at org.apache.hadoop.service.CompositeService.serviceStop(CompositeService.java:131)
	at org.apache.hadoop.mapreduce.v2.app.MRAppMaster.serviceStop(MRAppMaster.java:1751)
	at org.apache.hadoop.service.AbstractService.stop(AbstractService.java:221)
	at org.apache.hadoop.mapreduce.v2.app.MRAppMaster.stop(MRAppMaster.java:1247)
	at org.apache.hadoop.mapreduce.v2.app.TestMRAppMaster.testMRAppMasterSuccessLock(TestMRAppMaster.java:254)


FAILED:  org.apache.hadoop.mapreduce.v2.app.TestMRAppMaster.testMRAppMasterMidLock

Error Message:
null

Stack Trace:
java.lang.AssertionError: null
	at org.junit.Assert.fail(Assert.java:86)
	at org.junit.Assert.assertTrue(Assert.java:41)
	at org.junit.Assert.assertTrue(Assert.java:52)
	at org.apache.hadoop.mapreduce.v2.app.TestMRAppMaster.testMRAppMasterMidLock(TestMRAppMaster.java:174)



Hadoop-Mapreduce-trunk-Java8 - Build # 692 - Still Failing

Posted by Apache Jenkins Server <je...@builds.apache.org>.
See https://builds.apache.org/job/Hadoop-Mapreduce-trunk-Java8/692/

###################################################################################
########################## LAST 60 LINES OF THE CONSOLE ###########################
[...truncated 10100 lines...]
Java HotSpot(TM) 64-Bit Server VM warning: ignoring option MaxPermSize=768m; support was removed in 8.0
Running org.apache.hadoop.mapred.TestTaskAttemptListenerImpl
Tests run: 6, Failures: 0, Errors: 0, Skipped: 0, Time elapsed: 1.076 sec - in org.apache.hadoop.mapred.TestTaskAttemptListenerImpl
Java HotSpot(TM) 64-Bit Server VM warning: ignoring option MaxPermSize=768m; support was removed in 8.0
Running org.apache.hadoop.mapred.TestLocalContainerLauncher
Tests run: 2, Failures: 0, Errors: 0, Skipped: 0, Time elapsed: 1.514 sec - in org.apache.hadoop.mapred.TestLocalContainerLauncher

Results :

Failed tests: 
  TestMRAppMaster.testMRAppMasterMidLock:174 null

Tests in error: 
  TestMRAppMaster.cleanup:119 » IO Unable to delete directory /home/jenkins/jenk...
  TestMRAppMaster.testMRAppMasterFailLock:292 » YarnRuntime java.io.FileNotFound...

Tests run: 340, Failures: 1, Errors: 2, Skipped: 0

[INFO] ------------------------------------------------------------------------
[INFO] Reactor Summary:
[INFO] 
[INFO] Apache Hadoop MapReduce Client .................... SUCCESS [  2.116 s]
[INFO] Apache Hadoop MapReduce Core ...................... SUCCESS [01:24 min]
[INFO] Apache Hadoop MapReduce Common .................... SUCCESS [ 26.208 s]
[INFO] Apache Hadoop MapReduce Shuffle ................... SUCCESS [  4.090 s]
[INFO] Apache Hadoop MapReduce App ....................... FAILURE [10:49 min]
[INFO] Apache Hadoop MapReduce HistoryServer ............. SKIPPED
[INFO] Apache Hadoop MapReduce JobClient ................. SKIPPED
[INFO] Apache Hadoop MapReduce HistoryServer Plugins ..... SKIPPED
[INFO] Apache Hadoop MapReduce NativeTask ................ SKIPPED
[INFO] Apache Hadoop MapReduce Examples .................. SKIPPED
[INFO] Apache Hadoop MapReduce ........................... SKIPPED
[INFO] ------------------------------------------------------------------------
[INFO] BUILD FAILURE
[INFO] ------------------------------------------------------------------------
[INFO] Total time: 12:47 min
[INFO] Finished at: 2015-11-21T18:34:42+00:00
[INFO] Final Memory: 40M/258M
[INFO] ------------------------------------------------------------------------
[ERROR] Failed to execute goal org.apache.maven.plugins:maven-surefire-plugin:2.17:test (default-test) on project hadoop-mapreduce-client-app: There are test failures.
[ERROR] 
[ERROR] Please refer to /home/jenkins/jenkins-slave/workspace/Hadoop-Mapreduce-trunk-Java8/hadoop-mapreduce-project/hadoop-mapreduce-client/hadoop-mapreduce-client-app/target/surefire-reports for the individual test results.
[ERROR] -> [Help 1]
[ERROR] 
[ERROR] To see the full stack trace of the errors, re-run Maven with the -e switch.
[ERROR] Re-run Maven using the -X switch to enable full debug logging.
[ERROR] 
[ERROR] For more information about the errors and possible solutions, please read the following articles:
[ERROR] [Help 1] http://cwiki.apache.org/confluence/display/MAVEN/MojoFailureException
[ERROR] 
[ERROR] After correcting the problems, you can resume the build with the command
[ERROR]   mvn <goals> -rf :hadoop-mapreduce-client-app
Build step 'Execute shell' marked build as failure
[FINDBUGS] Skipping publisher since build result is FAILURE
Archiving artifacts
Recording test results
Updating YARN-3454
Email was triggered for: Failure - Any
Sending email for trigger: Failure - Any



###################################################################################
############################## FAILED TESTS (if any) ##############################
3 tests failed.
FAILED:  org.apache.hadoop.mapreduce.v2.app.TestMRAppMaster.testMRAppMasterFailLock

Error Message:
java.io.FileNotFoundException: File file:/home/jenkins/jenkins-slave/workspace/Hadoop-Mapreduce-trunk-Java8/hadoop-mapreduce-project/hadoop-mapreduce-client/hadoop-mapreduce-client-app/staging/history/done_intermediate/TestAppMasterUser/job_1317529182569_0004_conf.xml_tmp does not exist

Stack Trace:
org.apache.hadoop.yarn.exceptions.YarnRuntimeException: java.io.FileNotFoundException: File file:/home/jenkins/jenkins-slave/workspace/Hadoop-Mapreduce-trunk-Java8/hadoop-mapreduce-project/hadoop-mapreduce-client/hadoop-mapreduce-client-app/staging/history/done_intermediate/TestAppMasterUser/job_1317529182569_0004_conf.xml_tmp does not exist
	at org.apache.hadoop.fs.RawLocalFileSystem.deprecatedGetFileStatus(RawLocalFileSystem.java:640)
	at org.apache.hadoop.fs.RawLocalFileSystem.getFileLinkStatusInternal(RawLocalFileSystem.java:866)
	at org.apache.hadoop.fs.RawLocalFileSystem.getFileStatus(RawLocalFileSystem.java:630)
	at org.apache.hadoop.fs.FileUtil.copy(FileUtil.java:340)
	at org.apache.hadoop.fs.FileUtil.copy(FileUtil.java:292)
	at org.apache.hadoop.fs.RawLocalFileSystem.rename(RawLocalFileSystem.java:372)
	at org.apache.hadoop.fs.ChecksumFileSystem.rename(ChecksumFileSystem.java:513)
	at org.apache.hadoop.mapreduce.jobhistory.JobHistoryEventHandler.moveTmpToDone(JobHistoryEventHandler.java:1346)
	at org.apache.hadoop.mapreduce.jobhistory.JobHistoryEventHandler.processDoneFiles(JobHistoryEventHandler.java:1153)
	at org.apache.hadoop.service.ServiceOperations.stop(ServiceOperations.java:52)
	at org.apache.hadoop.service.ServiceOperations.stopQuietly(ServiceOperations.java:80)
	at org.apache.hadoop.service.CompositeService.stop(CompositeService.java:157)
	at org.apache.hadoop.service.CompositeService.serviceStop(CompositeService.java:131)
	at org.apache.hadoop.mapreduce.v2.app.MRAppMaster.serviceStop(MRAppMaster.java:1751)
	at org.apache.hadoop.service.AbstractService.stop(AbstractService.java:221)
	at org.apache.hadoop.mapreduce.v2.app.MRAppMaster.stop(MRAppMaster.java:1247)
	at org.apache.hadoop.mapreduce.v2.app.TestMRAppMaster.testMRAppMasterFailLock(TestMRAppMaster.java:292)


FAILED:  org.apache.hadoop.mapreduce.v2.app.TestMRAppMaster.testMRAppMasterSuccessLock

Error Message:
Unable to delete directory /home/jenkins/jenkins-slave/workspace/Hadoop-Mapreduce-trunk-Java8/hadoop-mapreduce-project/hadoop-mapreduce-client/hadoop-mapreduce-client-app/staging/TestAppMasterUser/.staging/job_1317529182569_0004.

Stack Trace:
java.io.IOException: Unable to delete directory /home/jenkins/jenkins-slave/workspace/Hadoop-Mapreduce-trunk-Java8/hadoop-mapreduce-project/hadoop-mapreduce-client/hadoop-mapreduce-client-app/staging/TestAppMasterUser/.staging/job_1317529182569_0004.
	at org.apache.commons.io.FileUtils.deleteDirectory(FileUtils.java:1541)
	at org.apache.commons.io.FileUtils.forceDelete(FileUtils.java:2270)
	at org.apache.commons.io.FileUtils.cleanDirectory(FileUtils.java:1653)
	at org.apache.commons.io.FileUtils.deleteDirectory(FileUtils.java:1535)
	at org.apache.commons.io.FileUtils.forceDelete(FileUtils.java:2270)
	at org.apache.commons.io.FileUtils.cleanDirectory(FileUtils.java:1653)
	at org.apache.commons.io.FileUtils.deleteDirectory(FileUtils.java:1535)
	at org.apache.commons.io.FileUtils.forceDelete(FileUtils.java:2270)
	at org.apache.commons.io.FileUtils.cleanDirectory(FileUtils.java:1653)
	at org.apache.commons.io.FileUtils.deleteDirectory(FileUtils.java:1535)
	at org.apache.hadoop.mapreduce.v2.app.TestMRAppMaster.cleanup(TestMRAppMaster.java:119)


FAILED:  org.apache.hadoop.mapreduce.v2.app.TestMRAppMaster.testMRAppMasterMidLock

Error Message:
null

Stack Trace:
java.lang.AssertionError: null
	at org.junit.Assert.fail(Assert.java:86)
	at org.junit.Assert.assertTrue(Assert.java:41)
	at org.junit.Assert.assertTrue(Assert.java:52)
	at org.apache.hadoop.mapreduce.v2.app.TestMRAppMaster.testMRAppMasterMidLock(TestMRAppMaster.java:174)