You are viewing a plain text version of this content. The canonical link for it is here.
Posted to builds@solr.apache.org by Apache Jenkins Server <je...@builds.apache.org> on 2024/04/20 18:48:32 UTC

[JENKINS] Lucene » Lucene-Solr-Tests-8.11 - Build # 805 - Unstable!

Build: https://ci-builds.apache.org/job/Lucene/job/Lucene-Solr-Tests-8.11/805/

2 tests failed.
FAILED:  org.apache.solr.cloud.api.collections.ShardSplitTest.testSplitMixedReplicaTypesLink

Error Message:
Timeout occurred while waiting response from server at: http://127.0.0.1:39573/z_

Stack Trace:
org.apache.solr.client.solrj.SolrServerException: Timeout occurred while waiting response from server at: http://127.0.0.1:39573/z_
	at __randomizedtesting.SeedInfo.seed([3A754D0FE15400E:3FC99D895BCDEB97]:0)
	at org.apache.solr.client.solrj.impl.HttpSolrClient.executeMethod(HttpSolrClient.java:692)
	at org.apache.solr.client.solrj.impl.HttpSolrClient.request(HttpSolrClient.java:266)
	at org.apache.solr.client.solrj.impl.HttpSolrClient.request(HttpSolrClient.java:248)
	at org.apache.solr.client.solrj.impl.LBSolrClient.doRequest(LBSolrClient.java:369)
	at org.apache.solr.client.solrj.impl.LBSolrClient.request(LBSolrClient.java:297)
	at org.apache.solr.client.solrj.impl.BaseCloudSolrClient.sendRequest(BaseCloudSolrClient.java:1188)
	at org.apache.solr.client.solrj.impl.BaseCloudSolrClient.requestWithRetryOnStaleState(BaseCloudSolrClient.java:934)
	at org.apache.solr.client.solrj.impl.BaseCloudSolrClient.request(BaseCloudSolrClient.java:866)
	at org.apache.solr.client.solrj.SolrRequest.process(SolrRequest.java:225)
	at org.apache.solr.client.solrj.SolrRequest.process(SolrRequest.java:242)
	at org.apache.solr.cloud.api.collections.ShardSplitTest.doSplitMixedReplicaTypes(ShardSplitTest.java:365)
	at org.apache.solr.cloud.api.collections.ShardSplitTest.testSplitMixedReplicaTypesLink(ShardSplitTest.java:356)
	at sun.reflect.NativeMethodAccessorImpl.invoke0(Native Method)
	at sun.reflect.NativeMethodAccessorImpl.invoke(NativeMethodAccessorImpl.java:62)
	at sun.reflect.DelegatingMethodAccessorImpl.invoke(DelegatingMethodAccessorImpl.java:43)
	at java.lang.reflect.Method.invoke(Method.java:498)
	at com.carrotsearch.randomizedtesting.RandomizedRunner.invoke(RandomizedRunner.java:1758)
	at com.carrotsearch.randomizedtesting.RandomizedRunner$8.evaluate(RandomizedRunner.java:946)
	at com.carrotsearch.randomizedtesting.RandomizedRunner$9.evaluate(RandomizedRunner.java:982)
	at com.carrotsearch.randomizedtesting.RandomizedRunner$10.evaluate(RandomizedRunner.java:996)
	at org.apache.solr.BaseDistributedSearchTestCase$ShardsRepeatRule$ShardsFixedStatement.callStatement(BaseDistributedSearchTestCase.java:1084)
	at org.apache.solr.BaseDistributedSearchTestCase$ShardsRepeatRule$ShardsStatement.evaluate(BaseDistributedSearchTestCase.java:1055)
	at com.carrotsearch.randomizedtesting.rules.SystemPropertiesRestoreRule$1.evaluate(SystemPropertiesRestoreRule.java:80)
	at org.junit.rules.RunRules.evaluate(RunRules.java:20)
	at org.apache.lucene.util.TestRuleSetupTeardownChained$1.evaluate(TestRuleSetupTeardownChained.java:49)
	at org.apache.lucene.util.AbstractBeforeAfterRule$1.evaluate(AbstractBeforeAfterRule.java:45)
	at org.apache.lucene.util.TestRuleThreadAndTestName$1.evaluate(TestRuleThreadAndTestName.java:48)
	at org.apache.lucene.util.TestRuleIgnoreAfterMaxFailures$1.evaluate(TestRuleIgnoreAfterMaxFailures.java:64)
	at org.apache.lucene.util.TestRuleMarkFailure$1.evaluate(TestRuleMarkFailure.java:47)
	at org.junit.rules.RunRules.evaluate(RunRules.java:20)
	at com.carrotsearch.randomizedtesting.rules.StatementAdapter.evaluate(StatementAdapter.java:36)
	at com.carrotsearch.randomizedtesting.ThreadLeakControl$StatementRunner.run(ThreadLeakControl.java:390)
	at com.carrotsearch.randomizedtesting.ThreadLeakControl.forkTimeoutingTask(ThreadLeakControl.java:843)
	at com.carrotsearch.randomizedtesting.ThreadLeakControl$3.evaluate(ThreadLeakControl.java:490)
	at com.carrotsearch.randomizedtesting.RandomizedRunner.runSingleTest(RandomizedRunner.java:955)
	at com.carrotsearch.randomizedtesting.RandomizedRunner$5.evaluate(RandomizedRunner.java:840)
	at com.carrotsearch.randomizedtesting.RandomizedRunner$6.evaluate(RandomizedRunner.java:891)
	at com.carrotsearch.randomizedtesting.RandomizedRunner$7.evaluate(RandomizedRunner.java:902)
	at com.carrotsearch.randomizedtesting.rules.StatementAdapter.evaluate(StatementAdapter.java:36)
	at com.carrotsearch.randomizedtesting.rules.SystemPropertiesRestoreRule$1.evaluate(SystemPropertiesRestoreRule.java:80)
	at org.junit.rules.RunRules.evaluate(RunRules.java:20)
	at org.apache.lucene.util.AbstractBeforeAfterRule$1.evaluate(AbstractBeforeAfterRule.java:45)
	at com.carrotsearch.randomizedtesting.rules.StatementAdapter.evaluate(StatementAdapter.java:36)
	at org.apache.lucene.util.TestRuleStoreClassName$1.evaluate(TestRuleStoreClassName.java:41)
	at com.carrotsearch.randomizedtesting.rules.NoShadowingOrOverridesOnMethodsRule$1.evaluate(NoShadowingOrOverridesOnMethodsRule.java:40)
	at com.carrotsearch.randomizedtesting.rules.NoShadowingOrOverridesOnMethodsRule$1.evaluate(NoShadowingOrOverridesOnMethodsRule.java:40)
	at com.carrotsearch.randomizedtesting.rules.StatementAdapter.evaluate(StatementAdapter.java:36)
	at com.carrotsearch.randomizedtesting.rules.StatementAdapter.evaluate(StatementAdapter.java:36)
	at com.carrotsearch.randomizedtesting.rules.StatementAdapter.evaluate(StatementAdapter.java:36)
	at org.apache.lucene.util.TestRuleAssertionsRequired$1.evaluate(TestRuleAssertionsRequired.java:53)
	at org.apache.lucene.util.TestRuleMarkFailure$1.evaluate(TestRuleMarkFailure.java:47)
	at org.apache.lucene.util.TestRuleIgnoreAfterMaxFailures$1.evaluate(TestRuleIgnoreAfterMaxFailures.java:64)
	at org.apache.lucene.util.TestRuleIgnoreTestSuites$1.evaluate(TestRuleIgnoreTestSuites.java:54)
	at org.junit.rules.RunRules.evaluate(RunRules.java:20)
	at com.carrotsearch.randomizedtesting.rules.StatementAdapter.evaluate(StatementAdapter.java:36)
	at com.carrotsearch.randomizedtesting.ThreadLeakControl$StatementRunner.run(ThreadLeakControl.java:390)
	at com.carrotsearch.randomizedtesting.ThreadLeakControl.lambda$forkTimeoutingTask$0(ThreadLeakControl.java:850)
	at java.lang.Thread.run(Thread.java:750)
Caused by: java.net.SocketTimeoutException: Read timed out
	at java.net.SocketInputStream.socketRead0(Native Method)
	at java.net.SocketInputStream.socketRead(SocketInputStream.java:116)
	at java.net.SocketInputStream.read(SocketInputStream.java:171)
	at java.net.SocketInputStream.read(SocketInputStream.java:141)
	at org.apache.http.impl.io.SessionInputBufferImpl.streamRead(SessionInputBufferImpl.java:137)
	at org.apache.http.impl.io.SessionInputBufferImpl.fillBuffer(SessionInputBufferImpl.java:153)
	at org.apache.http.impl.io.SessionInputBufferImpl.readLine(SessionInputBufferImpl.java:280)
	at org.apache.http.impl.conn.DefaultHttpResponseParser.parseHead(DefaultHttpResponseParser.java:138)
	at org.apache.http.impl.conn.DefaultHttpResponseParser.parseHead(DefaultHttpResponseParser.java:56)
	at org.apache.http.impl.io.AbstractMessageParser.parse(AbstractMessageParser.java:259)
	at org.apache.http.impl.DefaultBHttpClientConnection.receiveResponseHeader(DefaultBHttpClientConnection.java:163)
	at org.apache.http.impl.conn.CPoolProxy.receiveResponseHeader(CPoolProxy.java:157)
	at org.apache.http.protocol.HttpRequestExecutor.doReceiveResponse(HttpRequestExecutor.java:273)
	at org.apache.http.protocol.HttpRequestExecutor.execute(HttpRequestExecutor.java:125)
	at org.apache.http.impl.execchain.MainClientExec.execute(MainClientExec.java:272)
	at org.apache.http.impl.execchain.ProtocolExec.execute(ProtocolExec.java:186)
	at org.apache.http.impl.execchain.RetryExec.execute(RetryExec.java:89)
	at org.apache.http.impl.execchain.RedirectExec.execute(RedirectExec.java:110)
	at org.apache.http.impl.client.InternalHttpClient.doExecute(InternalHttpClient.java:185)
	at org.apache.http.impl.client.CloseableHttpClient.execute(CloseableHttpClient.java:83)
	at org.apache.http.impl.client.CloseableHttpClient.execute(CloseableHttpClient.java:56)
	at org.apache.solr.client.solrj.impl.HttpSolrClient.executeMethod(HttpSolrClient.java:571)
	... 57 more


FAILED:  org.apache.solr.search.TestCoordinatorRole.testNRTRestart

Error Message:
initial error time threshold exceeded

Stack Trace:
java.lang.AssertionError: initial error time threshold exceeded
	at __randomizedtesting.SeedInfo.seed([3A754D0FE15400E:F333E41B5C0892D8]:0)
	at org.junit.Assert.fail(Assert.java:89)
	at org.apache.solr.search.TestCoordinatorRole.getHostCoreName(TestCoordinatorRole.java:484)
	at org.apache.solr.search.TestCoordinatorRole.testNRTRestart(TestCoordinatorRole.java:409)
	at sun.reflect.NativeMethodAccessorImpl.invoke0(Native Method)
	at sun.reflect.NativeMethodAccessorImpl.invoke(NativeMethodAccessorImpl.java:62)
	at sun.reflect.DelegatingMethodAccessorImpl.invoke(DelegatingMethodAccessorImpl.java:43)
	at java.lang.reflect.Method.invoke(Method.java:498)
	at com.carrotsearch.randomizedtesting.RandomizedRunner.invoke(RandomizedRunner.java:1758)
	at com.carrotsearch.randomizedtesting.RandomizedRunner$8.evaluate(RandomizedRunner.java:946)
	at com.carrotsearch.randomizedtesting.RandomizedRunner$9.evaluate(RandomizedRunner.java:982)
	at com.carrotsearch.randomizedtesting.RandomizedRunner$10.evaluate(RandomizedRunner.java:996)
	at com.carrotsearch.randomizedtesting.rules.SystemPropertiesRestoreRule$1.evaluate(SystemPropertiesRestoreRule.java:80)
	at org.junit.rules.RunRules.evaluate(RunRules.java:20)
	at org.apache.lucene.util.TestRuleSetupTeardownChained$1.evaluate(TestRuleSetupTeardownChained.java:49)
	at org.apache.lucene.util.AbstractBeforeAfterRule$1.evaluate(AbstractBeforeAfterRule.java:45)
	at org.apache.lucene.util.TestRuleThreadAndTestName$1.evaluate(TestRuleThreadAndTestName.java:48)
	at org.apache.lucene.util.TestRuleIgnoreAfterMaxFailures$1.evaluate(TestRuleIgnoreAfterMaxFailures.java:64)
	at org.apache.lucene.util.TestRuleMarkFailure$1.evaluate(TestRuleMarkFailure.java:47)
	at org.junit.rules.RunRules.evaluate(RunRules.java:20)
	at com.carrotsearch.randomizedtesting.rules.StatementAdapter.evaluate(StatementAdapter.java:36)
	at com.carrotsearch.randomizedtesting.ThreadLeakControl$StatementRunner.run(ThreadLeakControl.java:390)
	at com.carrotsearch.randomizedtesting.ThreadLeakControl.forkTimeoutingTask(ThreadLeakControl.java:843)
	at com.carrotsearch.randomizedtesting.ThreadLeakControl$3.evaluate(ThreadLeakControl.java:490)
	at com.carrotsearch.randomizedtesting.RandomizedRunner.runSingleTest(RandomizedRunner.java:955)
	at com.carrotsearch.randomizedtesting.RandomizedRunner$5.evaluate(RandomizedRunner.java:840)
	at com.carrotsearch.randomizedtesting.RandomizedRunner$6.evaluate(RandomizedRunner.java:891)
	at com.carrotsearch.randomizedtesting.RandomizedRunner$7.evaluate(RandomizedRunner.java:902)
	at com.carrotsearch.randomizedtesting.rules.StatementAdapter.evaluate(StatementAdapter.java:36)
	at com.carrotsearch.randomizedtesting.rules.SystemPropertiesRestoreRule$1.evaluate(SystemPropertiesRestoreRule.java:80)
	at org.junit.rules.RunRules.evaluate(RunRules.java:20)
	at org.apache.lucene.util.AbstractBeforeAfterRule$1.evaluate(AbstractBeforeAfterRule.java:45)
	at com.carrotsearch.randomizedtesting.rules.StatementAdapter.evaluate(StatementAdapter.java:36)
	at org.apache.lucene.util.TestRuleStoreClassName$1.evaluate(TestRuleStoreClassName.java:41)
	at com.carrotsearch.randomizedtesting.rules.NoShadowingOrOverridesOnMethodsRule$1.evaluate(NoShadowingOrOverridesOnMethodsRule.java:40)
	at com.carrotsearch.randomizedtesting.rules.NoShadowingOrOverridesOnMethodsRule$1.evaluate(NoShadowingOrOverridesOnMethodsRule.java:40)
	at com.carrotsearch.randomizedtesting.rules.StatementAdapter.evaluate(StatementAdapter.java:36)
	at com.carrotsearch.randomizedtesting.rules.StatementAdapter.evaluate(StatementAdapter.java:36)
	at com.carrotsearch.randomizedtesting.rules.StatementAdapter.evaluate(StatementAdapter.java:36)
	at org.apache.lucene.util.TestRuleAssertionsRequired$1.evaluate(TestRuleAssertionsRequired.java:53)
	at org.apache.lucene.util.TestRuleMarkFailure$1.evaluate(TestRuleMarkFailure.java:47)
	at org.apache.lucene.util.TestRuleIgnoreAfterMaxFailures$1.evaluate(TestRuleIgnoreAfterMaxFailures.java:64)
	at org.apache.lucene.util.TestRuleIgnoreTestSuites$1.evaluate(TestRuleIgnoreTestSuites.java:54)
	at org.junit.rules.RunRules.evaluate(RunRules.java:20)
	at com.carrotsearch.randomizedtesting.rules.StatementAdapter.evaluate(StatementAdapter.java:36)
	at com.carrotsearch.randomizedtesting.ThreadLeakControl$StatementRunner.run(ThreadLeakControl.java:390)
	at com.carrotsearch.randomizedtesting.ThreadLeakControl.lambda$forkTimeoutingTask$0(ThreadLeakControl.java:850)
	at java.lang.Thread.run(Thread.java:750)




Build Log:
[...truncated 15632 lines...]
   [junit4] Suite: org.apache.solr.cloud.api.collections.ShardSplitTest
   [junit4]   2> 1631006 INFO  (SUITE-ShardSplitTest-seed#[3A754D0FE15400E]-worker) [     ] o.a.s.SolrTestCase Setting 'solr.default.confdir' system property to test-framework derived value of '/home/jenkins/jenkins-slave/workspace/Lucene/Lucene-Solr-Tests-8.11/solr/server/solr/configsets/_default/conf'
   [junit4]   2> 1631007 INFO  (SUITE-ShardSplitTest-seed#[3A754D0FE15400E]-worker) [     ] o.a.s.u.ErrorLogMuter Closing ErrorLogMuter-regex-16003 after mutting 0 log messages
   [junit4]   2> 1631007 INFO  (SUITE-ShardSplitTest-seed#[3A754D0FE15400E]-worker) [     ] o.a.s.u.ErrorLogMuter Creating ErrorLogMuter-regex-16004 for ERROR logs matching regex: ignore_exception
   [junit4]   2> 1631008 INFO  (SUITE-ShardSplitTest-seed#[3A754D0FE15400E]-worker) [     ] o.a.s.SolrTestCaseJ4 Created dataDir: /home/jenkins/jenkins-slave/workspace/Lucene/Lucene-Solr-Tests-8.11/solr/build/solr-core/test/J2/temp/solr.cloud.api.collections.ShardSplitTest_3A754D0FE15400E-001/data-dir-180-001
   [junit4]   2> 1631008 WARN  (SUITE-ShardSplitTest-seed#[3A754D0FE15400E]-worker) [     ] o.a.s.SolrTestCaseJ4 startTrackingSearchers: numOpens=28 numCloses=28
   [junit4]   2> 1631008 INFO  (SUITE-ShardSplitTest-seed#[3A754D0FE15400E]-worker) [     ] o.a.s.SolrTestCaseJ4 Using PointFields (NUMERIC_POINTS_SYSPROP=true) w/NUMERIC_DOCVALUES_SYSPROP=true
   [junit4]   2> 1631010 INFO  (SUITE-ShardSplitTest-seed#[3A754D0FE15400E]-worker) [     ] o.a.s.SolrTestCaseJ4 Randomized ssl (false) and clientAuth (false) via: @org.apache.solr.SolrTestCaseJ4$SuppressSSL(bugUrl=https://issues.apache.org/jira/browse/SOLR-5776)
   [junit4]   2> 1631010 INFO  (SUITE-ShardSplitTest-seed#[3A754D0FE15400E]-worker) [     ] o.a.s.SolrTestCaseJ4 SecureRandom sanity checks: test.solr.allowed.securerandom=null & java.security.egd=file:/dev/./urandom
   [junit4]   2> 1631010 INFO  (SUITE-ShardSplitTest-seed#[3A754D0FE15400E]-worker) [     ] o.a.s.BaseDistributedSearchTestCase Setting hostContext system property: /z_/
   [junit4]   2> 1631034 INFO  (TEST-ShardSplitTest.testSplitLocking-seed#[3A754D0FE15400E]) [     ] o.a.s.u.ErrorLogMuter Closing ErrorLogMuter-regex-16004 after mutting 0 log messages
   [junit4]   2> 1631034 INFO  (TEST-ShardSplitTest.testSplitLocking-seed#[3A754D0FE15400E]) [     ] o.a.s.u.ErrorLogMuter Creating ErrorLogMuter-regex-16005 for ERROR logs matching regex: ignore_exception
   [junit4]   2> 1631035 INFO  (TEST-ShardSplitTest.testSplitLocking-seed#[3A754D0FE15400E]) [     ] o.a.s.c.ZkTestServer STARTING ZK TEST SERVER
   [junit4]   2> 1631035 INFO  (ZkTestServer Run Thread) [     ] o.a.s.c.ZkTestServer client port: 0.0.0.0/0.0.0.0:0
   [junit4]   2> 1631035 INFO  (ZkTestServer Run Thread) [     ] o.a.s.c.ZkTestServer Starting server
   [junit4]   2> 1631036 WARN  (ZkTestServer Run Thread) [     ] o.a.z.s.ServerCnxnFactory maxCnxns is not configured, using default value 0.
   [junit4]   2> 1631135 INFO  (TEST-ShardSplitTest.testSplitLocking-seed#[3A754D0FE15400E]) [     ] o.a.s.c.ZkTestServer start zk server on port: 34563
   [junit4]   2> 1631135 INFO  (TEST-ShardSplitTest.testSplitLocking-seed#[3A754D0FE15400E]) [     ] o.a.s.c.ZkTestServer waitForServerUp: 127.0.0.1:34563
   [junit4]   2> 1631135 INFO  (TEST-ShardSplitTest.testSplitLocking-seed#[3A754D0FE15400E]) [     ] o.a.s.c.ZkTestServer parse host and port list: 127.0.0.1:34563
   [junit4]   2> 1631136 INFO  (TEST-ShardSplitTest.testSplitLocking-seed#[3A754D0FE15400E]) [     ] o.a.s.c.ZkTestServer connecting to 127.0.0.1 34563
   [junit4]   2> 1631137 DEBUG (TEST-ShardSplitTest.testSplitLocking-seed#[3A754D0FE15400E]) [     ] o.a.s.c.c.SolrZkClient Using default ZkCredentialsProvider
   [junit4]   2> 1631137 INFO  (TEST-ShardSplitTest.testSplitLocking-seed#[3A754D0FE15400E]) [     ] o.a.s.c.c.ConnectionManager Waiting for client to connect to ZooKeeper
   [junit4]   2> 1631139 DEBUG (TEST-ShardSplitTest.testSplitLocking-seed#[3A754D0FE15400E]-EventThread) [     ] o.a.s.c.c.SolrZkClient Submitting job to respond to event WatchedEvent state:SyncConnected type:None path:null
   [junit4]   2> 1631139 DEBUG (zkConnectionManagerCallback-16345-thread-1) [     ] o.a.s.c.c.ConnectionManager Watcher org.apache.solr.common.cloud.ConnectionManager@2f3daea3 name: ZooKeeperConnection Watcher:127.0.0.1:34563 got event WatchedEvent state:SyncConnected type:None path:null path: null type: None
   [junit4]   2> 1631139 INFO  (zkConnectionManagerCallback-16345-thread-1) [     ] o.a.s.c.c.ConnectionManager zkClient has connected
   [junit4]   2> 1631139 INFO  (TEST-ShardSplitTest.testSplitLocking-seed#[3A754D0FE15400E]) [     ] o.a.s.c.c.ConnectionManager Client is connected to ZooKeeper
   [junit4]   2> 1631140 DEBUG (TEST-ShardSplitTest.testSplitLocking-seed#[3A754D0FE15400E]) [     ] o.a.s.c.c.SolrZkClient Using default ZkACLProvider
   [junit4]   2> 1631140 DEBUG (TEST-ShardSplitTest.testSplitLocking-seed#[3A754D0FE15400E]) [     ] o.a.s.c.c.SolrZkClient makePath: /solr
   [junit4]   2> 1631141 DEBUG (TEST-ShardSplitTest.testSplitLocking-seed#[3A754D0FE15400E]) [     ] o.a.s.c.c.SolrZkClient Using default ZkCredentialsProvider
   [junit4]   2> 1631142 INFO  (TEST-ShardSplitTest.testSplitLocking-seed#[3A754D0FE15400E]) [     ] o.a.s.c.c.ConnectionManager Waiting for client to connect to ZooKeeper
   [junit4]   2> 1631143 DEBUG (TEST-ShardSplitTest.testSplitLocking-seed#[3A754D0FE15400E]-EventThread) [     ] o.a.s.c.c.SolrZkClient Submitting job to respond to event WatchedEvent state:SyncConnected type:None path:null
   [junit4]   2> 1631143 DEBUG (zkConnectionManagerCallback-16347-thread-1) [     ] o.a.s.c.c.ConnectionManager Watcher org.apache.solr.common.cloud.ConnectionManager@16bb185 name: ZooKeeperConnection Watcher:127.0.0.1:34563/solr got event WatchedEvent state:SyncConnected type:None path:null path: null type: None
   [junit4]   2> 1631143 INFO  (zkConnectionManagerCallback-16347-thread-1) [     ] o.a.s.c.c.ConnectionManager zkClient has connected
   [junit4]   2> 1631143 INFO  (TEST-ShardSplitTest.testSplitLocking-seed#[3A754D0FE15400E]) [     ] o.a.s.c.c.ConnectionManager Client is connected to ZooKeeper
   [junit4]   2> 1631143 DEBUG (TEST-ShardSplitTest.testSplitLocking-seed#[3A754D0FE15400E]) [     ] o.a.s.c.c.SolrZkClient Using default ZkACLProvider
   [junit4]   2> 1631144 DEBUG (TEST-ShardSplitTest.testSplitLocking-seed#[3A754D0FE15400E]) [     ] o.a.s.c.c.SolrZkClient makePath: /clusterprops.json
   [junit4]   2> 1631144 INFO  (TEST-ShardSplitTest.testSplitLocking-seed#[3A754D0FE15400E]) [     ] o.a.s.c.ZkTestServer put /home/jenkins/jenkins-slave/workspace/Lucene/Lucene-Solr-Tests-8.11/solr/core/src/test-files/solr/collection1/conf/solrconfig-tlog.xml to /configs/conf1/solrconfig.xml
   [junit4]   2> 1631144 DEBUG (TEST-ShardSplitTest.testSplitLocking-seed#[3A754D0FE15400E]) [     ] o.a.s.c.c.SolrZkClient makePath: /configs/conf1/solrconfig.xml
   [junit4]   2> 1631145 INFO  (TEST-ShardSplitTest.testSplitLocking-seed#[3A754D0FE15400E]) [     ] o.a.s.c.ZkTestServer put /home/jenkins/jenkins-slave/workspace/Lucene/Lucene-Solr-Tests-8.11/solr/core/src/test-files/solr/collection1/conf/schema15.xml to /configs/conf1/schema.xml
   [junit4]   2> 1631145 DEBUG (TEST-ShardSplitTest.testSplitLocking-seed#[3A754D0FE15400E]) [     ] o.a.s.c.c.SolrZkClient makePath: /configs/conf1/schema.xml
   [junit4]   2> 1631146 INFO  (TEST-ShardSplitTest.testSplitLocking-seed#[3A754D0FE15400E]) [     ] o.a.s.c.ZkTestServer put /home/jenkins/jenkins-slave/workspace/Lucene/Lucene-Solr-Tests-8.11/solr/core/src/test-files/solr/collection1/conf/solrconfig.snippet.randomindexconfig.xml to /configs/conf1/solrconfig.snippet.randomindexconfig.xml
   [junit4]   2> 1631146 DEBUG (TEST-ShardSplitTest.testSplitLocking-seed#[3A754D0FE15400E]) [     ] o.a.s.c.c.SolrZkClient makePath: /configs/conf1/solrconfig.snippet.randomindexconfig.xml
   [junit4]   2> 1631147 INFO  (TEST-ShardSplitTest.testSplitLocking-seed#[3A754D0FE15400E]) [     ] o.a.s.c.ZkTestServer put /home/jenkins/jenkins-slave/workspace/Lucene/Lucene-Solr-Tests-8.11/solr/core/src/test-files/solr/collection1/conf/stopwords.txt to /configs/conf1/stopwords.txt
   [junit4]   2> 1631147 DEBUG (TEST-ShardSplitTest.testSplitLocking-seed#[3A754D0FE15400E]) [     ] o.a.s.c.c.SolrZkClient makePath: /configs/conf1/stopwords.txt
   [junit4]   2> 1631148 INFO  (TEST-ShardSplitTest.testSplitLocking-seed#[3A754D0FE15400E]) [     ] o.a.s.c.ZkTestServer put /home/jenkins/jenkins-slave/workspace/Lucene/Lucene-Solr-Tests-8.11/solr/core/src/test-files/solr/collection1/conf/protwords.txt to /configs/conf1/protwords.txt
   [junit4]   2> 1631148 DEBUG (TEST-ShardSplitTest.testSplitLocking-seed#[3A754D0FE15400E]) [     ] o.a.s.c.c.SolrZkClient makePath: /configs/conf1/protwords.txt
   [junit4]   2> 1631149 INFO  (TEST-ShardSplitTest.testSplitLocking-seed#[3A754D0FE15400E]) [     ] o.a.s.c.ZkTestServer put /home/jenkins/jenkins-slave/workspace/Lucene/Lucene-Solr-Tests-8.11/solr/core/src/test-files/solr/collection1/conf/currency.xml to /configs/conf1/currency.xml
   [junit4]   2> 1631149 DEBUG (TEST-ShardSplitTest.testSplitLocking-seed#[3A754D0FE15400E]) [     ] o.a.s.c.c.SolrZkClient makePath: /configs/conf1/currency.xml
   [junit4]   2> 1631150 INFO  (TEST-ShardSplitTest.testSplitLocking-seed#[3A754D0FE15400E]) [     ] o.a.s.c.ZkTestServer put /home/jenkins/jenkins-slave/workspace/Lucene/Lucene-Solr-Tests-8.11/solr/core/src/test-files/solr/collection1/conf/enumsConfig.xml to /configs/conf1/enumsConfig.xml
   [junit4]   2> 1631150 DEBUG (TEST-ShardSplitTest.testSplitLocking-seed#[3A754D0FE15400E]) [     ] o.a.s.c.c.SolrZkClient makePath: /configs/conf1/enumsConfig.xml
   [junit4]   2> 1631151 INFO  (TEST-ShardSplitTest.testSplitLocking-seed#[3A754D0FE15400E]) [     ] o.a.s.c.ZkTestServer put /home/jenkins/jenkins-slave/workspace/Lucene/Lucene-Solr-Tests-8.11/solr/core/src/test-files/solr/collection1/conf/open-exchange-rates.json to /configs/conf1/open-exchange-rates.json
   [junit4]   2> 1631151 DEBUG (TEST-ShardSplitTest.testSplitLocking-seed#[3A754D0FE15400E]) [     ] o.a.s.c.c.SolrZkClient makePath: /configs/conf1/open-exchange-rates.json
   [junit4]   2> 1631152 INFO  (TEST-ShardSplitTest.testSplitLocking-seed#[3A754D0FE15400E]) [     ] o.a.s.c.ZkTestServer put /home/jenkins/jenkins-slave/workspace/Lucene/Lucene-Solr-Tests-8.11/solr/core/src/test-files/solr/collection1/conf/mapping-ISOLatin1Accent.txt to /configs/conf1/mapping-ISOLatin1Accent.txt
   [junit4]   2> 1631152 DEBUG (TEST-ShardSplitTest.testSplitLocking-seed#[3A754D0FE15400E]) [     ] o.a.s.c.c.SolrZkClient makePath: /configs/conf1/mapping-ISOLatin1Accent.txt
   [junit4]   2> 1631153 INFO  (TEST-ShardSplitTest.testSplitLocking-seed#[3A754D0FE15400E]) [     ] o.a.s.c.ZkTestServer put /home/jenkins/jenkins-slave/workspace/Lucene/Lucene-Solr-Tests-8.11/solr/core/src/test-files/solr/collection1/conf/old_synonyms.txt to /configs/conf1/old_synonyms.txt
   [junit4]   2> 1631153 DEBUG (TEST-ShardSplitTest.testSplitLocking-seed#[3A754D0FE15400E]) [     ] o.a.s.c.c.SolrZkClient makePath: /configs/conf1/old_synonyms.txt
   [junit4]   2> 1631154 INFO  (TEST-ShardSplitTest.testSplitLocking-seed#[3A754D0FE15400E]) [     ] o.a.s.c.ZkTestServer put /home/jenkins/jenkins-slave/workspace/Lucene/Lucene-Solr-Tests-8.11/solr/core/src/test-files/solr/collection1/conf/synonyms.txt to /configs/conf1/synonyms.txt
   [junit4]   2> 1631154 DEBUG (TEST-ShardSplitTest.testSplitLocking-seed#[3A754D0FE15400E]) [     ] o.a.s.c.c.SolrZkClient makePath: /configs/conf1/synonyms.txt
   [junit4]   2> 1631155 INFO  (TEST-ShardSplitTest.testSplitLocking-seed#[3A754D0FE15400E]) [     ] o.a.s.c.AbstractFullDistribZkTestBase Will use NRT replicas unless explicitly asked otherwise
   [junit4]   2> 1631298 INFO  (TEST-ShardSplitTest.testSplitLocking-seed#[3A754D0FE15400E]) [     ] o.a.s.c.s.e.JettySolrRunner Start Jetty (configured port=0, binding port=0)
   [junit4]   2> 1631298 INFO  (TEST-ShardSplitTest.testSplitLocking-seed#[3A754D0FE15400E]) [     ] o.a.s.c.s.e.JettySolrRunner Trying to start Jetty on port 0 try number 2 ...
   [junit4]   2> 1631298 INFO  (TEST-ShardSplitTest.testSplitLocking-seed#[3A754D0FE15400E]) [     ] o.e.j.s.Server jetty-9.4.53.v20231009; built: 2023-10-09T12:29:09.265Z; git: 27bde00a0b95a1d5bbee0eae7984f891d2d0f8c9; jvm 1.8.0_362-b09
   [junit4]   2> 1631299 INFO  (TEST-ShardSplitTest.testSplitLocking-seed#[3A754D0FE15400E]) [     ] o.e.j.s.session DefaultSessionIdManager workerName=node0
   [junit4]   2> 1631299 INFO  (TEST-ShardSplitTest.testSplitLocking-seed#[3A754D0FE15400E]) [     ] o.e.j.s.session No SessionScavenger set, using defaults
   [junit4]   2> 1631300 INFO  (TEST-ShardSplitTest.testSplitLocking-seed#[3A754D0FE15400E]) [     ] o.e.j.s.session node0 Scavenging every 660000ms
   [junit4]   2> 1631300 INFO  (TEST-ShardSplitTest.testSplitLocking-seed#[3A754D0FE15400E]) [     ] o.e.j.s.h.ContextHandler Started o.e.j.s.ServletContextHandler@1763ec4c{/z_,null,AVAILABLE}
   [junit4]   2> 1631300 INFO  (TEST-ShardSplitTest.testSplitLocking-seed#[3A754D0FE15400E]) [     ] o.e.j.s.AbstractConnector Started ServerConnector@9d15376{HTTP/1.1, (http/1.1, h2c)}{127.0.0.1:39725}
   [junit4]   2> 1631300 INFO  (TEST-ShardSplitTest.testSplitLocking-seed#[3A754D0FE15400E]) [     ] o.e.j.s.Server Started @1631338ms
   [junit4]   2> 1631300 INFO  (TEST-ShardSplitTest.testSplitLocking-seed#[3A754D0FE15400E]) [     ] o.a.s.c.s.e.JettySolrRunner Jetty properties: {solr.data.dir=/home/jenkins/jenkins-slave/workspace/Lucene/Lucene-Solr-Tests-8.11/solr/build/solr-core/test/J2/temp/solr.cloud.api.collections.ShardSplitTest_3A754D0FE15400E-001/tempDir-001/control/data, replicaType=NRT, hostContext=/z_, hostPort=39725, coreRootDirectory=/home/jenkins/jenkins-slave/workspace/Lucene/Lucene-Solr-Tests-8.11/solr/build/solr-core/test/J2/../../../../../../../../../../../home/jenkins/jenkins-slave/workspace/Lucene/Lucene-Solr-Tests-8.11/solr/build/solr-core/test/J2/temp/solr.cloud.api.collections.ShardSplitTest_3A754D0FE15400E-001/control-001/cores}
   [junit4]   2> 1631300 ERROR (TEST-ShardSplitTest.testSplitLocking-seed#[3A754D0FE15400E]) [     ] o.a.s.u.StartupLoggingUtils Missing Java Option solr.log.dir. Logging may be missing or incomplete.
   [junit4]   2> 1631300 INFO  (TEST-ShardSplitTest.testSplitLocking-seed#[3A754D0FE15400E]) [     ] o.a.s.s.SolrDispatchFilter Using logger factory org.apache.logging.slf4j.Log4jLoggerFactory
   [junit4]   2> 1631300 INFO  (TEST-ShardSplitTest.testSplitLocking-seed#[3A754D0FE15400E]) [     ] o.a.s.s.SolrDispatchFilter  ___      _       Welcome to Apache Solr? version 8.11.4
   [junit4]   2> 1631300 INFO  (TEST-ShardSplitTest.testSplitLocking-seed#[3A754D0FE15400E]) [     ] o.a.s.s.SolrDispatchFilter / __| ___| |_ _   Starting in cloud mode on port null
   [junit4]   2> 1631301 INFO  (TEST-ShardSplitTest.testSplitLocking-seed#[3A754D0FE15400E]) [     ] o.a.s.s.SolrDispatchFilter \__ \/ _ \ | '_|  Install dir: /home/jenkins/jenkins-slave/workspace/Lucene/Lucene-Solr-Tests-8.11/solr
   [junit4]   2> 1631301 INFO  (TEST-ShardSplitTest.testSplitLocking-seed#[3A754D0FE15400E]) [     ] o.a.s.s.SolrDispatchFilter |___/\___/_|_|    Start time: 2024-04-20T18:10:54.012Z
   [junit4]   2> 1631301 DEBUG (TEST-ShardSplitTest.testSplitLocking-seed#[3A754D0FE15400E]) [     ] o.a.s.c.c.SolrZkClient Using default ZkCredentialsProvider
   [junit4]   2> 1631301 INFO  (TEST-ShardSplitTest.testSplitLocking-seed#[3A754D0FE15400E]) [     ] o.a.s.c.c.ConnectionManager Waiting for client to connect to ZooKeeper
   [junit4]   2> 1631302 DEBUG (TEST-ShardSplitTest.testSplitLocking-seed#[3A754D0FE15400E]-EventThread) [     ] o.a.s.c.c.SolrZkClient Submitting job to respond to event WatchedEvent state:SyncConnected type:None path:null
   [junit4]   2> 1631302 DEBUG (zkConnectionManagerCallback-16349-thread-1) [     ] o.a.s.c.c.ConnectionManager Watcher org.apache.solr.common.cloud.ConnectionManager@20588c53 name: ZooKeeperConnection Watcher:127.0.0.1:34563/solr got event WatchedEvent state:SyncConnected type:None path:null path: null type: None
   [junit4]   2> 1631302 INFO  (zkConnectionManagerCallback-16349-thread-1) [     ] o.a.s.c.c.ConnectionManager zkClient has connected
   [junit4]   2> 1631302 INFO  (TEST-ShardSplitTest.testSplitLocking-seed#[3A754D0FE15400E]) [     ] o.a.s.c.c.ConnectionManager Client is connected to ZooKeeper
   [junit4]   2> 1631302 DEBUG (TEST-ShardSplitTest.testSplitLocking-seed#[3A754D0FE15400E]) [     ] o.a.s.c.c.SolrZkClient Using default ZkACLProvider
   [junit4]   2> 1631403 INFO  (TEST-ShardSplitTest.testSplitLocking-seed#[3A754D0FE15400E]) [     ] o.a.s.s.SolrDispatchFilter Loading solr.xml from SolrHome (not found in ZooKeeper)
   [junit4]   2> 1631403 DEBUG (TEST-ShardSplitTest.testSplitLocking-seed#[3A754D0FE15400E]-EventThread) [     ] o.a.s.c.c.SolrZkClient Submitting job to respond to event WatchedEvent state:Closed type:None path:null
   [junit4]   2> 1631403 INFO  (TEST-ShardSplitTest.testSplitLocking-seed#[3A754D0FE15400E]) [     ] o.a.s.c.SolrXmlConfig Loading container configuration from /home/jenkins/jenkins-slave/workspace/Lucene/Lucene-Solr-Tests-8.11/solr/build/solr-core/test/J2/../../../../../../../../../../../home/jenkins/jenkins-slave/workspace/Lucene/Lucene-Solr-Tests-8.11/solr/build/solr-core/test/J2/temp/solr.cloud.api.collections.ShardSplitTest_3A754D0FE15400E-001/control-001/solr.xml
   [junit4]   2> 1631407 INFO  (TEST-ShardSplitTest.testSplitLocking-seed#[3A754D0FE15400E]) [     ] o.a.s.c.SolrXmlConfig Configuration parameter autoReplicaFailoverWorkLoopDelay is ignored
   [junit4]   2> 1631407 INFO  (TEST-ShardSplitTest.testSplitLocking-seed#[3A754D0FE15400E]) [     ] o.a.s.c.SolrXmlConfig Configuration parameter autoReplicaFailoverBadNodeExpiration is ignored
   [junit4]   2> 1631408 INFO  (TEST-ShardSplitTest.testSplitLocking-seed#[3A754D0FE15400E]) [     ] o.a.s.c.SolrXmlConfig MBean server found: com.sun.jmx.mbeanserver.JmxMBeanServer@2b39de85, but no JMX reporters were configured - adding default JMX reporter.
   [junit4]   2> 1631712 INFO  (TEST-ShardSplitTest.testSplitLocking-seed#[3A754D0FE15400E]) [     ] o.a.s.h.c.HttpShardHandlerFactory Host whitelist initialized: WhitelistHostChecker [whitelistHosts=null, whitelistHostCheckingEnabled=false]
   [junit4]   2> 1631713 WARN  (TEST-ShardSplitTest.testSplitLocking-seed#[3A754D0FE15400E]) [     ] o.e.j.u.s.S.config Trusting all certificates configured for Client@5dd9a5b0[provider=null,keyStore=null,trustStore=null]
   [junit4]   2> 1631713 WARN  (TEST-ShardSplitTest.testSplitLocking-seed#[3A754D0FE15400E]) [     ] o.e.j.u.s.S.config No Client EndPointIdentificationAlgorithm configured for Client@5dd9a5b0[provider=null,keyStore=null,trustStore=null]
   [junit4]   2> 1631716 WARN  (TEST-ShardSplitTest.testSplitLocking-seed#[3A754D0FE15400E]) [     ] o.e.j.u.s.S.config Trusting all certificates configured for Client@cd61d94[provider=null,keyStore=null,trustStore=null]
   [junit4]   2> 1631716 WARN  (TEST-ShardSplitTest.testSplitLocking-seed#[3A754D0FE15400E]) [     ] o.e.j.u.s.S.config No Client EndPointIdentificationAlgorithm configured for Client@cd61d94[provider=null,keyStore=null,trustStore=null]
   [junit4]   2> 1631718 INFO  (TEST-ShardSplitTest.testSplitLocking-seed#[3A754D0FE15400E]) [     ] o.a.s.c.ZkContainer Zookeeper client=127.0.0.1:34563/solr
   [junit4]   2> 1631718 DEBUG (TEST-ShardSplitTest.testSplitLocking-seed#[3A754D0FE15400E]) [     ] o.a.s.c.c.SolrZkClient Using default ZkCredentialsProvider
   [junit4]   2> 1631718 INFO  (TEST-ShardSplitTest.testSplitLocking-seed#[3A754D0FE15400E]) [     ] o.a.s.c.c.ConnectionManager Waiting for client to connect to ZooKeeper
   [junit4]   2> 1631721 DEBUG (TEST-ShardSplitTest.testSplitLocking-seed#[3A754D0FE15400E]-EventThread) [     ] o.a.s.c.c.SolrZkClient Submitting job to respond to event WatchedEvent state:SyncConnected type:None path:null
   [junit4]   2> 1631721 DEBUG (zkConnectionManagerCallback-16360-thread-1) [     ] o.a.s.c.c.ConnectionManager Watcher org.apache.solr.common.cloud.ConnectionManager@5a5e86ff name: ZooKeeperConnection Watcher:127.0.0.1:34563 got event WatchedEvent state:SyncConnected type:None path:null path: null type: None
   [junit4]   2> 1631721 INFO  (zkConnectionManagerCallback-16360-thread-1) [     ] o.a.s.c.c.ConnectionManager zkClient has connected
   [junit4]   2> 1631721 INFO  (TEST-ShardSplitTest.testSplitLocking-seed#[3A754D0FE15400E]) [     ] o.a.s.c.c.ConnectionManager Client is connected to ZooKeeper
   [junit4]   2> 1631722 DEBUG (TEST-ShardSplitTest.testSplitLocking-seed#[3A754D0FE15400E]) [     ] o.a.s.c.c.SolrZkClient Using default ZkACLProvider
   [junit4]   2> 1631823 DEBUG (TEST-ShardSplitTest.testSplitLocking-seed#[3A754D0FE15400E]-EventThread) [     ] o.a.s.c.c.SolrZkClient Submitting job to respond to event WatchedEvent state:Closed type:None path:null
   [junit4]   2> 1631824 INFO  (TEST-ShardSplitTest.testSplitLocking-seed#[3A754D0FE15400E]) [n:127.0.0.1:39725_z_     ] o.a.s.c.c.ConnectionManager Waiting for client to connect to ZooKeeper
   [junit4]   2> 1631825 DEBUG (TEST-ShardSplitTest.testSplitLocking-seed#[3A754D0FE15400E]-EventThread) [     ] o.a.s.c.c.SolrZkClient Submitting job to respond to event WatchedEvent state:SyncConnected type:None path:null
   [junit4]   2> 1631825 DEBUG (zkConnectionManagerCallback-16362-thread-1) [     ] o.a.s.c.c.ConnectionManager Watcher org.apache.solr.common.cloud.ConnectionManager@403cc8ac name: ZooKeeperConnection Watcher:127.0.0.1:34563/solr got event WatchedEvent state:SyncConnected type:None path:null path: null type: None
   [junit4]   2> 1631825 INFO  (zkConnectionManagerCallback-16362-thread-1) [     ] o.a.s.c.c.ConnectionManager zkClient has connected
   [junit4]   2> 1631825 INFO  (TEST-ShardSplitTest.testSplitLocking-seed#[3A754D0FE15400E]) [n:127.0.0.1:39725_z_     ] o.a.s.c.c.ConnectionManager Client is connected to ZooKeeper
   [junit4]   2> 1631829 DEBUG (TEST-ShardSplitTest.testSplitLocking-seed#[3A754D0FE15400E]) [n:127.0.0.1:39725_z_     ] o.a.s.c.c.SolrZkClient makePath: /overseer/collection-map-running
   [junit4]   2> 1631830 DEBUG (TEST-ShardSplitTest.testSplitLocking-seed#[3A754D0FE15400E]) [n:127.0.0.1:39725_z_     ] o.a.s.c.c.SolrZkClient makePath: /overseer/collection-map-completed
   [junit4]   2> 1631831 DEBUG (TEST-ShardSplitTest.testSplitLocking-seed#[3A754D0FE15400E]) [n:127.0.0.1:39725_z_     ] o.a.s.c.c.SolrZkClient makePath: /overseer/collection-map-failure
   [junit4]   2> 1631832 DEBUG (TEST-ShardSplitTest.testSplitLocking-seed#[3A754D0FE15400E]) [n:127.0.0.1:39725_z_     ] o.a.s.c.c.SolrZkClient makePath: /overseer/async_ids
   [junit4]   2> 1631833 DEBUG (TEST-ShardSplitTest.testSplitLocking-seed#[3A754D0FE15400E]) [n:127.0.0.1:39725_z_     ] o.a.s.c.c.SolrZkClient makePath: /live_nodes
   [junit4]   2> 1631833 DEBUG (TEST-ShardSplitTest.testSplitLocking-seed#[3A754D0FE15400E]) [n:127.0.0.1:39725_z_     ] o.a.s.c.c.SolrZkClient makePath: /node_roles
   [junit4]   2> 1631834 DEBUG (TEST-ShardSplitTest.testSplitLocking-seed#[3A754D0FE15400E]) [n:127.0.0.1:39725_z_     ] o.a.s.c.c.SolrZkClient makePath: /node_roles/data
   [junit4]   2> 1631835 DEBUG (TEST-ShardSplitTest.testSplitLocking-seed#[3A754D0FE15400E]) [n:127.0.0.1:39725_z_     ] o.a.s.c.c.SolrZkClient makePath: /node_roles/data/on
   [junit4]   2> 1631836 DEBUG (TEST-ShardSplitTest.testSplitLocking-seed#[3A754D0FE15400E]) [n:127.0.0.1:39725_z_     ] o.a.s.c.c.SolrZkClient makePath: /node_roles/data/off
   [junit4]   2> 1631836 DEBUG (TEST-ShardSplitTest.testSplitLocking-seed#[3A754D0FE15400E]) [n:127.0.0.1:39725_z_     ] o.a.s.c.c.SolrZkClient makePath: /node_roles/overseer
   [junit4]   2> 1631837 DEBUG (TEST-ShardSplitTest.testSplitLocking-seed#[3A754D0FE15400E]) [n:127.0.0.1:39725_z_     ] o.a.s.c.c.SolrZkClient makePath: /node_roles/overseer/allowed
   [junit4]   2> 1631838 DEBUG (TEST-ShardSplitTest.testSplitLocking-seed#[3A754D0FE15400E]) [n:127.0.0.1:39725_z_     ] o.a.s.c.c.SolrZkClient makePath: /node_roles/overseer/preferred
   [junit4]   2> 1631839 DEBUG (TEST-ShardSplitTest.testSplitLocking-seed#[3A754D0FE15400E]) [n:127.0.0.1:39725_z_     ] o.a.s.c.c.SolrZkClient makePath: /node_roles/overseer/disallowed
   [junit4]   2> 1631840 DEBUG (TEST-ShardSplitTest.testSplitLocking-seed#[3A754D0FE15400E]) [n:127.0.0.1:39725_z_     ] o.a.s.c.c.SolrZkClient makePath: /node_roles/coordinator
   [junit4]   2> 1631841 DEBUG (TEST-ShardSplitTest.testSplitLocking-seed#[3A754D0FE15400E]) [n:127.0.0.1:39725_z_     ] o.a.s.c.c.SolrZkClient makePath: /node_roles/coordinator/on
   [junit4]   2> 1631842 DEBUG (TEST-ShardSplitTest.testSplitLocking-seed#[3A754D0FE15400E]) [n:127.0.0.1:39725_z_     ] o.a.s.c.c.SolrZkClient makePath: /node_roles/coordinator/off
   [junit4]   2> 1631843 DEBUG (TEST-ShardSplitTest.testSplitLocking-seed#[3A754D0FE15400E]) [n:127.0.0.1:39725_z_     ] o.a.s.c.c.SolrZkClient makePath: /aliases.json
   [junit4]   2> 1631843 DEBUG (TEST-ShardSplitTest.testSplitLocking-seed#[3A754D0FE15400E]) [n:127.0.0.1:39725_z_     ] o.a.s.c.c.SolrZkClient makePath: /autoscaling/events
   [junit4]   2> 1631844 DEBUG (TEST-ShardSplitTest.testSplitLocking-seed#[3A754D0FE15400E]) [n:127.0.0.1:39725_z_     ] o.a.s.c.c.SolrZkClient makePath: /autoscaling/triggerState
   [junit4]   2> 1631845 DEBUG (TEST-ShardSplitTest.testSplitLocking-seed#[3A754D0FE15400E]) [n:127.0.0.1:39725_z_     ] o.a.s.c.c.SolrZkClient makePath: /autoscaling/nodeAdded
   [junit4]   2> 1631846 DEBUG (TEST-ShardSplitTest.testSplitLocking-seed#[3A754D0FE15400E]) [n:127.0.0.1:39725_z_     ] o.a.s.c.c.SolrZkClient makePath: /autoscaling/nodeLost
   [junit4]   2> 1631846 DEBUG (TEST-ShardSplitTest.testSplitLocking-seed#[3A754D0FE15400E]) [n:127.0.0.1:39725_z_     ] o.a.s.c.c.SolrZkClient makePath: /clusterstate.json
   [junit4]   2> 1631847 DEBUG (TEST-ShardSplitTest.testSplitLocking-seed#[3A754D0FE15400E]) [n:127.0.0.1:39725_z_     ] o.a.s.c.c.SolrZkClient makePath: /autoscaling.json
   [junit4]   2> 1631847 DEBUG (TEST-ShardSplitTest.testSplitLocking-seed#[3A754D0FE15400E]) [n:127.0.0.1:39725_z_     ] o.a.s.c.c.SolrZkClient makePath: /security.json
   [junit4]   2> 1631848 DEBUG (TEST-ShardSplitTest.testSplitLocking-seed#[3A754D0FE15400E]) [n:127.0.0.1:39725_z_     ] o.a.s.c.c.SolrZkClient makePath: /configs/_default/protwords.txt
   [junit4]   2> 1631849 DEBUG (TEST-ShardSplitTest.testSplitLocking-seed#[3A754D0FE15400E]) [n:127.0.0.1:39725_z_     ] o.a.s.c.c.SolrZkClient makePath: /configs/_default/managed-schema
   [junit4]   2> 1631850 DEBUG (TEST-ShardSplitTest.testSplitLocking-seed#[3A754D0FE15400E]) [n:127.0.0.1:39725_z_     ] o.a.s.c.c.SolrZkClient makePath: /configs/_default/solrconfig.xml
   [junit4]   2> 1631852 DEBUG (TEST-ShardSplitTest.testSplitLocking-seed#[3A754D0FE15400E]) [n:127.0.0.1:39725_z_     ] o.a.s.c.c.SolrZkClient makePath: /configs/_default/synonyms.txt
   [junit4]   2> 1631853 DEBUG (TEST-ShardSplitTest.testSplitLocking-seed#[3A754D0FE15400E]) [n:127.0.0.1:39725_z_     ] o.a.s.c.c.SolrZkClient makePath: /configs/_default/lang/stopwords_it.txt
   [junit4]   2> 1631854 DEBUG (TEST-ShardSplitTest.testSplitLocking-seed#[3A754D0FE15400E]) [n:127.0.0.1:39725_z_     ] o.a.s.c.c.SolrZkClient makePath: /configs/_default/lang/stopwords_cz.txt
   [junit4]   2> 1631855 DEBUG (TEST-ShardSplitTest.testSplitLocking-seed#[3A754D0FE15400E]) [n:127.0.0.1:39725_z_     ] o.a.s.c.c.SolrZkClient makePath: /configs/_default/lang/stopwords_fr.txt
   [junit4]   2> 1631856 DEBUG (TEST-ShardSplitTest.testSplitLocking-seed#[3A754D0FE15400E]) [n:127.0.0.1:39725_z_     ] o.a.s.c.c.SolrZkClient makePath: /configs/_default/lang/stopwords_no.txt
   [junit4]   2> 1631858 DEBUG (TEST-ShardSplitTest.testSplitLocking-seed#[3A754D0FE15400E]) [n:127.0.0.1:39725_z_     ] o.a.s.c.c.SolrZkClient makePath: /configs/_default/lang/contractions_ca.txt
   [junit4]   2> 1631859 DEBUG (TEST-ShardSplitTest.testSplitLocking-seed#[3A754D0FE15400E]) [n:127.0.0.1:39725_z_     ] o.a.s.c.c.SolrZkClient makePath: /configs/_default/lang/stopwords_sv.txt
   [junit4]   2> 1631860 DEBUG (TEST-ShardSplitTest.testSplitLocking-seed#[3A754D0FE15400E]) [n:127.0.0.1:39725_z_     ] o.a.s.c.c.SolrZkClient makePath: /configs/_default/lang/stopwords_ca.txt
   [junit4]   2> 1631861 DEBUG (TEST-ShardSplitTest.testSplitLocking-seed#[3A754D0FE15400E]) [n:127.0.0.1:39725_z_     ] o.a.s.c.c.SolrZkClient makePath: /configs/_default/lang/stopwords_hu.txt
   [junit4]   2> 1631862 DEBUG (TEST-ShardSplitTest.testSplitLocking-seed#[3A754D0FE15400E]) [n:127.0.0.1:39725_z_     ] o.a.s.c.c.SolrZkClient makePath: /configs/_default/lang/stopwords_gl.txt
   [junit4]   2> 1631863 DEBUG (TEST-ShardSplitTest.testSplitLocking-seed#[3A754D0FE15400E]) [n:127.0.0.1:39725_z_     ] o.a.s.c.c.SolrZkClient makePath: /configs/_default/lang/stopwords_bg.txt
   [junit4]   2> 1631865 DEBUG (TEST-ShardSplitTest.testSplitLocking-seed#[3A754D0FE15400E]) [n:127.0.0.1:39725_z_     ] o.a.s.c.c.SolrZkClient makePath: /configs/_default/lang/stopwords_th.txt
   [junit4]   2> 1631866 DEBUG (TEST-ShardSplitTest.testSplitLocking-seed#[3A754D0FE15400E]) [n:127.0.0.1:39725_z_     ] o.a.s.c.c.SolrZkClient makePath: /configs/_default/lang/stopwords_ga.txt
   [junit4]   2> 1631867 DEBUG (TEST-ShardSplitTest.testSplitLocking-seed#[3A754D0FE15400E]) [n:127.0.0.1:39725_z_     ] o.a.s.c.c.SolrZkClient makePath: /configs/_default/lang/stopwords_da.txt
   [junit4]   2> 1631869 DEBUG (TEST-ShardSplitTest.testSplitLocking-seed#[3A754D0FE15400E]) [n:127.0.0.1:39725_z_     ] o.a.s.c.c.SolrZkClient makePath: /configs/_default/lang/stopwords_et.txt
   [junit4]   2> 1631870 DEBUG (TEST-ShardSplitTest.testSplitLocking-seed#[3A754D0FE15400E]) [n:127.0.0.1:39725_z_     ] o.a.s.c.c.SolrZkClient makePath: /configs/_default/lang/userdict_ja.txt
   [junit4]   2> 1631871 DEBUG (TEST-ShardSplitTest.testSplitLocking-seed#[3A754D0FE15400E]) [n:127.0.0.1:39725_z_     ] o.a.s.c.c.SolrZkClient makePath: /configs/_default/lang/contractions_ga.txt
   [junit4]   2> 1631872 DEBUG (TEST-ShardSplitTest.testSplitLocking-seed#[3A754D0FE15400E]) [n:127.0.0.1:39725_z_     ] o.a.s.c.c.SolrZkClient makePath: /configs/_default/lang/stopwords_id.txt
   [junit4]   2> 1631873 DEBUG (TEST-ShardSplitTest.testSplitLocking-seed#[3A754D0FE15400E]) [n:127.0.0.1:39725_z_     ] o.a.s.c.c.SolrZkClient makePath: /configs/_default/lang/stopwords_tr.txt
   [junit4]   2> 1631874 DEBUG (TEST-ShardSplitTest.testSplitLocking-seed#[3A754D0FE15400E]) [n:127.0.0.1:39725_z_     ] o.a.s.c.c.SolrZkClient makePath: /configs/_default/lang/stopwords_ja.txt
   [junit4]   2> 1631876 DEBUG (TEST-ShardSplitTest.testSplitLocking-seed#[3A754D0FE15400E]) [n:127.0.0.1:39725_z_     ] o.a.s.c.c.SolrZkClient makePath: /configs/_default/lang/stopwords_ar.txt
   [junit4]   2> 1631877 DEBUG (TEST-ShardSplitTest.testSplitLocking-seed#[3A754D0FE15400E]) [n:127.0.0.1:39725_z_     ] o.a.s.c.c.SolrZkClient makePath: /configs/_default/lang/stopwords_ru.txt
   [junit4]   2> 1631878 DEBUG (TEST-ShardSplitTest.testSplitLocking-seed#[3A754D0FE15400E]) [n:127.0.0.1:39725_z_     ] o.a.s.c.c.SolrZkClient makePath: /configs/_default/lang/hyphenations_ga.txt
   [junit4]   2> 1631879 DEBUG (TEST-ShardSplitTest.testSplitLocking-seed#[3A754D0FE15400E]) [n:127.0.0.1:39725_z_     ] o.a.s.c.c.SolrZkClient makePath: /configs/_default/lang/stopwords_de.txt
   [junit4]   2> 1631880 DEBUG (TEST-ShardSplitTest.testSplitLocking-seed#[3A754D0FE15400E]) [n:127.0.0.1:39725_z_     ] o.a.s.c.c.SolrZkClient makePath: /configs/_default/lang/stopwords_en.txt
   [junit4]   2> 1631882 DEBUG (TEST-ShardSplitTest.testSplitLocking-seed#[3A754D0FE15400E]) [n:127.0.0.1:39725_z_     ] o.a.s.c.c.SolrZkClient makePath: /configs/_default/lang/stemdict_nl.txt
   [junit4]   2> 1631889 DEBUG (TEST-ShardSplitTest.testSplitLocking-seed#[3A754D0FE15400E]) [n:127.0.0.1:39725_z_     ] o.a.s.c.c.SolrZkClient makePath: /configs/_default/lang/stopwords_ro.txt
   [junit4]   2> 1631891 DEBUG (TEST-ShardSplitTest.testSplitLocking-seed#[3A754D0FE15400E]) [n:127.0.0.1:39725_z_     ] o.a.s.c.c.SolrZkClient makePath: /configs/_default/lang/stopwords_hy.txt
   [junit4]   2> 1631892 DEBUG (TEST-ShardSplitTest.testSplitLocking-seed#[3A754D0FE15400E]) [n:127.0.0.1:39725_z_     ] o.a.s.c.c.SolrZkClient makePath: /configs/_default/lang/stopwords_eu.txt
   [junit4]   2> 1631893 DEBUG (TEST-ShardSplitTest.testSplitLocking-seed#[3A754D0FE15400E]) [n:127.0.0.1:39725_z_     ] o.a.s.c.c.SolrZkClient makePath: /configs/_default/lang/stopwords_hi.txt
   [junit4]   2> 1631895 DEBUG (TEST-ShardSplitTest.testSplitLocking-seed#[3A754D0FE15400E]) [n:127.0.0.1:39725_z_     ] o.a.s.c.c.SolrZkClient makePath: /configs/_default/lang/stoptags_ja.txt
   [junit4]   2> 1631897 DEBUG (TEST-ShardSplitTest.testSplitLocking-seed#[3A754D0FE15400E]) [n:127.0.0.1:39725_z_     ] o.a.s.c.c.SolrZkClient makePath: /configs/_default/lang/contractions_fr.txt
   [junit4]   2> 1631898 DEBUG (TEST-ShardSplitTest.testSplitLocking-seed#[3A754D0FE15400E]) [n:127.0.0.1:39725_z_     ] o.a.s.c.c.SolrZkClient makePath: /configs/_default/lang/stopwords_fi.txt
   [junit4]   2> 1631900 DEBUG (TEST-ShardSplitTest.testSplitLocking-seed#[3A754D0FE15400E]) [n:127.0.0.1:39725_z_     ] o.a.s.c.c.SolrZkClient makePath: /configs/_default/lang/stopwords_pt.txt
   [junit4]   2> 1631901 DEBUG (TEST-ShardSplitTest.testSplitLocking-seed#[3A754D0FE15400E]) [n:127.0.0.1:39725_z_     ] o.a.s.c.c.SolrZkClient makePath: /configs/_default/lang/stopwords_lv.txt
   [junit4]   2> 1631902 DEBUG (TEST-ShardSplitTest.testSplitLocking-seed#[3A754D0FE15400E]) [n:127.0.0.1:39725_z_     ] o.a.s.c.c.SolrZkClient makePath: /configs/_default/lang/stopwords_el.txt
   [junit4]   2> 1631903 DEBUG (TEST-ShardSplitTest.testSplitLocking-seed#[3A754D0FE15400E]) [n:127.0.0.1:39725_z_     ] o.a.s.c.c.SolrZkClient makePath: /configs/_default/lang/contractions_it.txt
   [junit4]   2> 1631905 DEBUG (TEST-ShardSplitTest.testSplitLocking-seed#[3A754D0FE15400E]) [n:127.0.0.1:39725_z_     ] o.a.s.c.c.SolrZkClient makePath: /configs/_default/lang/stopwords_nl.txt
   [junit4]   2> 1631906 DEBUG (TEST-ShardSplitTest.testSplitLocking-seed#[3A754D0FE15400E]) [n:127.0.0.1:39725_z_     ] o.a.s.c.c.SolrZkClient makePath: /configs/_default/lang/stopwords_es.txt
   [junit4]   2> 1631907 DEBUG (TEST-ShardSplitTest.testSplitLocking-seed#[3A754D0FE15400E]) [n:127.0.0.1:39725_z_     ] o.a.s.c.c.SolrZkClient makePath: /configs/_default/lang/stopwords_fa.txt
   [junit4]   2> 1631908 DEBUG (TEST-ShardSplitTest.testSplitLocking-seed#[3A754D0FE15400E]) [n:127.0.0.1:39725_z_     ] o.a.s.c.c.SolrZkClient makePath: /configs/_default/stopwords.txt
   [junit4]   2> 1631910 WARN  (TEST-ShardSplitTest.testSplitLocking-seed#[3A754D0FE15400E]) [n:127.0.0.1:39725_z_     ] o.a.s.c.ZkController Contents of zookeeper /security.json are world-readable; consider setting up ACLs as described in https://solr.apache.org/guide/zookeeper-access-control.html
   [junit4]   2> 1631910 DEBUG (TEST-ShardSplitTest.testSplitLocking-seed#[3A754D0FE15400E]) [n:127.0.0.1:39725_z_     ] o.a.s.c.c.ZkStateReader Updating cluster state from ZooKeeper... 
   [junit4]   2> 1631910 DEBUG (TEST-ShardSplitTest.testSplitLocking-seed#[3A754D0FE15400E]) [n:127.0.0.1:39725_z_     ] o.a.s.c.c.ZkStateReader Loaded cluster properties: {legacyCloud=true}
   [junit4]   2> 1631910 DEBUG (TEST-ShardSplitTest.testSplitLocking-seed#[3A754D0FE15400E]) [n:127.0.0.1:39725_z_     ] o.a.s.c.c.ZkStateReader Updated live nodes from ZooKeeper... [] -> []
   [junit4]   2> 1631911 DEBUG (TEST-ShardSplitTest.testSplitLocking-seed#[3A754D0FE15400E]) [n:127.0.0.1:39725_z_     ] o.a.s.c.c.ZkStateReader clusterStateSet: legacy [0] interesting [0] watched [0] lazy [2] total [2]
   [junit4]   2> 1631911 DEBUG (TEST-ShardSplitTest.testSplitLocking-seed#[3A754D0FE15400E]) [n:127.0.0.1:39725_z_     ] o.a.s.c.c.ZkStateReader$AliasesManager Checking ZK for most up to date Aliases /aliases.json
   [junit4]   2> 1631912 DEBUG (TEST-ShardSplitTest.testSplitLocking-seed#[3A754D0FE15400E]) [n:127.0.0.1:39725_z_     ] o.a.s.c.c.ZkStateReader$AliasesManager Aliases: cmp=-1, new definition is: Aliases{collectionAliases={}, collectionAliasProperties={}, zNodeVersion=0}
   [junit4]   2> 1631913 DEBUG (TEST-ShardSplitTest.testSplitLocking-seed#[3A754D0FE15400E]) [n:127.0.0.1:39725_z_     ] o.a.s.c.c.SolrZkClient makePath: /overseer_elect
   [junit4]   2> 1631913 DEBUG (TEST-ShardSplitTest.testSplitLocking-seed#[3A754D0FE15400E]) [n:127.0.0.1:39725_z_     ] o.a.s.c.c.SolrZkClient makePath: /overseer_elect/election
   [junit4]   2> 1631915 INFO  (TEST-ShardSplitTest.testSplitLocking-seed#[3A754D0FE15400E]) [n:127.0.0.1:39725_z_     ] o.a.s.c.OverseerElectionContext I am going to be the leader 127.0.0.1:39725_z_
   [junit4]   2> 1631915 DEBUG (TEST-ShardSplitTest.testSplitLocking-seed#[3A754D0FE15400E]) [n:127.0.0.1:39725_z_     ] o.a.s.c.c.SolrZkClient makePath: /overseer_elect/leader
   [junit4]   2> 1631915 INFO  (TEST-ShardSplitTest.testSplitLocking-seed#[3A754D0FE15400E]) [n:127.0.0.1:39725_z_     ] o.a.s.c.Overseer Overseer (id=72091888125476868-127.0.0.1:39725_z_-n_0000000000) starting
   [junit4]   2> 1631916 DEBUG (TEST-ShardSplitTest.testSplitLocking-seed#[3A754D0FE15400E]) [n:127.0.0.1:39725_z_     ] o.a.s.c.c.SolrZkClient makePath: /overseer/queue
   [junit4]   2> 1631917 DEBUG (TEST-ShardSplitTest.testSplitLocking-seed#[3A754D0FE15400E]) [n:127.0.0.1:39725_z_     ] o.a.s.c.c.SolrZkClient makePath: /overseer/queue-work
   [junit4]   2> 1631918 DEBUG (TEST-ShardSplitTest.testSplitLocking-seed#[3A754D0FE15400E]) [n:127.0.0.1:39725_z_     ] o.a.s.c.c.SolrZkClient makePath: /overseer/collection-queue-work
   [junit4]   2> 1631920 DEBUG (OverseerCollectionConfigSetProcessor-72091888125476868-127.0.0.1:39725_z_-n_0000000000) [n:127.0.0.1:39725_z_     ] o.a.s.c.OverseerTaskProcessor Process current queue of overseer operations
   [junit4]   2> 1631921 INFO  (TEST-ShardSplitTest.testSplitLocking-seed#[3A754D0FE15400E]) [n:127.0.0.1:39725_z_     ] o.a.s.c.ZkController Register node as live in ZooKeeper:/live_nodes/127.0.0.1:39725_z_
   [junit4]   2> 1631921 INFO  (OverseerStateUpdate-72091888125476868-127.0.0.1:39725_z_-n_0000000000) [n:127.0.0.1:39725_z_     ] o.a.s.c.Overseer Starting to work on the main queue : 127.0.0.1:39725_z_
   [junit4]   2> 1631921 DEBUG (TEST-ShardSplitTest.testSplitLocking-seed#[3A754D0FE15400E]-EventThread) [     ] o.a.s.c.c.SolrZkClient Submitting job to respond to event WatchedEvent state:SyncConnected type:NodeChildrenChanged path:/live_nodes
   [junit4]   2> 1631922 DEBUG (OverseerCollectionConfigSetProcessor-72091888125476868-127.0.0.1:39725_z_-n_0000000000) [n:127.0.0.1:39725_z_     ] o.a.s.c.OverseerTaskProcessor Cleaning up work-queue. #Running tasks: 0 #Completed tasks: 0
   [junit4]   2> 1631922 DEBUG (OverseerCollectionConfigSetProcessor-72091888125476868-127.0.0.1:39725_z_-n_0000000000) [n:127.0.0.1:39725_z_     ] o.a.s.c.OverseerTaskProcessor RunningTasks: []
   [junit4]   2> 1631922 DEBUG (OverseerCollectionConfigSetProcessor-72091888125476868-127.0.0.1:39725_z_-n_0000000000) [n:127.0.0.1:39725_z_     ] o.a.s.c.OverseerTaskProcessor BlockedTasks: []
   [junit4]   2> 1631922 DEBUG (OverseerCollectionConfigSetProcessor-72091888125476868-127.0.0.1:39725_z_-n_0000000000) [n:127.0.0.1:39725_z_     ] o.a.s.c.OverseerTaskProcessor CompletedTasks: []
   [junit4]   2> 1631922 INFO  (OverseerCollectionConfigSetProcessor-72091888125476868-127.0.0.1:39725_z_-n_0000000000) [n:127.0.0.1:39725_z_     ] o.a.s.c.OverseerTaskProcessor RunningZKTasks: []
   [junit4]   2> 1631922 INFO  (OverseerStateUpdate-72091888125476868-127.0.0.1:39725_z_-n_0000000000) [n:127.0.0.1:39725_z_     ] o.a.s.c.c.ZkStateReader Updated live nodes from ZooKeeper... (0) -> (1)
   [junit4]   2> 1631922 DEBUG (OverseerStateUpdate-72091888125476868-127.0.0.1:39725_z_-n_0000000000) [n:127.0.0.1:39725_z_     ] o.a.s.c.c.ZkStateReader Updated live nodes from ZooKeeper... [] -> [127.0.0.1:39725_z_]
   [junit4]   2> 1631923 DEBUG (OverseerStateUpdate-72091888125476868-127.0.0.1:39725_z_-n_0000000000) [n:127.0.0.1:39725_z_     ] o.a.s.c.c.ZkStateReader clusterStateSet: legacy [0] interesting [0] watched [0] lazy [2] total [2]
   [junit4]   2> 1631923 INFO  (TEST-ShardSplitTest.testSplitLocking-seed#[3A754D0FE15400E]) [n:127.0.0.1:39725_z_     ] o.a.s.c.ZkController non-data nodes now []
   [junit4]   2> 1631923 DEBUG (OverseerAutoScalingTriggerThread-72091888125476868-127.0.0.1:39725_z_-n_0000000000) [     ] o.a.s.c.c.SolrZkClient makePath: /autoscaling/events/.scheduled_maintenance
   [junit4]   2> 1631925 INFO  (TEST-ShardSplitTest.testSplitLocking-seed#[3A754D0FE15400E]) [n:127.0.0.1:39725_z_     ] o.a.s.p.PackageLoader /packages.json updated to version -1
   [junit4]   2> 1631926 WARN  (TEST-ShardSplitTest.testSplitLocking-seed#[3A754D0FE15400E]) [n:127.0.0.1:39725_z_     ] o.a.s.c.CoreContainer Not all security plugins configured!  authentication=disabled authorization=disabled.  Solr is only as secure as you make it. Consider configuring authentication/authorization before exposing Solr to users internal or external.  See https://s.apache.org/solrsecurity for more info
   [junit4]   2> 1631930 DEBUG (OverseerAutoScalingTriggerThread-72091888125476868-127.0.0.1:39725_z_-n_0000000000) [     ] o.a.s.c.c.SolrZkClient makePath: /autoscaling/events/.auto_add_replicas
   [junit4]   2> 1631930 DEBUG (zkCallback-16361-thread-1) [     ] o.a.s.c.c.ZkStateReader A live node change: [WatchedEvent state:SyncConnected type:NodeChildrenChanged path:/live_nodes], has occurred - updating... (live nodes size: [1])
   [junit4]   2> 1631930 DEBUG (zkCallback-16361-thread-1) [     ] o.a.s.c.c.ZkStateReader Updated live nodes from ZooKeeper... [127.0.0.1:39725_z_] -> [127.0.0.1:39725_z_]
   [junit4]   2> 1631953 INFO  (TEST-ShardSplitTest.testSplitLocking-seed#[3A754D0FE15400E]) [n:127.0.0.1:39725_z_     ] o.a.s.h.a.MetricsHistoryHandler No .system collection, keeping metrics history in memory.
   [junit4]   2> 1631974 INFO  (TEST-ShardSplitTest.testSplitLocking-seed#[3A754D0FE15400E]) [n:127.0.0.1:39725_z_     ] o.a.s.m.r.SolrJmxReporter JMX monitoring for 'solr.node' (registry 'solr.node') enabled at server: com.sun.jmx.mbeanserver.JmxMBeanServer@2b39de85
   [junit4]   2> 1631982 INFO  (TEST-ShardSplitTest.testSplitLocking-seed#[3A754D0FE15400E]) [n:127.0.0.1:39725_z_     ] o.a.s.m.r.SolrJmxReporter JMX monitoring for 'solr.jvm' (registry 'solr.jvm') enabled at server: com.sun.jmx.mbeanserver.JmxMBeanServer@2b39de85
   [junit4]   2> 1631982 INFO  (TEST-ShardSplitTest.testSplitLocking-seed#[3A754D0FE15400E]) [n:127.0.0.1:39725_z_     ] o.a.s.m.r.SolrJmxReporter JMX monitoring for 'solr.jetty' (registry 'solr.jetty') enabled at server: com.sun.jmx.mbeanserver.JmxMBeanServer@2b39de85
   [junit4]   2> 1631983 INFO  (TEST-ShardSplitTest.testSplitLocking-seed#[3A754D0FE15400E]) [n:127.0.0.1:39725_z_     ] o.a.s.c.CorePropertiesLocator Found 0 core definitions underneath /home/jenkins/jenkins-slave/workspace/Lucene/Lucene-Solr-Tests-8.11/solr/build/solr-core/test/J2/temp/solr.cloud.api.collections.ShardSplitTest_3A754D0FE15400E-001/control-001/cores
   [junit4]   2> 1631996 DEBUG (TEST-ShardSplitTest.testSplitLocking-seed#[3A754D0FE15400E]) [     ] o.a.s.c.c.SolrZkClient Using default ZkCredentialsProvider
   [junit4]   2> 1631997 INFO  (TEST-ShardSplitTest.testSplitLocking-seed#[3A754D0FE15400E]) [     ] o.a.s.c.c.ConnectionManager Waiting for client to connect to ZooKeeper
   [junit4]   2> 1631998 DEBUG (TEST-ShardSplitTest.testSplitLocking-seed#[3A754D0FE15400E]-EventThread) [     ] o.a.s.c.c.SolrZkClient Submitting job to respond to event WatchedEvent state:SyncConnected type:None path:null
   [junit4]   2> 1631999 DEBUG (zkConnectionManagerCallback-16379-thread-1) [     ] o.a.s.c.c.ConnectionManager Watcher org.apache.solr.common.cloud.ConnectionManager@7199d3a7 name: ZooKeeperConnection Watcher:127.0.0.1:34563/solr got event WatchedEvent state:SyncConnected type:None path:null path: null type: None
   [junit4]   2> 1631999 INFO  (zkConnectionManagerCallback-16379-thread-1) [     ] o.a.s.c.c.ConnectionManager zkClient has connected
   [junit4]   2> 1631999 INFO  (TEST-ShardSplitTest.testSplitLocking-seed#[3A754D0FE15400E]) [     ] o.a.s.c.c.ConnectionManager Client is connected to ZooKeeper
   [junit4]   2> 1631999 DEBUG (TEST-ShardSplitTest.testSplitLocking-seed#[3A754D0FE15400E]) [     ] o.a.s.c.c.SolrZkClient Using default ZkACLProvider
   [junit4]   2> 1631999 DEBUG (TEST-ShardSplitTest.testSplitLocking-seed#[3A754D0FE15400E]) [     ] o.a.s.c.c.ZkStateReader Updating cluster state from ZooKeeper... 
   [junit4]   2> 1631999 DEBUG (TEST-ShardSplitTest.testSplitLocking-seed#[3A754D0FE15400E]) [     ] o.a.s.c.c.ZkStateReader Loaded cluster properties: {legacyCloud=true}
   [junit4]   2> 1632000 INFO  (TEST-ShardSplitTest.testSplitLocking-seed#[3A754D0FE15400E]) [     ] o.a.s.c.c.ZkStateReader Updated live nodes from ZooKeeper... (0) -> (1)
   [junit4]   2> 1632000 DEBUG (TEST-ShardSplitTest.testSplitLocking-seed#[3A754D0FE15400E]) [     ] o.a.s.c.c.ZkStateReader Updated live nodes from ZooKeeper... [] -> [127.0.0.1:39725_z_]
   [junit4]   2> 1632000 DEBUG (TEST-ShardSplitTest.testSplitLocking-seed#[3A754D0FE15400E]) [     ] o.a.s.c.c.ZkStateReader clusterStateSet: legacy [0] interesting [0] watched [0] lazy [2] total [2]
   [junit4]   2> 1632000 DEBUG (TEST-ShardSplitTest.testSplitLocking-seed#[3A754D0FE15400E]) [     ] o.a.s.c.c.ZkStateReader$AliasesManager Checking ZK for most up to date Aliases /aliases.json
   [junit4]   2> 1632000 DEBUG (TEST-ShardSplitTest.testSplitLocking-seed#[3A754D0FE15400E]) [     ] o.a.s.c.c.ZkStateReader$AliasesManager Aliases: cmp=-1, new definition is: Aliases{collectionAliases={}, collectionAliasProperties={}, zNodeVersion=0}
   [junit4]   2> 1632001 INFO  (TEST-ShardSplitTest.testSplitLocking-seed#[3A754D0FE15400E]) [     ] o.a.s.c.s.i.ZkClientClusterStateProvider Cluster at 127.0.0.1:34563/solr ready
   [junit4]   2> 1632001 INFO  (qtp1384838700-25677) [n:127.0.0.1:39725_z_     ] o.a.s.s.HttpSolrCall HttpSolrCall.init(http://127.0.0.1:39725/z_/admin/collections?action=CREATE&name=control_collection&collection.configName=conf1&createNodeSet=127.0.0.1%3A39725_z_&numShards=1&nrtReplicas=1&wt=javabin&version=2)
   [junit4]   2> 1632002 DEBUG (TEST-ShardSplitTest.testSplitLocking-seed#[3A754D0FE15400E]-EventThread) [     ] o.a.s.c.c.SolrZkClient Submitting job to respond to event WatchedEvent state:SyncConnected type:NodeChildrenChanged path:/overseer/collection-queue-work
   [junit4]   2> 1632003 DEBUG (TEST-ShardSplitTest.testSplitLocking-seed#[3A754D0FE15400E]-EventThread) [     ] o.a.s.c.c.SolrZkClient Submitting job to respond to event WatchedEvent state:SyncConnected type:NodeChildrenChanged path:/overseer/collection-queue-work
   [junit4]   2> 1632003 DEBUG (OverseerCollectionConfigSetProcessor-72091888125476868-127.0.0.1:39725_z_-n_0000000000) [n:127.0.0.1:39725_z_     ] o.a.s.c.OverseerTaskProcessor Got 1 tasks from work-queue : [[org.apache.solr.cloud.OverseerTaskQueue$QueueEvent@2e684ecf]]
   [junit4]   2> 1632004 DEBUG (OverseerCollectionConfigSetProcessor-72091888125476868-127.0.0.1:39725_z_-n_0000000000) [n:127.0.0.1:39725_z_     ] o.a.s.c.OverseerTaskProcessor Marked task [/overseer/collection-queue-work/qn-0000000000] as running
   [junit4]   2> 1632004 DEBUG (OverseerCollectionConfigSetProcessor-72091888125476868-127.0.0.1:39725_z_-n_0000000000) [n:127.0.0.1:39725_z_     ] o.a.s.c.OverseerTaskProcessor Overseer Collection Message Handler: Get the message id: /overseer/collection-queue-work/qn-0000000000 message: {
   [junit4]   2>   "name":"control_collection",
   [junit4]   2>   "fromApi":"true",
   [junit4]   2>   "collection.configName":"conf1",
   [junit4]   2>   "numShards":"1",
   [junit4]   2>   "createNodeSet":"127.0.0.1:39725_z_",
   [junit4]   2>   "nrtReplicas":"1",
   [junit4]   2>   "stateFormat":"2",
   [junit4]   2>   "replicationFactor":"1",
   [junit4]   2>   "operation":"create"}
   [junit4]   2> 1632005 DEBUG (OverseerThreadFactory-16369-thread-1-processing-n:127.0.0.1:39725_z_) [n:127.0.0.1:39725_z_     ] o.a.s.c.OverseerTaskProcessor Runner processing /overseer/collection-queue-work/qn-0000000000
   [junit4]   2> 1632005 DEBUG (OverseerThreadFactory-16369-thread-1-processing-n:127.0.0.1:39725_z_) [n:127.0.0.1:39725_z_     ] o.a.s.c.a.c.OverseerCollectionMessageHandler OverseerCollectionMessageHandler.processMessage : create , {
   [junit4]   2>   "name":"control_collection",
   [junit4]   2>   "fromApi":"true",
   [junit4]   2>   "collection.configName":"conf1",
   [junit4]   2>   "numShards":"1",
   [junit4]   2>   "createNodeSet":"127.0.0.1:39725_z_",
   [junit4]   2>   "nrtReplicas":"1",
   [junit4]   2>   "stateFormat":"2",
   [junit4]   2>   "replicationFactor":"1",
   [junit4]   2>   "operation":"create"}
   [junit4]   2> 1632005 DEBUG (OverseerThreadFactory-16369-thread-1-processing-n:127.0.0.1:39725_z_) [n:127.0.0.1:39725_z_     ] o.a.s.c.c.ZkStateReader$AliasesManager Checking ZK for most up to date Aliases /aliases.json
   [junit4]   2> 1632005 DEBUG (OverseerCollectionConfigSetProcessor-72091888125476868-127.0.0.1:39725_z_-n_0000000000) [n:127.0.0.1:39725_z_     ] o.a.s.c.OverseerTaskProcessor Cleaning up work-queue. #Running tasks: 1 #Completed tasks: 0
   [junit4]   2> 1632005 DEBUG (OverseerCollectionConfigSetProcessor-72091888125476868-127.0.0.1:39725_z_-n_0000000000) [n:127.0.0.1:39725_z_     ] o.a.s.c.OverseerTaskProcessor RunningTasks: [/overseer/collection-queue-work/qn-0000000000]
   [junit4]   2> 1632005 DEBUG (OverseerCollectionConfigSetProcessor-72091888125476868-127.0.0.1:39725_z_-n_0000000000) [n:127.0.0.1:39725_z_     ] o.a.s.c.OverseerTaskProcessor BlockedTasks: []
   [junit4]   2> 1632005 DEBUG (OverseerCollectionConfigSetProcessor-72091888125476868-127.0.0.1:39725_z_-n_0000000000) [n:127.0.0.1:39725_z_     ] o.a.s.c.OverseerTaskProcessor CompletedTasks: []
   [junit4]   2> 1632006 INFO  (OverseerCollectionConfigSetProcessor-72091888125476868-127.0.0.1:39725_z_-n_0000000000) [n:127.0.0.1:39725_z_     ] o.a.s.c.OverseerTaskProcessor RunningZKTasks: [/overseer/collection-queue-work/qn-0000000000]
   [junit4]   2> 1632006 DEBUG (OverseerThreadFactory-16369-thread-1-processing-n:127.0.0.1:39725_z_) [n:127.0.0.1:39725_z_     ] o.a.s.c.c.ZkStateReader$AliasesManager Aliases: cmp=0, not overwriting ZK version.
   [junit4]   2> 1632006 INFO  (OverseerThreadFactory-16369-thread-1-processing-n:127.0.0.1:39725_z_) [n:127.0.0.1:39725_z_     ] o.a.s.c.a.c.CreateCollectionCmd Create collection control_collection
   [junit4]   2> 1632006 DEBUG (OverseerThreadFactory-16369-thread-1-processing-n:127.0.0.1:39725_z_) [n:127.0.0.1:39725_z_     ] o.a.s.c.a.c.OverseerCollectionMessageHandler creating collections conf node /collections/control_collection 
   [junit4]   2> 1632006 DEBUG (OverseerThreadFactory-16369-thread-1-processing-n:127.0.0.1:39725_z_) [n:127.0.0.1:39725_z_     ] o.a.s.c.a.c.CreateCollectionCmd Check for collection zkNode: control_collection
   [junit4]   2> 1632007 DEBUG (OverseerThreadFactory-16369-thread-1-processing-n:127.0.0.1:39725_z_) [n:127.0.0.1:39725_z_     ] o.a.s.c.a.c.CreateCollectionCmd Collection zkNode exists
   [junit4]   2> 1632007 DEBUG (TEST-ShardSplitTest.testSplitLocking-seed#[3A754D0FE15400E]-EventThread) [     ] o.a.s.c.c.SolrZkClient Submitting job to respond to event WatchedEvent state:SyncConnected type:NodeChildrenChanged path:/overseer/queue
   [junit4]   2> 1632008 DEBUG (OverseerStateUpdate-72091888125476868-127.0.0.1:39725_z_-n_0000000000) [n:127.0.0.1:39725_z_     ] o.a.s.c.Overseer processMessage: queueSize: 1, message = {
   [junit4]   2>   "name":"control_collection",
   [junit4]   2>   "fromApi":"true",
   [junit4]   2>   "collection.configName":"conf1",
   [junit4]   2>   "numShards":"1",
   [junit4]   2>   "createNodeSet":"127.0.0.1:39725_z_",
   [junit4]   2>   "nrtReplicas":"1",
   [junit4]   2>   "stateFormat":"2",
   [junit4]   2>   "replicationFactor":"1",
   [junit4]   2>   "operation":"create"} current state version: 0
   [junit4]   2> 1632008 DEBUG (OverseerStateUpdate-72091888125476868-127.0.0.1:39725_z_-n_0000000000) [n:127.0.0.1:39725_z_     ] o.a.s.c.o.ClusterStateMutator building a new cName: control_collection
   [junit4]   2> 1632009 DEBUG (OverseerStateUpdate-72091888125476868-127.0.0.1:39725_z_-n_0000000000) [n:127.0.0.1:39725_z_     ] o.a.s.c.o.ZkStateWriter going to create_collection /collections/control_collection/state.json
   [junit4]   2> 1632010 DEBUG (TEST-ShardSplitTest.testSplitLocking-seed#[3A754D0FE15400E]-EventThread) [     ] o.a.s.c.c.SolrZkClient Submitting job to respond to event WatchedEvent state:SyncConnected type:NodeChildrenChanged path:/overseer/queue
   [junit4]   2> 1632109 DEBUG (OverseerThreadFactory-16369-thread-1-processing-n:127.0.0.1:39725_z_) [n:127.0.0.1:39725_z_     ] o.a.s.c.a.c.CreateCollectionCmd Creating SolrCores for new collection control_collection, shardNames [shard1] , message : {
   [junit4]   2>   "name":"control_collection",
   [junit4]   2>   "fromApi":"true",
   [junit4]   2>   "collection.configName":"conf1",
   [junit4]   2>   "numShards":"1",
   [junit4]   2>   "createNodeSet":"127.0.0.1:39725_z_",
   [junit4]   2>   "nrtReplicas":"1",
   [junit4]   2>   "stateFormat":"2",
   [junit4]   2>   "replicationFactor":"1",
   [junit4]   2>   "operation":"create"}
   [junit4]   2> 1632110 DEBUG (OverseerThreadFactory-16369-thread-1-processing-n:127.0.0.1:39725_z_) [n:127.0.0.1:39725_z_     ] o.a.s.c.a.c.CreateCollectionCmd Creating core control_collection_shard1_replica_n1 as part of shard shard1 of collection control_collection on 127.0.0.1:39725_z_
   [junit4]   2> 1632120 INFO  (qtp1384838700-25679) [n:127.0.0.1:39725_z_     ] o.a.s.s.HttpSolrCall HttpSolrCall.init(http://127.0.0.1:39725/z_/admin/cores?null)
   [junit4]   2> 1632120 INFO  (qtp1384838700-25679) [n:127.0.0.1:39725_z_    x:control_collection_shard1_replica_n1 ] o.a.s.h.a.CoreAdminOperation core create command qt=/admin/cores&collection.configName=conf1&newCollection=true&name=control_collection_shard1_replica_n1&action=CREATE&numShards=1&collection=control_collection&shard=shard1&wt=javabin&version=2&replicaType=NRT
   [junit4]   2> 1632120 INFO  (qtp1384838700-25679) [n:127.0.0.1:39725_z_    x:control_collection_shard1_replica_n1 ] o.a.s.c.TransientSolrCoreCacheDefault Allocating transient core cache for max 4 cores with initial capacity of 4
   [junit4]   2> 1632124 DEBUG (TEST-ShardSplitTest.testSplitLocking-seed#[3A754D0FE15400E]-EventThread) [     ] o.a.s.c.c.SolrZkClient Submitting job to respond to event WatchedEvent state:SyncConnected type:NodeChildrenChanged path:/overseer/queue
   [junit4]   2> 1632125 DEBUG (OverseerStateUpdate-72091888125476868-127.0.0.1:39725_z_-n_0000000000) [n:127.0.0.1:39725_z_     ] o.a.s.c.Overseer processMessage: queueSize: 1, message = {
   [junit4]   2>   "core":"control_collection_shard1_replica_n1",
   [junit4]   2>   "roles":null,
   [junit4]   2>   "node_name":"127.0.0.1:39725_z_",
   [junit4]   2>   "base_url":"http://127.0.0.1:39725/z_",
   [junit4]   2>   "numShards":"1",
   [junit4]   2>   "state":"down",
   [junit4]   2>   "shard":"shard1",
   [junit4]   2>   "collection":"control_collection",
   [junit4]   2>   "type":"NRT",
   [junit4]   2>   "operation":"state"} current state version: 0
   [junit4]   2> 1632125 DEBUG (OverseerStateUpdate-72091888125476868-127.0.0.1:39725_z_-n_0000000000) [n:127.0.0.1:39725_z_     ] o.a.s.c.o.ReplicaMutator Update state numShards=1 message={
   [junit4]   2>   "core":"control_collection_shard1_replica_n1",
   [junit4]   2>   "roles":null,
   [junit4]   2>   "node_name":"127.0.0.1:39725_z_",
   [junit4]   2>   "base_url":"http://127.0.0.1:39725/z_",
   [junit4]   2>   "numShards":"1",
   [junit4]   2>   "state":"down",
   [junit4]   2>   "shard":"shard1",
   [junit4]   2>   "collection":"control_collection",
   [junit4]   2>   "type":"NRT",
   [junit4]   2>   "operation":"state"}
   [junit4]   2> 1632126 DEBUG (OverseerStateUpdate-72091888125476868-127.0.0.1:39725_z_-n_0000000000) [n:127.0.0.1:39725_z_     ] o.a.s.c.o.ReplicaMutator Will update state for replica: core_node2:{
   [junit4]   2>   "core":"control_collection_shard1_replica_n1",
   [junit4]   2>   "node_name":"127.0.0.1:39725_z_",
   [junit4]   2>   "base_url":"http://127.0.0.1:39725/z_",
   [junit4]   2>   "state":"down",
   [junit4]   2>   "type":"NRT"}
   [junit4]   2> 1632126 DEBUG (OverseerStateUpdate-72091888125476868-127.0.0.1:39725_z_-n_0000000000) [n:127.0.0.1:39725_z_     ] o.a.s.c.o.ReplicaMutator Collection is now: DocCollection(control_collection//collections/control_collection/state.json/0 )={
   [junit4]   2>   "pullReplicas":"0",
   [junit4]   2>   "replicationFactor":"1",
   [junit4]   2>   "router":{"name":"compositeId"},
   [junit4]   2>   "maxShardsPerNode":"1",
   [junit4]   2>   "autoAddReplicas":"false",
   [junit4]   2>   "nrtReplicas":"1",
   [junit4]   2>   "tlogReplicas":"0",
   [junit4]   2>   "shards":{"shard1":{
   [junit4]   2>       "range":"80000000-7fffffff",
   [junit4]   2>       "state":"active",
   [junit4]   2>       "replicas":{"core_node2":{
   [junit4]   2>           "core":"control_collection_shard1_replica_n1",
   [junit4]   2>           "node_name":"127.0.0.1:39725_z_",
   [junit4]   2>           "base_url":"http://127.0.0.1:39725/z_",
   [junit4]   2>           "state":"down",
   [junit4]   2>           "type":"NRT"}}}}}
   [junit4]   2> 1632227 DEBUG (OverseerStateUpdate-72091888125476868-127.0.0.1:39725_z_-n_0000000000) [n:127.0.0.1:39725_z_     ] o.a.s.c.o.ZkStateWriter going to update_collection /collections/control_collection/state.json version: 0
   [junit4]   2> 1632228 DEBUG (TEST-ShardSplitTest.testSplitLocking-seed#[3A754D0FE15400E]-EventThread) [     ] o.a.s.c.c.SolrZkClient Submitting job to respond to event WatchedEvent state:SyncConnected type:NodeChildrenChanged path:/overseer/queue
   [junit4]   2> 1633128 DEBUG (qtp1384838700-25679) [n:127.0.0.1:39725_z_ c:control_collection s:shard1  x:control_collection_shard1_replica_n1 ] o.a.s.c.c.ZkStateReader Loading collection config from: [/collections/control_collection]
   [junit4]   2> 1633136 INFO  (qtp1384838700-25679) [n:127.0.0.1:39725_z_ c:control_collection s:shard1  x:control_collection_shard1_replica_n1 ] o.a.s.c.SolrConfig Using Lucene MatchVersion: 8.11.4
   [junit4]   2> 1633137 WARN  (qtp1384838700-25679) [n:127.0.0.1:39725_z_ c:control_collection s:shard1  x:control_collection_shard1_replica_n1 ] o.a.s.c.SolrConfig solrconfig.xml: <jmx> is no longer supported, use solr.xml:/metrics/reporter section instead
   [junit4]   2> 1633141 INFO  (qtp1384838700-25679) [n:127.0.0.1:39725_z_ c:control_collection s:shard1  x:control_collection_shard1_replica_n1 ] o.a.s.s.IndexSchema Schema name=test
   [junit4]   2> 1633145 INFO  (qtp1384838700-25679) [n:127.0.0.1:39725_z_ c:control_collection s:shard1  x:control_collection_shard1_replica_n1 ] o.a.s.s.IndexSchema Loaded schema test/1.6 with uniqueid field id
   [junit4]   2> 1633161 INFO  (qtp1384838700-25679) [n:127.0.0.1:39725_z_ c:control_collection s:shard1  x:control_collection_shard1_replica_n1 ] o.a.s.c.CoreContainer Creating SolrCore 'control_collection_shard1_replica_n1' using configuration from configset conf1, trusted=true
   [junit4]   2> 1633161 INFO  (qtp1384838700-25679) [n:127.0.0.1:39725_z_ c:control_collection s:shard1  x:control_collection_shard1_replica_n1 ] o.a.s.m.r.SolrJmxReporter JMX monitoring for 'solr.core.control_collection.shard1.replica_n1' (registry 'solr.core.control_collection.shard1.replica_n1') enabled at server: com.sun.jmx.mbeanserver.JmxMBeanServer@2b39de85
   [junit4]   2> 1633161 INFO  (qtp1384838700-25679) [n:127.0.0.1:39725_z_ c:control_collection s:shard1  x:control_collection_shard1_replica_n1 ] o.a.s.c.SolrCore [[control_collection_shard1_replica_n1] ] Opening new SolrCore at [/home/jenkins/jenkins-slave/workspace/Lucene/Lucene-Solr-Tests-8.11/solr/build/solr-core/test/J2/temp/solr.cloud.api.collections.ShardSplitTest_3A754D0FE15400E-001/control-001/cores/control_collection_shard1_replica_n1], dataDir=[/home/jenkins/jenkins-slave/workspace/Lucene/Lucene-Solr-Tests-8.11/solr/build/solr-core/test/J2/temp/solr.cloud.api.collections.ShardSplitTest_3A754D0FE15400E-001/control-001/cores/control_collection_shard1_replica_n1/data/]
   [junit4]   2> 1633164 INFO  (qtp1384838700-25679) [n:127.0.0.1:39725_z_ c:control_collection s:shard1  x:control_collection_shard1_replica_n1 ] o.a.s.u.RandomMergePolicy RandomMergePolicy wrapping class org.apache.lucene.index.LogByteSizeMergePolicy: [LogByteSizeMergePolicy: minMergeSize=1677721, mergeFactor=15, maxMergeSize=2147483648, maxMergeSizeForForcedMerge=9223372036854775807, calibrateSizeByDeletes=false, maxMergeDocs=2147483647, maxCFSSegmentSizeMB=8.796093022207999E12, noCFSRatio=0.0]
   [junit4]   2> 1633205 WARN  (qtp1384838700-25679) [n:127.0.0.1:39725_z_ c:control_collection s:shard1  x:control_collection_shard1_replica_n1 ] o.a.s.c.RequestHandlers INVALID paramSet a in requestHandler {type = requestHandler,name = /dump,class = DumpRequestHandler,attributes = {initParams=a, name=/dump, class=DumpRequestHandler},args = {defaults={a=A,b=B}}}
   [junit4]   2> 1633261 INFO  (qtp1384838700-25679) [n:127.0.0.1:39725_z_ c:control_collection s:shard1  x:control_collection_shard1_replica_n1 ] o.a.s.u.UpdateHandler Using UpdateLog implementation: org.apache.solr.update.UpdateLog
   [junit4]   2> 1633261 INFO  (qtp1384838700-25679) [n:127.0.0.1:39725_z_ c:control_collection s:shard1  x:control_collection_shard1_replica_n1 ] o.a.s.u.UpdateLog Initializing UpdateLog: dataDir= defaultSyncLevel=FLUSH numRecordsToKeep=100 maxNumLogsToKeep=10 numVersionBuckets=65536
   [junit4]   2> 1633262 INFO  (qtp1384838700-25679) [n:127.0.0.1:39725_z_ c:control_collection s:shard1  x:control_collection_shard1_replica_n1 ] o.a.s.u.CommitTracker Hard AutoCommit: disabled
   [junit4]   2> 1633262 INFO  (qtp1384838700-25679) [n:127.0.0.1:39725_z_ c:control_collection s:shard1  x:control_collection_shard1_replica_n1 ] o.a.s.u.CommitTracker Soft AutoCommit: disabled
   [junit4]   2> 1633263 INFO  (qtp1384838700-25679) [n:127.0.0.1:39725_z_ c:control_collection s:shard1  x:control_collection_shard1_replica_n1 ] o.a.s.u.RandomMergePolicy RandomMergePolicy wrapping class org.apache.lucene.index.TieredMergePolicy: [TieredMergePolicy: maxMergeAtOnce=33, maxMergeAtOnceExplicit=19, maxMergedSegmentMB=56.4013671875, floorSegmentMB=1.0419921875, forceMergeDeletesPctAllowed=3.1474065098823423, segmentsPerTier=23.0, maxCFSSegmentSizeMB=8.796093022207999E12, noCFSRatio=0.54763917324438, deletesPctAllowed=31.58669058531229
   [junit4]   2> 1633265 DEBUG (qtp1384838700-25679) [n:127.0.0.1:39725_z_ c:control_collection s:shard1  x:control_collection_shard1_replica_n1 ] o.a.s.c.c.ZkStateReader Loading collection config from: [/collections/control_collection]
   [junit4]   2> 1633266 INFO  (qtp1384838700-25679) [n:127.0.0.1:39725_z_ c:control_collection s:shard1  x:control_collection_shard1_replica_n1 ] o.a.s.r.ManagedResourceStorage Configured ZooKeeperStorageIO with znodeBase: /configs/conf1
   [junit4]   2> 1633266 INFO  (qtp1384838700-25679) [n:127.0.0.1:39725_z_ c:control_collection s:shard1  x:control_collection_shard1_replica_n1 ] o.a.s.r.ManagedResourceStorage Loaded null at path _rest_managed.json using ZooKeeperStorageIO:path=/configs/conf1
   [junit4]   2> 1633267 INFO  (qtp1384838700-25679) [n:127.0.0.1:39725_z_ c:control_collection s:shard1  x:control_collection_shard1_replica_n1 ] o.a.s.h.ReplicationHandler Commits will be reserved for 10000 ms
   [junit4]   2> 1633267 INFO  (qtp1384838700-25679) [n:127.0.0.1:39725_z_ c:control_collection s:shard1  x:control_collection_shard1_replica_n1 ] o.a.s.u.UpdateLog Could not find max version in index or recent updates, using new clock 1796878270178787328
   [junit4]   2> 1633269 DEBUG (qtp1384838700-25679) [n:127.0.0.1:39725_z_ c:control_collection s:shard1  x:control_collection_shard1_replica_n1 ] o.a.s.c.c.ZkStateReader Waiting up to 60000ms for state org.apache.solr.cloud.ZkController$$Lambda$601/829960361@65c5339f
   [junit4]   2> 1633269 DEBUG (qtp1384838700-25679) [n:127.0.0.1:39725_z_ c:control_collection s:shard1  x:control_collection_shard1_replica_n1 ] o.a.s.c.c.ZkStateReader Found org.apache.solr.cloud.ZkController$$Lambda$601/829960361@65c5339f directly in clusterState
   [junit4]   2> 1633269 DEBUG (qtp1384838700-25679) [n:127.0.0.1:39725_z_ c:control_collection s:shard1  x:control_collection_shard1_replica_n1 ] o.a.s.c.c.SolrZkClient makePath: /collections/control_collection/terms/shard1
   [junit4]   2> 1633270 INFO  (searcherExecutor-16381-thread-1-processing-n:127.0.0.1:39725_z_ x:control_collection_shard1_replica_n1 c:control_collection s:shard1) [n:127.0.0.1:39725_z_ c:control_collection s:shard1  x:control_collection_shard1_replica_n1 ] o.a.s.c.SolrCore [control_collection_shard1_replica_n1]  Registered new searcher autowarm time: 0 ms
   [junit4]   2> 1633272 DEBUG (TEST-ShardSplitTest.testSplitLocking-seed#[3A754D0FE15400E]-EventThread) [     ] o.a.s.c.c.SolrZkClient Submitting job to respond to event WatchedEvent state:SyncConnected type:NodeDataChanged path:/collections/control_collection/terms/shard1
   [junit4]   2> 1633272 INFO  (qtp1384838700-25679) [n:127.0.0.1:39725_z_ c:control_collection s:shard1  x:control_collection_shard1_replica_n1 ] o.a.s.c.ZkShardTerms Successful update of terms at /collections/control_collection/terms/shard1 to Terms{values={core_node2=0}, version=0}
   [junit4]   2> 1633272 INFO  (qtp1384838700-25679) [n:127.0.0.1:39725_z_ c:control_collection s:shard1  x:control_collection_shard1_replica_n1 ] o.a.s.c.ShardLeaderElectionContextBase make sure parent is created /collections/control_collection/leaders/shard1
   [junit4]   2> 1633272 DEBUG (qtp1384838700-25679) [n:127.0.0.1:39725_z_ c:control_collection s:shard1  x:control_collection_shard1_replica_n1 ] o.a.s.c.c.SolrZkClient makePath: /collections/control_collection/leaders/shard1
   [junit4]   2> 1633273 DEBUG (qtp1384838700-25679) [n:127.0.0.1:39725_z_ c:control_collection s:shard1  x:control_collection_shard1_replica_n1 ] o.a.s.c.c.SolrZkClient makePath: /collections/control_collection/leader_elect/shard1/election
   [junit4]   2> 1633276 INFO  (qtp1384838700-25679) [n:127.0.0.1:39725_z_ c:control_collection s:shard1  x:control_collection_shard1_replica_n1 ] o.a.s.c.ShardLeaderElectionContext Enough replicas found to continue.
   [junit4]   2> 1633276 INFO  (qtp1384838700-25679) [n:127.0.0.1:39725_z_ c:control_collection s:shard1  x:control_collection_shard1_replica_n1 ] o.a.s.c.ShardLeaderElectionContext I may be the new leader - try and sync
   [junit4]   2> 1633276 INFO  (qtp1384838700-25679) [n:127.0.0.1:39725_z_ c:control_collection s:shard1  x:control_collection_shard1_replica_n1 ] o.a.s.c.SyncStrategy Sync replicas to http://127.0.0.1:39725/z_/control_collection_shard1_replica_n1/
   [junit4]   2> 1633276 INFO  (qtp1384838700-25679) [n:127.0.0.1:39725_z_ c:control_collection s:shard1  x:control_collection_shard1_replica_n1 ] o.a.s.c.SyncStrategy Sync Success - now sync replicas to me
   [junit4]   2> 1633277 INFO  (qtp1384838700-25679) [n:127.0.0.1:39725_z_ c:control_collection s:shard1  x:control_collection_shard1_replica_n1 ] o.a.s.c.SyncStrategy http://127.0.0.1:39725/z_/control_collection_shard1_replica_n1/ has no replicas
   [junit4]   2> 1633277 INFO  (qtp1384838700-25679) [n:127.0.0.1:39725_z_ c:control_collection s:shard1  x:control_collection_shard1_replica_n1 ] o.a.s.c.ShardLeaderElectionContextBase Creating leader registration node /collections/control_collection/leaders/shard1/leader after winning as /collections/control_collection/leader_elect/shard1/election/72091888125476868-core_node2-n_0000000000
   [junit4]   2> 1633278 DEBUG (TEST-ShardSplitTest.testSplitLocking-seed#[3A754D0FE15400E]-EventThread) [     ] o.a.s.c.c.SolrZkClient Submitting job to respond to event WatchedEvent state:SyncConnected type:NodeChildrenChanged path:/overseer/queue
   [junit4]   2> 1633278 INFO  (qtp1384838700-25679) [n:127.0.0.1:39725_z_ c:control_collection s:shard1  x:control_collection_shard1_replica_n1 ] o.a.s.c.ShardLeaderElectionContext I am the new leader: http://127.0.0.1:39725/z_/control_collection_shard1_replica_n1/ shard1
   [junit4]   2> 1633279 DEBUG (qtp1384838700-25679) [n:127.0.0.1:39725_z_ c:control_collection s:shard1  x:control_collection_shard1_replica_n1 ] o.a.s.c.c.ZkStateReader already watching , added to stateWatchers
   [junit4]   2> 1633279 DEBUG (OverseerStateUpdate-72091888125476868-127.0.0.1:39725_z_-n_0000000000) [n:127.0.0.1:39725_z_     ] o.a.s.c.Overseer processMessage: queueSize: 1, message = {
   [junit4]   2>   "operation":"leader",
   [junit4]   2>   "shard":"shard1",
   [junit4]   2>   "collection":"control_collection",
   [junit4]   2>   "node_name":"127.0.0.1:39725_z_",
   [junit4]   2>   "base_url":"http://127.0.0.1:39725/z_",
   [junit4]   2>   "core":"control_collection_shard1_replica_n1",
   [junit4]   2>   "state":"active"} current state version: 0
   [junit4]   2> 1633280 DEBUG (qtp1384838700-25679) [n:127.0.0.1:39725_z_ c:control_collection s:shard1  x:control_collection_shard1_replica_n1 ] o.a.s.c.c.ZkStateReader Add data for [control_collection] ver [1]
   [junit4]   2> 1633280 DEBUG (qtp1384838700-25679) [n:127.0.0.1:39725_z_ c:control_collection s:shard1  x:control_collection_shard1_replica_n1 ] o.a.s.c.c.ZkStateReader clusterStateSet: legacy [0] interesting [1] watched [1] lazy [2] total [2]
   [junit4]   2> 1633281 DEBUG (qtp1384838700-25679) [n:127.0.0.1:39725_z_ c:control_collection s:shard1  x:control_collection_shard1_replica_n1 ] o.a.s.c.c.ZkStateReader updated per-replica states changed for: control_collection, ver: 0 , new vals: []
   [junit4]   2> 1633281 DEBUG (watches-16363-thread-1-processing-n:127.0.0.1:39725_z_ x:control_collection_shard1_replica_n1 c:control_collection s:shard1) [n:127.0.0.1:39725_z_ c:control_collection s:shard1  x:control_collection_shard1_replica_n1 ] o.a.s.c.c.ZkStateReader  CollectionStatePredicate failed for control_collection, cversion : -1
   [junit4]   2> 1633282 DEBUG (qtp1384838700-25679) [n:127.0.0.1:39725_z_ c:control_collection s:shard1  x:control_collection_shard1_replica_n1 ] o.a.s.c.c.ZkStateReader clusterStateSet: legacy [0] interesting [1] watched [1] lazy [2] total [2]
   [junit4]   2> 1633282 DEBUG (qtp1384838700-25679) [n:127.0.0.1:39725_z_ c:control_collection s:shard1  x:control_collection_shard1_replica_n1 ] o.a.s.c.c.ZkStateReader  CollectionStatePredicate failed for control_collection, cversion : -1
   [junit4]   2> 1633282 DEBUG (qtp1384838700-25679) [n:127.0.0.1:39725_z_ c:control_collection s:shard1  x:control_collection_shard1_replica_n1 ] o.a.s.c.c.ZkStateReader  CollectionStatePredicate failed for control_collection, cversion : -1
   [junit4]   2> 1633282 DEBUG (watches-16363-thread-1-processing-n:127.0.0.1:39725_z_ x:control_collection_shard1_replica_n1 c:control_collection s:shard1) [n:127.0.0.1:39725_z_ c:control_collection s:shard1  x:control_collection_shard1_replica_n1 ] o.a.s.c.c.ZkStateReader  CollectionStatePredicate failed for control_collection, cversion : -1
   [junit4]   2> 1633282 DEBUG (qtp1384838700-25679) [n:127.0.0.1:39725_z_ c:control_collection s:shard1  x:control_collection_shard1_replica_n1 ] o.a.s.c.c.ZkStateReader  CollectionStatePredicate failed for control_collection, cversion : -1
   [junit4]   2> 1633380 DEBUG (OverseerStateUpdate-72091888125476868-127.0.0.1:39725_z_-n_0000000000) [n:127.0.0.1:39725_z_     ] o.a.s.c.o.ZkStateWriter going to update_collection /collections/control_collection/state.json version: 1
   [junit4]   2> 1633380 DEBUG (TEST-ShardSplitTest.testSplitLocking-seed#[3A754D0FE15400E]-EventThread) [     ] o.a.s.c.c.SolrZkClient Submitting job to respond to event WatchedEvent state:SyncConnected type:NodeDataChanged path:/collections/control_collection/state.json
   [junit4]   2> 1633380 INFO  (zkCallback-16361-thread-1) [     ] o.a.s.c.c.ZkStateReader A cluster state change: [WatchedEvent state:SyncConnected type:NodeDataChanged path:/collections/control_collection/state.json] for collection [control_collection] has occurred - updating... (live nodes size: [1])
   [junit4]   2> 1633381 DEBUG (zkCallback-16361-thread-1) [     ] o.a.s.c.c.ZkStateReader Updating data for [control_collection] from [1] to [2]
   [junit4]   2> 1633381 DEBUG (zkCallback-16361-thread-1) [     ] o.a.s.c.c.ZkStateReader clusterStateSet: legacy [0] interesting [1] watched [1] lazy [2] total [2]
   [junit4]   2> 1633381 DEBUG (watches-16363-thread-1) [     ] o.a.s.c.c.ZkStateReader leader found for control_collection/shard1 to be core_node2:{
   [junit4]   2>   "core":"control_collection_shard1_replica_n1",
   [junit4]   2>   "node_name":"127.0.0.1:39725_z_",
   [junit4]   2>   "base_url":"http://127.0.0.1:39725/z_",
   [junit4]   2>   "state":"down",
   [junit4]   2>   "type":"NRT",
   [junit4]   2>   "leader":"true"}
   [junit4]   2> 1633381 DEBUG (TEST-ShardSplitTest.testSplitLocking-seed#[3A754D0FE15400E]-EventThread) [     ] o.a.s.c.c.SolrZkClient Submitting job to respond to event WatchedEvent state:SyncConnected type:NodeChildrenChanged path:/overseer/queue
   [junit4]   2> 1633381 DEBUG (watches-16363-thread-1) [     ] o.a.s.c.c.ZkStateReader clusterStateSet: legacy [0] interesting [0] watched [0] lazy [2] total [2]
   [junit4]   2> 1633382 INFO  (qtp1384838700-25679) [n:127.0.0.1:39725_z_ c:control_collection s:shard1  x:control_collection_shard1_replica_n1 ] o.a.s.c.ZkController I am the leader, no recovery necessary
   [junit4]   2> 1633382 DEBUG (TEST-ShardSplitTest.testSplitLocking-seed#[3A754D0FE15400E]-EventThread) [     ] o.a.s.c.c.SolrZkClient Submitting job to respond to event WatchedEvent state:SyncConnected type:NodeChildrenChanged path:/overseer/queue
   [junit4]   2> 1633382 DEBUG (qtp1384838700-25679) [n:127.0.0.1:39725_z_ c:control_collection s:shard1  x:control_collection_shard1_replica_n1 ] o.a.s.c.c.ZkStateReader Refreshing lazily-loaded state for collection control_collection
   [junit4]   2> 1633383 DEBUG (qtp1384838700-25679) [n:127.0.0.1:39725_z_ c:control_collection s:shard1  x:control_collection_shard1_replica_n1 ] o.a.s.c.c.ZkStateReader already watching , added to stateWatchers
   [junit4]   2> 1633383 DEBUG (OverseerStateUpdate-72091888125476868-127.0.0.1:39725_z_-n_0000000000) [n:127.0.0.1:39725_z_     ] o.a.s.c.Overseer processMessage: queueSize: 1, message = {
   [junit4]   2>   "core":"control_collection_shard1_replica_n1",
   [junit4]   2>   "core_node_name":"core_node2",
   [junit4]   2>   "roles":null,
   [junit4]   2>   "node_name":"127.0.0.1:39725_z_",
   [junit4]   2>   "base_url":"http://127.0.0.1:39725/z_",
   [junit4]   2>   "numShards":"1",
   [junit4]   2>   "state":"active",
   [junit4]   2>   "shard":"shard1",
   [junit4]   2>   "collection":"control_collection",
   [junit4]   2>   "type":"NRT",
   [junit4]   2>   "operation":"state"} current state version: 0
   [junit4]   2> 1633383 DEBUG (OverseerStateUpdate-72091888125476868-127.0.0.1:39725_z_-n_0000000000) [n:127.0.0.1:39725_z_     ] o.a.s.c.o.ReplicaMutator Update state numShards=1 message={
   [junit4]   2>   "core":"control_collection_shard1_replica_n1",
   [junit4]   2>   "core_node_name":"core_node2",
   [junit4]   2>   "roles":null,
   [junit4]   2>   "node_name":"127.0.0.1:39725_z_",
   [junit4]   2>   "base_url":"http://127.0.0.1:39725/z_",
   [junit4]   2>   "numShards":"1",
   [junit4]   2>   "state":"active",
   [junit4]   2>   "shard":"shard1",
   [junit4]   2>   "collection":"control_collection",
   [junit4]   2>   "type":"NRT",
   [junit4]   2>   "operation":"state"}
   [junit4]   2> 1633383 DEBUG (OverseerStateUpdate-72091888125476868-127.0.0.1:39725_z_-n_0000000000) [n:127.0.0.1:39725_z_     ] o.a.s.c.o.ReplicaMutator Will update state for replica: core_node2:{
   [junit4]   2>   "core":"control_collection_shard1_replica_n1",
   [junit4]   2>   "node_name":"127.0.0.1:39725_z_",
   [junit4]   2>   "base_url":"http://127.0.0.1:39725/z_",
   [junit4]   2>   "state":"active",
   [junit4]   2>   "type":"NRT",
   [junit4]   2>   "leader":"true"}
   [junit4]   2> 1633383 DEBUG (OverseerStateUpdate-72091888125476868-127.0.0.1:39725_z_-n_0000000000) [n:127.0.0.1:39725_z_     ] o.a.s.c.o.ReplicaMutator Collection is now: DocCollection(control_collection//collections/control_collection/state.json/2 )={
   [junit4]   2>   "pullReplicas":"0",
   [junit4]   2>   "replicationFactor":"1",
   [junit4]   2>   "router":{"name":"compositeId"},
   [junit4]   2>   "maxShardsPerNode":"1",
   [junit4]   2>   "autoAddReplicas":"false",
   [junit4]   2>   "nrtReplicas":"1",
   [junit4]   2>   "tlogReplicas":"0",
   [junit4]   2>   "shards":{"shard1":{
   [junit4]   2>       "range":"80000000-7fffffff",
   [junit4]   2>       "state":"active",
   [junit4]   2>       "replicas":{"core_node2":{
   [junit4]   2

[...truncated too long message...]

3bdbcb0001, likely server has closed socket
   [junit4]   2> 	at org.apache.zookeeper.ClientCnxnSocketNIO.doIO(ClientCnxnSocketNIO.java:77)
   [junit4]   2> org.apache.zookeeper.ClientCnxn$EndOfStreamException: Unable to read additional data from server sessionid 0x1001f3bdbcb0001, likely server has closed socket
   [junit4]   2> 	at org.apache.zookeeper.ClientCnxnSocketNIO.doIO(ClientCnxnSocketNIO.java:77) ~[zookeeper-3.6.2.jar:3.6.2]
   [junit4]   2> 	at org.apache.zookeeper.ClientCnxnSocketNIO.doTransport(ClientCnxnSocketNIO.java:350) ~[zookeeper-3.6.2.jar:3.6.2]
   [junit4]   2> 	at org.apache.zookeeper.ClientCnxn$SendThread.run(ClientCnxn.java:1275) [zookeeper-3.6.2.jar:3.6.2]
   [junit4]   2> 2370037 WARN  (ZkTestServer Run Thread) [     ] o.a.s.c.ZkTestServer Watch limit violations: 
   [junit4]   2> Maximum concurrent create/delete watches above limit:
   [junit4]   2> 
   [junit4]   2> 	7	/solr/collections/test_coll/terms/shard2
   [junit4]   2> 	7	/solr/collections/test_coll/terms/shard1
   [junit4]   2> 	6	/solr/aliases.json
   [junit4]   2> 	6	/solr/clusterprops.json
   [junit4]   2> 	5	/solr/packages.json
   [junit4]   2> 	5	/solr/security.json
   [junit4]   2> 	5	/solr/configs/conf
   [junit4]   2> 	4	/solr/collections/test_coll/collectionprops.json
   [junit4]   2> 	2	/solr/collections/.sys.COORDINATOR-COLL-conf/terms/shard1
   [junit4]   2> 
   [junit4]   2> Maximum concurrent data watches above limit:
   [junit4]   2> 
   [junit4]   2> 	19	/solr/collections/test_coll/state.json
   [junit4]   2> 	6	/solr/clusterstate.json
   [junit4]   2> 	5	/solr/collections/.sys.COORDINATOR-COLL-conf/state.json
   [junit4]   2> 	2	/solr/overseer_elect/election/72091935988973580-127.0.0.1:38009_solr-n_0000000002
   [junit4]   2> 	2	/solr/overseer_elect/election/72091935988973578-127.0.0.1:39863_solr-n_0000000001
   [junit4]   2> 
   [junit4]   2> Maximum concurrent children watches above limit:
   [junit4]   2> 
   [junit4]   2> 	37	/solr/overseer/queue
   [junit4]   2> 	28	/solr/live_nodes
   [junit4]   2> 	17	/solr/collections
   [junit4]   2> 	8	/solr/overseer/collection-queue-work
   [junit4]   2> 	7	/solr/collections/test_coll/state.json
   [junit4]   2> 	2	/solr/collections/.sys.COORDINATOR-COLL-conf/state.json
   [junit4]   2> 
   [junit4]   2> 2370041 INFO  (TEST-TestCoordinatorRole.testSimple-seed#[3A754D0FE15400E]) [     ] o.a.s.c.ZkTestServer waitForServerDown: 127.0.0.1:46567
   [junit4]   2> 2370041 INFO  (TEST-TestCoordinatorRole.testSimple-seed#[3A754D0FE15400E]) [     ] o.a.s.c.ZkTestServer parse host and port list: 127.0.0.1:46567
   [junit4]   2> 2370042 INFO  (TEST-TestCoordinatorRole.testSimple-seed#[3A754D0FE15400E]) [     ] o.a.s.c.ZkTestServer connecting to 127.0.0.1 46567
   [junit4]   2> 2370043 INFO  (TEST-TestCoordinatorRole.testSimple-seed#[3A754D0FE15400E]) [     ] o.a.s.SolrTestCaseJ4 ###Ending testSimple
   [junit4]   2> 2370043 INFO  (SUITE-TestCoordinatorRole-seed#[3A754D0FE15400E]-worker) [     ] o.a.s.c.ZkTestServer Shutting down ZkTestServer.
   [junit4]   2> 2370043 INFO  (SUITE-TestCoordinatorRole-seed#[3A754D0FE15400E]-worker) [     ] o.a.s.c.ZkTestServer waitForServerDown: 127.0.0.1:46567
   [junit4]   2> 2370043 INFO  (SUITE-TestCoordinatorRole-seed#[3A754D0FE15400E]-worker) [     ] o.a.s.c.ZkTestServer parse host and port list: 127.0.0.1:46567
   [junit4]   2> 2370043 INFO  (SUITE-TestCoordinatorRole-seed#[3A754D0FE15400E]-worker) [     ] o.a.s.c.ZkTestServer connecting to 127.0.0.1 46567
   [junit4]   2> 2370044 INFO  (SUITE-TestCoordinatorRole-seed#[3A754D0FE15400E]-worker) [     ] o.a.s.u.ErrorLogMuter Closing ErrorLogMuter-regex-538 after mutting 0 log messages
   [junit4]   2> 2370044 INFO  (SUITE-TestCoordinatorRole-seed#[3A754D0FE15400E]-worker) [     ] o.a.s.u.ErrorLogMuter Creating ErrorLogMuter-regex-539 for ERROR logs matching regex: ignore_exception
   [junit4]   2> NOTE: leaving temporary files on disk at: /home/jenkins/jenkins-slave/workspace/Lucene/Lucene-Solr-Tests-8.11/solr/build/solr-core/test/J3/temp/solr.search.TestCoordinatorRole_3A754D0FE15400E-001
   [junit4]   2> Apr 20, 2024 6:23:12 PM com.carrotsearch.randomizedtesting.ThreadLeakControl checkThreadLeaks
   [junit4]   2> WARNING: Will linger awaiting termination of 1 leaked thread(s).
   [junit4]   2> NOTE: test params are: codec=Asserting(Lucene87): {_version_=PostingsFormat(name=LuceneVarGapFixedInterval), _root_=PostingsFormat(name=LuceneVarGapFixedInterval), id=PostingsFormat(name=Asserting), desc_s=PostingsFormat(name=Asserting)}, docValues:{_version_=DocValuesFormat(name=Lucene80)}, maxPointsInLeafNode=80, maxMBSortInHeap=7.048781351112131, sim=Asserting(RandomSimilarity(queryNorm=false): {}), locale=de-LU, timezone=Europe/Oslo
   [junit4]   2> NOTE: Linux 4.15.0-213-generic amd64/Temurin 1.8.0_362 (64-bit)/cpus=4,threads=1,free=87531344,total=514850816
   [junit4]   2> NOTE: All tests run in this JVM: [TestUtils, MissingSegmentRecoveryTest, TestUtilizeNode, HighlighterTest, TestStressIncrementalBackup, AddReplicaTest, TestDelegationWithHadoopAuth, SuggesterTest, TestSolrCloudWithSecureImpersonation, ChangedSchemaMergeTest, BadComponentTest, PolyFieldTest, DocumentAnalysisRequestHandlerTest, TestQueryingOnDownCollection, TestFieldCacheSortRandom, TestDeprecatedFilters, LargeFieldTest, SolrXmlInZkTest, HttpPartitionWithTlogReplicasTest, DeleteLastCustomShardedReplicaTest, TestSolrCoreSnapshots, RootFieldTest, FacetPivot2CollectionsTest, RollingRestartTest, TestSolrCLIRunExample, TestAuthorizationFramework, TestCoreContainer, ResponseLogComponentTest, DirectoryFactoryTest, TestSchemaNameResource, TestJavabinTupleStreamParser, AuthWithShardHandlerFactoryOverrideTest, V2StandaloneTest, SparseHLLTest, HdfsChaosMonkeyNothingIsSafeTest, TestSolrXml, CachingDirectoryFactoryTest, CoreAdminRequestStatusTest, IndexSizeTriggerMixedBoundsTest, TestCloudPhrasesIdentificationComponent, TestNoOpRegenerator, TestZkAclsWithHadoopAuth, TestSubQueryTransformerDistrib, AlternateDirectoryTest, ComputePlanActionTest, TestSimGenericDistributedQueue, TestRequestForwarding, HdfsRecoveryZkTest, ZkCLITest, TestHdfsUpdateLog, TestMaxTokenLenTokenizer, TestStreamBody, TestNestedDocsSort, StatelessScriptUpdateProcessorFactoryTest, TestMaxScoreQueryParser, TestSolr4Spatial, IndexSizeEstimatorTest, TestConfigOverlay, CloudExitableDirectoryReaderTest, BJQParserTest, TestReqParamsAPI, TestDistributedGrouping, TestComplexPhraseLeadingWildcard, TestStandardQParsers, DeleteStatusTest, SolrIndexMetricsTest, TestRandomCollapseQParserPlugin, TestSolrFieldCacheBean, RankFieldTest, NoCacheHeaderTest, SystemLogListenerTest, TestCustomSort, AutoscalingHistoryHandlerTest, TestBlendedInfixSuggestions, TestSimDistribStateManager, SignificantTermsQParserPluginTest, CdcrWithNodesRestartsTest, TestBooleanSimilarityFactory, SolrTestCaseJ4DeleteCoreTest, TestFastLRUCache, TestSolrConfigHandler, TestRequestStatusCollectionAPI, TestInfoStreamLogging, PhrasesIdentificationComponentTest, MetricTriggerTest, StatsComponentTest, CursorPagingTest, SolrPluginUtilsTest, FieldMutatingUpdateProcessorTest, TestNamedUpdateProcessors, TestNonDefinedSimilarityFactory, TestManagedSchemaThreadSafety, TestQuerySenderNoQuery, TestSuggestSpellingConverter, RecoveryAfterSoftCommitTest, DefaultValueUpdateProcessorTest, ChaosMonkeySafeLeaderTest, FullHLLTest, SOLR749Test, JvmMetricsTest, TestSizeLimitedDistributedMap, TestLeaderElectionZkExpiry, NodeLostTriggerTest, DebugComponentTest, OverseerTaskQueueTest, ImplicitSnitchTest, TestIBSimilarityFactory, BasicDistributedZkTest, NestedAtomicUpdateTest, V2CollectionBackupsAPIMappingTest, OrderedExecutorTest, HdfsTlogReplayBufferedWhileIndexingTest, TestDocTermOrdsUninvertLimit, LeaderFailoverAfterPartitionTest, DistributedFacetPivotWhiteBoxTest, TestJsonRequest, DeleteNodeTest, DeleteReplicaTest, HttpPartitionOnCommitTest, LeaderElectionTest, LeaderTragicEventTest, LegacyCloudClusterPropTest, MetricsHistoryIntegrationTest, MetricsHistoryWithAuthIntegrationTest, MigrateRouteKeyTest, SplitShardTest, SystemCollectionCompatTest, TestCloudConsistency, TestDeleteCollectionOnDownNodes, TestLockTree, TestMiniSolrCloudClusterSSL, TestStressCloudBlindAtomicUpdates, TestStressLiveNodes, TestHdfsCloudBackupRestore, TestReplicaProperties, MetricTriggerIntegrationTest, NodeAddedTriggerIntegrationTest, NodeLostTriggerIntegrationTest, NodeMarkersRegistrationTest, ScheduledMaintenanceTriggerTest, ScheduledTriggerIntegrationTest, ScheduledTriggerTest, SearchRateTriggerIntegrationTest, SearchRateTriggerTest, TriggerEventQueueTest, TriggerIntegrationTest, CdcrOpsAndBoundariesTest, HDFSCollectionsAPITest, ZkStateReaderTest, ConfigureRecoveryStrategyTest, CoreSorterTest, DirectoryFactoriesTest, QueryResultKeyTest, TestCoreDiscovery, TestImplicitCoreProperties, TestInitParams, TestLazyCores, TestConfigReload, TestIncrementalCoreBackup, CoreMergeIndexesAdminHandlerTest, DaemonStreamApiTest, MetricsHandlerTest, SecurityConfHandlerTest, SplitHandlerTest, SystemInfoHandlerTest, TestApiFramework, TestCollectionAPIs, TestConfigsApi, TestCoreAdminApis, DistributedDebugComponentTest, DistributedFacetPivotLargeTest, DistributedMLTComponentTest, DistributedSpellCheckComponentTest, SpellCheckComponentTest, TestExpandComponent, TestPivotHelperCode, TestTrackingShardHandlerFactory, RandomizedTaggerTest, TaggingAttributeTest, XmlInterpolationTest, TestPostingsSolrHighlighter, CheckHdfsIndexTest, JSONWriterTest, TestCSVResponseWriter, TestRawTransformer, TestRetrieveFieldsOptimizer, TestSubQueryTransformer, TestCopyFieldCollectionResource, TestDynamicFieldResource, TestSerializedLuceneMatchVersion, DateRangeFieldTest, DocValuesMissingTest, DocValuesMultiTest, DocValuesTest, TestCollationFieldDocValues, TestSchemaManager, TestUseDocValuesAsStored, QueryParsingTest, RankQueryTest, ReturnFieldsTest, SortSpecParsingTest, TestCoordinatorRole]
   [junit4] Completed [856/959 (2!)] on J3 in 156.55s, 8 tests, 1 failure <<< FAILURES!

[...truncated 54628 lines...]

[JENKINS] Lucene » Lucene-Solr-Tests-8.11 - Build # 806 - Still Unstable!

Posted by Apache Jenkins Server <je...@builds.apache.org>.
Build: https://ci-builds.apache.org/job/Lucene/job/Lucene-Solr-Tests-8.11/806/

1 tests failed.
FAILED:  org.apache.solr.cloud.api.collections.ShardSplitTest.testSplitMixedReplicaTypes

Error Message:
Timeout occurred while waiting response from server at: http://127.0.0.1:39219/od_bj/qz

Stack Trace:
org.apache.solr.client.solrj.SolrServerException: Timeout occurred while waiting response from server at: http://127.0.0.1:39219/od_bj/qz
	at __randomizedtesting.SeedInfo.seed([3FD002A4FD03900C:8713560401D84579]:0)
	at org.apache.solr.client.solrj.impl.HttpSolrClient.executeMethod(HttpSolrClient.java:692)
	at org.apache.solr.client.solrj.impl.HttpSolrClient.request(HttpSolrClient.java:266)
	at org.apache.solr.client.solrj.impl.HttpSolrClient.request(HttpSolrClient.java:248)
	at org.apache.solr.client.solrj.impl.LBSolrClient.doRequest(LBSolrClient.java:369)
	at org.apache.solr.client.solrj.impl.LBSolrClient.request(LBSolrClient.java:297)
	at org.apache.solr.client.solrj.impl.BaseCloudSolrClient.sendRequest(BaseCloudSolrClient.java:1188)
	at org.apache.solr.client.solrj.impl.BaseCloudSolrClient.requestWithRetryOnStaleState(BaseCloudSolrClient.java:934)
	at org.apache.solr.client.solrj.impl.BaseCloudSolrClient.request(BaseCloudSolrClient.java:866)
	at org.apache.solr.client.solrj.SolrRequest.process(SolrRequest.java:225)
	at org.apache.solr.client.solrj.SolrRequest.process(SolrRequest.java:242)
	at org.apache.solr.cloud.api.collections.ShardSplitTest.doSplitMixedReplicaTypes(ShardSplitTest.java:365)
	at org.apache.solr.cloud.api.collections.ShardSplitTest.testSplitMixedReplicaTypes(ShardSplitTest.java:350)
	at sun.reflect.NativeMethodAccessorImpl.invoke0(Native Method)
	at sun.reflect.NativeMethodAccessorImpl.invoke(NativeMethodAccessorImpl.java:62)
	at sun.reflect.DelegatingMethodAccessorImpl.invoke(DelegatingMethodAccessorImpl.java:43)
	at java.lang.reflect.Method.invoke(Method.java:498)
	at com.carrotsearch.randomizedtesting.RandomizedRunner.invoke(RandomizedRunner.java:1758)
	at com.carrotsearch.randomizedtesting.RandomizedRunner$8.evaluate(RandomizedRunner.java:946)
	at com.carrotsearch.randomizedtesting.RandomizedRunner$9.evaluate(RandomizedRunner.java:982)
	at com.carrotsearch.randomizedtesting.RandomizedRunner$10.evaluate(RandomizedRunner.java:996)
	at org.apache.solr.BaseDistributedSearchTestCase$ShardsRepeatRule$ShardsFixedStatement.callStatement(BaseDistributedSearchTestCase.java:1084)
	at org.apache.solr.BaseDistributedSearchTestCase$ShardsRepeatRule$ShardsStatement.evaluate(BaseDistributedSearchTestCase.java:1055)
	at com.carrotsearch.randomizedtesting.rules.SystemPropertiesRestoreRule$1.evaluate(SystemPropertiesRestoreRule.java:80)
	at org.junit.rules.RunRules.evaluate(RunRules.java:20)
	at org.apache.lucene.util.TestRuleSetupTeardownChained$1.evaluate(TestRuleSetupTeardownChained.java:49)
	at org.apache.lucene.util.AbstractBeforeAfterRule$1.evaluate(AbstractBeforeAfterRule.java:45)
	at org.apache.lucene.util.TestRuleThreadAndTestName$1.evaluate(TestRuleThreadAndTestName.java:48)
	at org.apache.lucene.util.TestRuleIgnoreAfterMaxFailures$1.evaluate(TestRuleIgnoreAfterMaxFailures.java:64)
	at org.apache.lucene.util.TestRuleMarkFailure$1.evaluate(TestRuleMarkFailure.java:47)
	at org.junit.rules.RunRules.evaluate(RunRules.java:20)
	at com.carrotsearch.randomizedtesting.rules.StatementAdapter.evaluate(StatementAdapter.java:36)
	at com.carrotsearch.randomizedtesting.ThreadLeakControl$StatementRunner.run(ThreadLeakControl.java:390)
	at com.carrotsearch.randomizedtesting.ThreadLeakControl.forkTimeoutingTask(ThreadLeakControl.java:843)
	at com.carrotsearch.randomizedtesting.ThreadLeakControl$3.evaluate(ThreadLeakControl.java:490)
	at com.carrotsearch.randomizedtesting.RandomizedRunner.runSingleTest(RandomizedRunner.java:955)
	at com.carrotsearch.randomizedtesting.RandomizedRunner$5.evaluate(RandomizedRunner.java:840)
	at com.carrotsearch.randomizedtesting.RandomizedRunner$6.evaluate(RandomizedRunner.java:891)
	at com.carrotsearch.randomizedtesting.RandomizedRunner$7.evaluate(RandomizedRunner.java:902)
	at com.carrotsearch.randomizedtesting.rules.StatementAdapter.evaluate(StatementAdapter.java:36)
	at com.carrotsearch.randomizedtesting.rules.SystemPropertiesRestoreRule$1.evaluate(SystemPropertiesRestoreRule.java:80)
	at org.junit.rules.RunRules.evaluate(RunRules.java:20)
	at org.apache.lucene.util.AbstractBeforeAfterRule$1.evaluate(AbstractBeforeAfterRule.java:45)
	at com.carrotsearch.randomizedtesting.rules.StatementAdapter.evaluate(StatementAdapter.java:36)
	at org.apache.lucene.util.TestRuleStoreClassName$1.evaluate(TestRuleStoreClassName.java:41)
	at com.carrotsearch.randomizedtesting.rules.NoShadowingOrOverridesOnMethodsRule$1.evaluate(NoShadowingOrOverridesOnMethodsRule.java:40)
	at com.carrotsearch.randomizedtesting.rules.NoShadowingOrOverridesOnMethodsRule$1.evaluate(NoShadowingOrOverridesOnMethodsRule.java:40)
	at com.carrotsearch.randomizedtesting.rules.StatementAdapter.evaluate(StatementAdapter.java:36)
	at com.carrotsearch.randomizedtesting.rules.StatementAdapter.evaluate(StatementAdapter.java:36)
	at com.carrotsearch.randomizedtesting.rules.StatementAdapter.evaluate(StatementAdapter.java:36)
	at org.apache.lucene.util.TestRuleAssertionsRequired$1.evaluate(TestRuleAssertionsRequired.java:53)
	at org.apache.lucene.util.TestRuleMarkFailure$1.evaluate(TestRuleMarkFailure.java:47)
	at org.apache.lucene.util.TestRuleIgnoreAfterMaxFailures$1.evaluate(TestRuleIgnoreAfterMaxFailures.java:64)
	at org.apache.lucene.util.TestRuleIgnoreTestSuites$1.evaluate(TestRuleIgnoreTestSuites.java:54)
	at org.junit.rules.RunRules.evaluate(RunRules.java:20)
	at com.carrotsearch.randomizedtesting.rules.StatementAdapter.evaluate(StatementAdapter.java:36)
	at com.carrotsearch.randomizedtesting.ThreadLeakControl$StatementRunner.run(ThreadLeakControl.java:390)
	at com.carrotsearch.randomizedtesting.ThreadLeakControl.lambda$forkTimeoutingTask$0(ThreadLeakControl.java:850)
	at java.lang.Thread.run(Thread.java:750)
Caused by: java.net.SocketTimeoutException: Read timed out
	at java.net.SocketInputStream.socketRead0(Native Method)
	at java.net.SocketInputStream.socketRead(SocketInputStream.java:116)
	at java.net.SocketInputStream.read(SocketInputStream.java:171)
	at java.net.SocketInputStream.read(SocketInputStream.java:141)
	at org.apache.http.impl.io.SessionInputBufferImpl.streamRead(SessionInputBufferImpl.java:137)
	at org.apache.http.impl.io.SessionInputBufferImpl.fillBuffer(SessionInputBufferImpl.java:153)
	at org.apache.http.impl.io.SessionInputBufferImpl.readLine(SessionInputBufferImpl.java:280)
	at org.apache.http.impl.conn.DefaultHttpResponseParser.parseHead(DefaultHttpResponseParser.java:138)
	at org.apache.http.impl.conn.DefaultHttpResponseParser.parseHead(DefaultHttpResponseParser.java:56)
	at org.apache.http.impl.io.AbstractMessageParser.parse(AbstractMessageParser.java:259)
	at org.apache.http.impl.DefaultBHttpClientConnection.receiveResponseHeader(DefaultBHttpClientConnection.java:163)
	at org.apache.http.impl.conn.CPoolProxy.receiveResponseHeader(CPoolProxy.java:157)
	at org.apache.http.protocol.HttpRequestExecutor.doReceiveResponse(HttpRequestExecutor.java:273)
	at org.apache.http.protocol.HttpRequestExecutor.execute(HttpRequestExecutor.java:125)
	at org.apache.http.impl.execchain.MainClientExec.execute(MainClientExec.java:272)
	at org.apache.http.impl.execchain.ProtocolExec.execute(ProtocolExec.java:186)
	at org.apache.http.impl.execchain.RetryExec.execute(RetryExec.java:89)
	at org.apache.http.impl.execchain.RedirectExec.execute(RedirectExec.java:110)
	at org.apache.http.impl.client.InternalHttpClient.doExecute(InternalHttpClient.java:185)
	at org.apache.http.impl.client.CloseableHttpClient.execute(CloseableHttpClient.java:83)
	at org.apache.http.impl.client.CloseableHttpClient.execute(CloseableHttpClient.java:56)
	at org.apache.solr.client.solrj.impl.HttpSolrClient.executeMethod(HttpSolrClient.java:571)
	... 57 more




Build Log:
[...truncated 15679 lines...]
   [junit4] Suite: org.apache.solr.cloud.api.collections.ShardSplitTest
   [junit4]   2> 1652559 INFO  (SUITE-ShardSplitTest-seed#[3FD002A4FD03900C]-worker) [     ] o.a.s.SolrTestCase Setting 'solr.default.confdir' system property to test-framework derived value of '/home/jenkins/jenkins-slave/workspace/Lucene/Lucene-Solr-Tests-8.11/solr/server/solr/configsets/_default/conf'
   [junit4]   2> 1652559 INFO  (SUITE-ShardSplitTest-seed#[3FD002A4FD03900C]-worker) [     ] o.a.s.SolrTestCaseJ4 SecureRandom sanity checks: test.solr.allowed.securerandom=null & java.security.egd=file:/dev/./urandom
   [junit4]   2> 1652560 INFO  (SUITE-ShardSplitTest-seed#[3FD002A4FD03900C]-worker) [     ] o.a.s.u.ErrorLogMuter Closing ErrorLogMuter-regex-21304 after mutting 0 log messages
   [junit4]   2> 1652560 INFO  (SUITE-ShardSplitTest-seed#[3FD002A4FD03900C]-worker) [     ] o.a.s.u.ErrorLogMuter Creating ErrorLogMuter-regex-21305 for ERROR logs matching regex: ignore_exception
   [junit4]   2> 1652561 INFO  (SUITE-ShardSplitTest-seed#[3FD002A4FD03900C]-worker) [     ] o.a.s.SolrTestCaseJ4 Created dataDir: /home/jenkins/jenkins-slave/workspace/Lucene/Lucene-Solr-Tests-8.11/solr/build/solr-core/test/J3/temp/solr.cloud.api.collections.ShardSplitTest_3FD002A4FD03900C-001/data-dir-129-001
   [junit4]   2> 1652561 INFO  (SUITE-ShardSplitTest-seed#[3FD002A4FD03900C]-worker) [     ] o.a.s.SolrTestCaseJ4 Using PointFields (NUMERIC_POINTS_SYSPROP=true) w/NUMERIC_DOCVALUES_SYSPROP=true
   [junit4]   2> 1652562 INFO  (SUITE-ShardSplitTest-seed#[3FD002A4FD03900C]-worker) [     ] o.a.s.SolrTestCaseJ4 Randomized ssl (false) and clientAuth (false) via: @org.apache.solr.SolrTestCaseJ4$SuppressSSL(bugUrl=https://issues.apache.org/jira/browse/SOLR-5776)
   [junit4]   2> 1652562 INFO  (SUITE-ShardSplitTest-seed#[3FD002A4FD03900C]-worker) [     ] o.a.s.BaseDistributedSearchTestCase Setting hostContext system property: /od_bj/qz
   [junit4] IGNOR/A 0.00s J3 | ShardSplitTest.test
   [junit4]    > Assumption #1: 'nightly' test group is disabled (@Nightly())
   [junit4] IGNOR/A 0.00s J3 | ShardSplitTest.testSplitWithChaosMonkey
   [junit4]    > Assumption #1: 'nightly' test group is disabled (@Nightly())
   [junit4]   2> 1652567 INFO  (TEST-ShardSplitTest.testSplitLocking-seed#[3FD002A4FD03900C]) [     ] o.a.s.u.ErrorLogMuter Closing ErrorLogMuter-regex-21305 after mutting 0 log messages
   [junit4]   2> 1652567 INFO  (TEST-ShardSplitTest.testSplitLocking-seed#[3FD002A4FD03900C]) [     ] o.a.s.u.ErrorLogMuter Creating ErrorLogMuter-regex-21306 for ERROR logs matching regex: ignore_exception
   [junit4]   2> 1652568 INFO  (TEST-ShardSplitTest.testSplitLocking-seed#[3FD002A4FD03900C]) [     ] o.a.s.c.ZkTestServer STARTING ZK TEST SERVER
   [junit4]   2> 1652568 INFO  (ZkTestServer Run Thread) [     ] o.a.s.c.ZkTestServer client port: 0.0.0.0/0.0.0.0:0
   [junit4]   2> 1652568 INFO  (ZkTestServer Run Thread) [     ] o.a.s.c.ZkTestServer Starting server
   [junit4]   2> 1652569 WARN  (ZkTestServer Run Thread) [     ] o.a.z.s.ServerCnxnFactory maxCnxns is not configured, using default value 0.
   [junit4]   2> 1652668 INFO  (TEST-ShardSplitTest.testSplitLocking-seed#[3FD002A4FD03900C]) [     ] o.a.s.c.ZkTestServer start zk server on port: 39003
   [junit4]   2> 1652668 INFO  (TEST-ShardSplitTest.testSplitLocking-seed#[3FD002A4FD03900C]) [     ] o.a.s.c.ZkTestServer waitForServerUp: 127.0.0.1:39003
   [junit4]   2> 1652668 INFO  (TEST-ShardSplitTest.testSplitLocking-seed#[3FD002A4FD03900C]) [     ] o.a.s.c.ZkTestServer parse host and port list: 127.0.0.1:39003
   [junit4]   2> 1652668 INFO  (TEST-ShardSplitTest.testSplitLocking-seed#[3FD002A4FD03900C]) [     ] o.a.s.c.ZkTestServer connecting to 127.0.0.1 39003
   [junit4]   2> 1652669 DEBUG (TEST-ShardSplitTest.testSplitLocking-seed#[3FD002A4FD03900C]) [     ] o.a.s.c.c.SolrZkClient Using default ZkCredentialsProvider
   [junit4]   2> 1652670 INFO  (TEST-ShardSplitTest.testSplitLocking-seed#[3FD002A4FD03900C]) [     ] o.a.s.c.c.ConnectionManager Waiting for client to connect to ZooKeeper
   [junit4]   2> 1652674 DEBUG (TEST-ShardSplitTest.testSplitLocking-seed#[3FD002A4FD03900C]-EventThread) [     ] o.a.s.c.c.SolrZkClient Submitting job to respond to event WatchedEvent state:SyncConnected type:None path:null
   [junit4]   2> 1652675 DEBUG (zkConnectionManagerCallback-16084-thread-1) [     ] o.a.s.c.c.ConnectionManager Watcher org.apache.solr.common.cloud.ConnectionManager@75bdf54a name: ZooKeeperConnection Watcher:127.0.0.1:39003 got event WatchedEvent state:SyncConnected type:None path:null path: null type: None
   [junit4]   2> 1652675 INFO  (zkConnectionManagerCallback-16084-thread-1) [     ] o.a.s.c.c.ConnectionManager zkClient has connected
   [junit4]   2> 1652675 INFO  (TEST-ShardSplitTest.testSplitLocking-seed#[3FD002A4FD03900C]) [     ] o.a.s.c.c.ConnectionManager Client is connected to ZooKeeper
   [junit4]   2> 1652675 DEBUG (TEST-ShardSplitTest.testSplitLocking-seed#[3FD002A4FD03900C]) [     ] o.a.s.c.c.SolrZkClient Using default ZkACLProvider
   [junit4]   2> 1652681 DEBUG (TEST-ShardSplitTest.testSplitLocking-seed#[3FD002A4FD03900C]) [     ] o.a.s.c.c.SolrZkClient makePath: /solr
   [junit4]   2> 1652682 DEBUG (TEST-ShardSplitTest.testSplitLocking-seed#[3FD002A4FD03900C]) [     ] o.a.s.c.c.SolrZkClient Using default ZkCredentialsProvider
   [junit4]   2> 1652682 INFO  (TEST-ShardSplitTest.testSplitLocking-seed#[3FD002A4FD03900C]) [     ] o.a.s.c.c.ConnectionManager Waiting for client to connect to ZooKeeper
   [junit4]   2> 1652683 DEBUG (TEST-ShardSplitTest.testSplitLocking-seed#[3FD002A4FD03900C]-EventThread) [     ] o.a.s.c.c.SolrZkClient Submitting job to respond to event WatchedEvent state:SyncConnected type:None path:null
   [junit4]   2> 1652685 DEBUG (zkConnectionManagerCallback-16086-thread-1) [     ] o.a.s.c.c.ConnectionManager Watcher org.apache.solr.common.cloud.ConnectionManager@8745e20 name: ZooKeeperConnection Watcher:127.0.0.1:39003/solr got event WatchedEvent state:SyncConnected type:None path:null path: null type: None
   [junit4]   2> 1652685 INFO  (zkConnectionManagerCallback-16086-thread-1) [     ] o.a.s.c.c.ConnectionManager zkClient has connected
   [junit4]   2> 1652685 INFO  (TEST-ShardSplitTest.testSplitLocking-seed#[3FD002A4FD03900C]) [     ] o.a.s.c.c.ConnectionManager Client is connected to ZooKeeper
   [junit4]   2> 1652685 DEBUG (TEST-ShardSplitTest.testSplitLocking-seed#[3FD002A4FD03900C]) [     ] o.a.s.c.c.SolrZkClient Using default ZkACLProvider
   [junit4]   2> 1652686 DEBUG (TEST-ShardSplitTest.testSplitLocking-seed#[3FD002A4FD03900C]) [     ] o.a.s.c.c.SolrZkClient makePath: /clusterprops.json
   [junit4]   2> 1652686 INFO  (TEST-ShardSplitTest.testSplitLocking-seed#[3FD002A4FD03900C]) [     ] o.a.s.c.ZkTestServer put /home/jenkins/jenkins-slave/workspace/Lucene/Lucene-Solr-Tests-8.11/solr/core/src/test-files/solr/collection1/conf/solrconfig-tlog.xml to /configs/conf1/solrconfig.xml
   [junit4]   2> 1652686 DEBUG (TEST-ShardSplitTest.testSplitLocking-seed#[3FD002A4FD03900C]) [     ] o.a.s.c.c.SolrZkClient makePath: /configs/conf1/solrconfig.xml
   [junit4]   2> 1652688 INFO  (TEST-ShardSplitTest.testSplitLocking-seed#[3FD002A4FD03900C]) [     ] o.a.s.c.ZkTestServer put /home/jenkins/jenkins-slave/workspace/Lucene/Lucene-Solr-Tests-8.11/solr/core/src/test-files/solr/collection1/conf/schema15.xml to /configs/conf1/schema.xml
   [junit4]   2> 1652688 DEBUG (TEST-ShardSplitTest.testSplitLocking-seed#[3FD002A4FD03900C]) [     ] o.a.s.c.c.SolrZkClient makePath: /configs/conf1/schema.xml
   [junit4]   2> 1652690 INFO  (TEST-ShardSplitTest.testSplitLocking-seed#[3FD002A4FD03900C]) [     ] o.a.s.c.ZkTestServer put /home/jenkins/jenkins-slave/workspace/Lucene/Lucene-Solr-Tests-8.11/solr/core/src/test-files/solr/collection1/conf/solrconfig.snippet.randomindexconfig.xml to /configs/conf1/solrconfig.snippet.randomindexconfig.xml
   [junit4]   2> 1652690 DEBUG (TEST-ShardSplitTest.testSplitLocking-seed#[3FD002A4FD03900C]) [     ] o.a.s.c.c.SolrZkClient makePath: /configs/conf1/solrconfig.snippet.randomindexconfig.xml
   [junit4]   2> 1652691 INFO  (TEST-ShardSplitTest.testSplitLocking-seed#[3FD002A4FD03900C]) [     ] o.a.s.c.ZkTestServer put /home/jenkins/jenkins-slave/workspace/Lucene/Lucene-Solr-Tests-8.11/solr/core/src/test-files/solr/collection1/conf/stopwords.txt to /configs/conf1/stopwords.txt
   [junit4]   2> 1652691 DEBUG (TEST-ShardSplitTest.testSplitLocking-seed#[3FD002A4FD03900C]) [     ] o.a.s.c.c.SolrZkClient makePath: /configs/conf1/stopwords.txt
   [junit4]   2> 1652692 INFO  (TEST-ShardSplitTest.testSplitLocking-seed#[3FD002A4FD03900C]) [     ] o.a.s.c.ZkTestServer put /home/jenkins/jenkins-slave/workspace/Lucene/Lucene-Solr-Tests-8.11/solr/core/src/test-files/solr/collection1/conf/protwords.txt to /configs/conf1/protwords.txt
   [junit4]   2> 1652692 DEBUG (TEST-ShardSplitTest.testSplitLocking-seed#[3FD002A4FD03900C]) [     ] o.a.s.c.c.SolrZkClient makePath: /configs/conf1/protwords.txt
   [junit4]   2> 1652694 INFO  (TEST-ShardSplitTest.testSplitLocking-seed#[3FD002A4FD03900C]) [     ] o.a.s.c.ZkTestServer put /home/jenkins/jenkins-slave/workspace/Lucene/Lucene-Solr-Tests-8.11/solr/core/src/test-files/solr/collection1/conf/currency.xml to /configs/conf1/currency.xml
   [junit4]   2> 1652694 DEBUG (TEST-ShardSplitTest.testSplitLocking-seed#[3FD002A4FD03900C]) [     ] o.a.s.c.c.SolrZkClient makePath: /configs/conf1/currency.xml
   [junit4]   2> 1652696 INFO  (TEST-ShardSplitTest.testSplitLocking-seed#[3FD002A4FD03900C]) [     ] o.a.s.c.ZkTestServer put /home/jenkins/jenkins-slave/workspace/Lucene/Lucene-Solr-Tests-8.11/solr/core/src/test-files/solr/collection1/conf/enumsConfig.xml to /configs/conf1/enumsConfig.xml
   [junit4]   2> 1652696 DEBUG (TEST-ShardSplitTest.testSplitLocking-seed#[3FD002A4FD03900C]) [     ] o.a.s.c.c.SolrZkClient makePath: /configs/conf1/enumsConfig.xml
   [junit4]   2> 1652697 INFO  (TEST-ShardSplitTest.testSplitLocking-seed#[3FD002A4FD03900C]) [     ] o.a.s.c.ZkTestServer put /home/jenkins/jenkins-slave/workspace/Lucene/Lucene-Solr-Tests-8.11/solr/core/src/test-files/solr/collection1/conf/open-exchange-rates.json to /configs/conf1/open-exchange-rates.json
   [junit4]   2> 1652697 DEBUG (TEST-ShardSplitTest.testSplitLocking-seed#[3FD002A4FD03900C]) [     ] o.a.s.c.c.SolrZkClient makePath: /configs/conf1/open-exchange-rates.json
   [junit4]   2> 1652699 INFO  (TEST-ShardSplitTest.testSplitLocking-seed#[3FD002A4FD03900C]) [     ] o.a.s.c.ZkTestServer put /home/jenkins/jenkins-slave/workspace/Lucene/Lucene-Solr-Tests-8.11/solr/core/src/test-files/solr/collection1/conf/mapping-ISOLatin1Accent.txt to /configs/conf1/mapping-ISOLatin1Accent.txt
   [junit4]   2> 1652699 DEBUG (TEST-ShardSplitTest.testSplitLocking-seed#[3FD002A4FD03900C]) [     ] o.a.s.c.c.SolrZkClient makePath: /configs/conf1/mapping-ISOLatin1Accent.txt
   [junit4]   2> 1652700 INFO  (TEST-ShardSplitTest.testSplitLocking-seed#[3FD002A4FD03900C]) [     ] o.a.s.c.ZkTestServer put /home/jenkins/jenkins-slave/workspace/Lucene/Lucene-Solr-Tests-8.11/solr/core/src/test-files/solr/collection1/conf/old_synonyms.txt to /configs/conf1/old_synonyms.txt
   [junit4]   2> 1652700 DEBUG (TEST-ShardSplitTest.testSplitLocking-seed#[3FD002A4FD03900C]) [     ] o.a.s.c.c.SolrZkClient makePath: /configs/conf1/old_synonyms.txt
   [junit4]   2> 1652701 INFO  (TEST-ShardSplitTest.testSplitLocking-seed#[3FD002A4FD03900C]) [     ] o.a.s.c.ZkTestServer put /home/jenkins/jenkins-slave/workspace/Lucene/Lucene-Solr-Tests-8.11/solr/core/src/test-files/solr/collection1/conf/synonyms.txt to /configs/conf1/synonyms.txt
   [junit4]   2> 1652701 DEBUG (TEST-ShardSplitTest.testSplitLocking-seed#[3FD002A4FD03900C]) [     ] o.a.s.c.c.SolrZkClient makePath: /configs/conf1/synonyms.txt
   [junit4]   2> 1652702 INFO  (TEST-ShardSplitTest.testSplitLocking-seed#[3FD002A4FD03900C]) [     ] o.a.s.c.AbstractFullDistribZkTestBase Will use NRT replicas unless explicitly asked otherwise
   [junit4]   2> 1652861 INFO  (TEST-ShardSplitTest.testSplitLocking-seed#[3FD002A4FD03900C]) [     ] o.a.s.c.s.e.JettySolrRunner Start Jetty (configured port=0, binding port=0)
   [junit4]   2> 1652861 INFO  (TEST-ShardSplitTest.testSplitLocking-seed#[3FD002A4FD03900C]) [     ] o.a.s.c.s.e.JettySolrRunner Trying to start Jetty on port 0 try number 2 ...
   [junit4]   2> 1652861 INFO  (TEST-ShardSplitTest.testSplitLocking-seed#[3FD002A4FD03900C]) [     ] o.e.j.s.Server jetty-9.4.53.v20231009; built: 2023-10-09T12:29:09.265Z; git: 27bde00a0b95a1d5bbee0eae7984f891d2d0f8c9; jvm 1.8.0_362-b09
   [junit4]   2> 1652862 INFO  (TEST-ShardSplitTest.testSplitLocking-seed#[3FD002A4FD03900C]) [     ] o.e.j.s.session DefaultSessionIdManager workerName=node0
   [junit4]   2> 1652862 INFO  (TEST-ShardSplitTest.testSplitLocking-seed#[3FD002A4FD03900C]) [     ] o.e.j.s.session No SessionScavenger set, using defaults
   [junit4]   2> 1652862 INFO  (TEST-ShardSplitTest.testSplitLocking-seed#[3FD002A4FD03900C]) [     ] o.e.j.s.session node0 Scavenging every 660000ms
   [junit4]   2> 1652863 INFO  (TEST-ShardSplitTest.testSplitLocking-seed#[3FD002A4FD03900C]) [     ] o.e.j.s.h.ContextHandler Started o.e.j.s.ServletContextHandler@467f65ed{/od_bj/qz,null,AVAILABLE}
   [junit4]   2> 1652863 INFO  (TEST-ShardSplitTest.testSplitLocking-seed#[3FD002A4FD03900C]) [     ] o.e.j.s.AbstractConnector Started ServerConnector@7e2dea28{HTTP/1.1, (http/1.1, h2c)}{127.0.0.1:36961}
   [junit4]   2> 1652863 INFO  (TEST-ShardSplitTest.testSplitLocking-seed#[3FD002A4FD03900C]) [     ] o.e.j.s.Server Started @1652892ms
   [junit4]   2> 1652863 INFO  (TEST-ShardSplitTest.testSplitLocking-seed#[3FD002A4FD03900C]) [     ] o.a.s.c.s.e.JettySolrRunner Jetty properties: {solr.data.dir=/home/jenkins/jenkins-slave/workspace/Lucene/Lucene-Solr-Tests-8.11/solr/build/solr-core/test/J3/temp/solr.cloud.api.collections.ShardSplitTest_3FD002A4FD03900C-001/tempDir-001/control/data, replicaType=NRT, hostContext=/od_bj/qz, hostPort=36961, coreRootDirectory=/home/jenkins/jenkins-slave/workspace/Lucene/Lucene-Solr-Tests-8.11/solr/build/solr-core/test/J3/temp/solr.cloud.api.collections.ShardSplitTest_3FD002A4FD03900C-001/control-001/cores}
   [junit4]   2> 1652863 ERROR (TEST-ShardSplitTest.testSplitLocking-seed#[3FD002A4FD03900C]) [     ] o.a.s.u.StartupLoggingUtils Missing Java Option solr.log.dir. Logging may be missing or incomplete.
   [junit4]   2> 1652863 INFO  (TEST-ShardSplitTest.testSplitLocking-seed#[3FD002A4FD03900C]) [     ] o.a.s.s.SolrDispatchFilter Using logger factory org.apache.logging.slf4j.Log4jLoggerFactory
   [junit4]   2> 1652863 INFO  (TEST-ShardSplitTest.testSplitLocking-seed#[3FD002A4FD03900C]) [     ] o.a.s.s.SolrDispatchFilter  ___      _       Welcome to Apache Solr? version 8.11.4
   [junit4]   2> 1652863 INFO  (TEST-ShardSplitTest.testSplitLocking-seed#[3FD002A4FD03900C]) [     ] o.a.s.s.SolrDispatchFilter / __| ___| |_ _   Starting in cloud mode on port null
   [junit4]   2> 1652863 INFO  (TEST-ShardSplitTest.testSplitLocking-seed#[3FD002A4FD03900C]) [     ] o.a.s.s.SolrDispatchFilter \__ \/ _ \ | '_|  Install dir: /home/jenkins/jenkins-slave/workspace/Lucene/Lucene-Solr-Tests-8.11/solr
   [junit4]   2> 1652863 INFO  (TEST-ShardSplitTest.testSplitLocking-seed#[3FD002A4FD03900C]) [     ] o.a.s.s.SolrDispatchFilter |___/\___/_|_|    Start time: 2024-04-21T01:28:07.293Z
   [junit4]   2> 1652863 DEBUG (TEST-ShardSplitTest.testSplitLocking-seed#[3FD002A4FD03900C]) [     ] o.a.s.c.c.SolrZkClient Using default ZkCredentialsProvider
   [junit4]   2> 1652864 INFO  (TEST-ShardSplitTest.testSplitLocking-seed#[3FD002A4FD03900C]) [     ] o.a.s.c.c.ConnectionManager Waiting for client to connect to ZooKeeper
   [junit4]   2> 1652865 DEBUG (TEST-ShardSplitTest.testSplitLocking-seed#[3FD002A4FD03900C]-EventThread) [     ] o.a.s.c.c.SolrZkClient Submitting job to respond to event WatchedEvent state:SyncConnected type:None path:null
   [junit4]   2> 1652865 DEBUG (zkConnectionManagerCallback-16088-thread-1) [     ] o.a.s.c.c.ConnectionManager Watcher org.apache.solr.common.cloud.ConnectionManager@46b9894c name: ZooKeeperConnection Watcher:127.0.0.1:39003/solr got event WatchedEvent state:SyncConnected type:None path:null path: null type: None
   [junit4]   2> 1652865 INFO  (zkConnectionManagerCallback-16088-thread-1) [     ] o.a.s.c.c.ConnectionManager zkClient has connected
   [junit4]   2> 1652865 INFO  (TEST-ShardSplitTest.testSplitLocking-seed#[3FD002A4FD03900C]) [     ] o.a.s.c.c.ConnectionManager Client is connected to ZooKeeper
   [junit4]   2> 1652865 DEBUG (TEST-ShardSplitTest.testSplitLocking-seed#[3FD002A4FD03900C]) [     ] o.a.s.c.c.SolrZkClient Using default ZkACLProvider
   [junit4]   2> 1652966 DEBUG (TEST-ShardSplitTest.testSplitLocking-seed#[3FD002A4FD03900C]-EventThread) [     ] o.a.s.c.c.SolrZkClient Submitting job to respond to event WatchedEvent state:Closed type:None path:null
   [junit4]   2> 1652966 INFO  (TEST-ShardSplitTest.testSplitLocking-seed#[3FD002A4FD03900C]) [     ] o.a.s.s.SolrDispatchFilter Loading solr.xml from SolrHome (not found in ZooKeeper)
   [junit4]   2> 1652967 INFO  (TEST-ShardSplitTest.testSplitLocking-seed#[3FD002A4FD03900C]) [     ] o.a.s.c.SolrXmlConfig Loading container configuration from /home/jenkins/jenkins-slave/workspace/Lucene/Lucene-Solr-Tests-8.11/solr/build/solr-core/test/J3/temp/solr.cloud.api.collections.ShardSplitTest_3FD002A4FD03900C-001/control-001/solr.xml
   [junit4]   2> 1652969 INFO  (TEST-ShardSplitTest.testSplitLocking-seed#[3FD002A4FD03900C]) [     ] o.a.s.c.SolrXmlConfig Configuration parameter autoReplicaFailoverWorkLoopDelay is ignored
   [junit4]   2> 1652969 INFO  (TEST-ShardSplitTest.testSplitLocking-seed#[3FD002A4FD03900C]) [     ] o.a.s.c.SolrXmlConfig Configuration parameter autoReplicaFailoverBadNodeExpiration is ignored
   [junit4]   2> 1652971 INFO  (TEST-ShardSplitTest.testSplitLocking-seed#[3FD002A4FD03900C]) [     ] o.a.s.c.SolrXmlConfig MBean server found: com.sun.jmx.mbeanserver.JmxMBeanServer@5688f2c9, but no JMX reporters were configured - adding default JMX reporter.
   [junit4]   2> 1654587 INFO  (TEST-ShardSplitTest.testSplitLocking-seed#[3FD002A4FD03900C]) [     ] o.a.s.h.c.HttpShardHandlerFactory Host whitelist initialized: WhitelistHostChecker [whitelistHosts=null, whitelistHostCheckingEnabled=false]
   [junit4]   2> 1654588 WARN  (TEST-ShardSplitTest.testSplitLocking-seed#[3FD002A4FD03900C]) [     ] o.e.j.u.s.S.config Trusting all certificates configured for Client@68ce056f[provider=null,keyStore=null,trustStore=null]
   [junit4]   2> 1654588 WARN  (TEST-ShardSplitTest.testSplitLocking-seed#[3FD002A4FD03900C]) [     ] o.e.j.u.s.S.config No Client EndPointIdentificationAlgorithm configured for Client@68ce056f[provider=null,keyStore=null,trustStore=null]
   [junit4]   2> 1654592 WARN  (TEST-ShardSplitTest.testSplitLocking-seed#[3FD002A4FD03900C]) [     ] o.e.j.u.s.S.config Trusting all certificates configured for Client@2512b8ef[provider=null,keyStore=null,trustStore=null]
   [junit4]   2> 1654592 WARN  (TEST-ShardSplitTest.testSplitLocking-seed#[3FD002A4FD03900C]) [     ] o.e.j.u.s.S.config No Client EndPointIdentificationAlgorithm configured for Client@2512b8ef[provider=null,keyStore=null,trustStore=null]
   [junit4]   2> 1654593 INFO  (TEST-ShardSplitTest.testSplitLocking-seed#[3FD002A4FD03900C]) [     ] o.a.s.c.ZkContainer Zookeeper client=127.0.0.1:39003/solr
   [junit4]   2> 1654593 DEBUG (TEST-ShardSplitTest.testSplitLocking-seed#[3FD002A4FD03900C]) [     ] o.a.s.c.c.SolrZkClient Using default ZkCredentialsProvider
   [junit4]   2> 1654601 INFO  (TEST-ShardSplitTest.testSplitLocking-seed#[3FD002A4FD03900C]) [     ] o.a.s.c.c.ConnectionManager Waiting for client to connect to ZooKeeper
   [junit4]   2> 1654601 DEBUG (TEST-ShardSplitTest.testSplitLocking-seed#[3FD002A4FD03900C]-EventThread) [     ] o.a.s.c.c.SolrZkClient Submitting job to respond to event WatchedEvent state:SyncConnected type:None path:null
   [junit4]   2> 1654601 DEBUG (zkConnectionManagerCallback-16099-thread-1) [     ] o.a.s.c.c.ConnectionManager Watcher org.apache.solr.common.cloud.ConnectionManager@216938b3 name: ZooKeeperConnection Watcher:127.0.0.1:39003 got event WatchedEvent state:SyncConnected type:None path:null path: null type: None
   [junit4]   2> 1654601 INFO  (zkConnectionManagerCallback-16099-thread-1) [     ] o.a.s.c.c.ConnectionManager zkClient has connected
   [junit4]   2> 1654601 INFO  (TEST-ShardSplitTest.testSplitLocking-seed#[3FD002A4FD03900C]) [     ] o.a.s.c.c.ConnectionManager Client is connected to ZooKeeper
   [junit4]   2> 1654601 DEBUG (TEST-ShardSplitTest.testSplitLocking-seed#[3FD002A4FD03900C]) [     ] o.a.s.c.c.SolrZkClient Using default ZkACLProvider
   [junit4]   2> 1654603 WARN  (TEST-ShardSplitTest.testSplitLocking-seed#[3FD002A4FD03900C]-SendThread(127.0.0.1:39003)) [     ] o.a.z.ClientCnxn An exception was thrown while closing send thread for session 0x10020c1008c0003.
   [junit4]   2>           => EndOfStreamException: Unable to read additional data from server sessionid 0x10020c1008c0003, likely server has closed socket
   [junit4]   2> 	at org.apache.zookeeper.ClientCnxnSocketNIO.doIO(ClientCnxnSocketNIO.java:77)
   [junit4]   2> org.apache.zookeeper.ClientCnxn$EndOfStreamException: Unable to read additional data from server sessionid 0x10020c1008c0003, likely server has closed socket
   [junit4]   2> 	at org.apache.zookeeper.ClientCnxnSocketNIO.doIO(ClientCnxnSocketNIO.java:77) ~[zookeeper-3.6.2.jar:3.6.2]
   [junit4]   2> 	at org.apache.zookeeper.ClientCnxnSocketNIO.doTransport(ClientCnxnSocketNIO.java:350) ~[zookeeper-3.6.2.jar:3.6.2]
   [junit4]   2> 	at org.apache.zookeeper.ClientCnxn$SendThread.run(ClientCnxn.java:1275) [zookeeper-3.6.2.jar:3.6.2]
   [junit4]   2> 1654703 DEBUG (TEST-ShardSplitTest.testSplitLocking-seed#[3FD002A4FD03900C]-EventThread) [     ] o.a.s.c.c.SolrZkClient Submitting job to respond to event WatchedEvent state:Closed type:None path:null
   [junit4]   2> 1654704 INFO  (TEST-ShardSplitTest.testSplitLocking-seed#[3FD002A4FD03900C]) [n:127.0.0.1:36961_od_bj%2Fqz     ] o.a.s.c.c.ConnectionManager Waiting for client to connect to ZooKeeper
   [junit4]   2> 1654705 DEBUG (TEST-ShardSplitTest.testSplitLocking-seed#[3FD002A4FD03900C]-EventThread) [     ] o.a.s.c.c.SolrZkClient Submitting job to respond to event WatchedEvent state:SyncConnected type:None path:null
   [junit4]   2> 1654705 DEBUG (zkConnectionManagerCallback-16101-thread-1) [     ] o.a.s.c.c.ConnectionManager Watcher org.apache.solr.common.cloud.ConnectionManager@27dfadcc name: ZooKeeperConnection Watcher:127.0.0.1:39003/solr got event WatchedEvent state:SyncConnected type:None path:null path: null type: None
   [junit4]   2> 1654705 INFO  (zkConnectionManagerCallback-16101-thread-1) [     ] o.a.s.c.c.ConnectionManager zkClient has connected
   [junit4]   2> 1654705 INFO  (TEST-ShardSplitTest.testSplitLocking-seed#[3FD002A4FD03900C]) [n:127.0.0.1:36961_od_bj%2Fqz     ] o.a.s.c.c.ConnectionManager Client is connected to ZooKeeper
   [junit4]   2> 1654706 DEBUG (TEST-ShardSplitTest.testSplitLocking-seed#[3FD002A4FD03900C]) [n:127.0.0.1:36961_od_bj%2Fqz     ] o.a.s.c.c.SolrZkClient makePath: /overseer/collection-map-running
   [junit4]   2> 1654707 DEBUG (TEST-ShardSplitTest.testSplitLocking-seed#[3FD002A4FD03900C]) [n:127.0.0.1:36961_od_bj%2Fqz     ] o.a.s.c.c.SolrZkClient makePath: /overseer/collection-map-completed
   [junit4]   2> 1654707 DEBUG (TEST-ShardSplitTest.testSplitLocking-seed#[3FD002A4FD03900C]) [n:127.0.0.1:36961_od_bj%2Fqz     ] o.a.s.c.c.SolrZkClient makePath: /overseer/collection-map-failure
   [junit4]   2> 1654708 DEBUG (TEST-ShardSplitTest.testSplitLocking-seed#[3FD002A4FD03900C]) [n:127.0.0.1:36961_od_bj%2Fqz     ] o.a.s.c.c.SolrZkClient makePath: /overseer/async_ids
   [junit4]   2> 1654709 DEBUG (TEST-ShardSplitTest.testSplitLocking-seed#[3FD002A4FD03900C]) [n:127.0.0.1:36961_od_bj%2Fqz     ] o.a.s.c.c.SolrZkClient makePath: /live_nodes
   [junit4]   2> 1654709 DEBUG (TEST-ShardSplitTest.testSplitLocking-seed#[3FD002A4FD03900C]) [n:127.0.0.1:36961_od_bj%2Fqz     ] o.a.s.c.c.SolrZkClient makePath: /node_roles
   [junit4]   2> 1654710 DEBUG (TEST-ShardSplitTest.testSplitLocking-seed#[3FD002A4FD03900C]) [n:127.0.0.1:36961_od_bj%2Fqz     ] o.a.s.c.c.SolrZkClient makePath: /node_roles/data
   [junit4]   2> 1654710 DEBUG (TEST-ShardSplitTest.testSplitLocking-seed#[3FD002A4FD03900C]) [n:127.0.0.1:36961_od_bj%2Fqz     ] o.a.s.c.c.SolrZkClient makePath: /node_roles/data/on
   [junit4]   2> 1654711 DEBUG (TEST-ShardSplitTest.testSplitLocking-seed#[3FD002A4FD03900C]) [n:127.0.0.1:36961_od_bj%2Fqz     ] o.a.s.c.c.SolrZkClient makePath: /node_roles/data/off
   [junit4]   2> 1654712 DEBUG (TEST-ShardSplitTest.testSplitLocking-seed#[3FD002A4FD03900C]) [n:127.0.0.1:36961_od_bj%2Fqz     ] o.a.s.c.c.SolrZkClient makePath: /node_roles/overseer
   [junit4]   2> 1654713 DEBUG (TEST-ShardSplitTest.testSplitLocking-seed#[3FD002A4FD03900C]) [n:127.0.0.1:36961_od_bj%2Fqz     ] o.a.s.c.c.SolrZkClient makePath: /node_roles/overseer/allowed
   [junit4]   2> 1654714 DEBUG (TEST-ShardSplitTest.testSplitLocking-seed#[3FD002A4FD03900C]) [n:127.0.0.1:36961_od_bj%2Fqz     ] o.a.s.c.c.SolrZkClient makePath: /node_roles/overseer/preferred
   [junit4]   2> 1654718 DEBUG (TEST-ShardSplitTest.testSplitLocking-seed#[3FD002A4FD03900C]) [n:127.0.0.1:36961_od_bj%2Fqz     ] o.a.s.c.c.SolrZkClient makePath: /node_roles/overseer/disallowed
   [junit4]   2> 1654719 DEBUG (TEST-ShardSplitTest.testSplitLocking-seed#[3FD002A4FD03900C]) [n:127.0.0.1:36961_od_bj%2Fqz     ] o.a.s.c.c.SolrZkClient makePath: /node_roles/coordinator
   [junit4]   2> 1654720 DEBUG (TEST-ShardSplitTest.testSplitLocking-seed#[3FD002A4FD03900C]) [n:127.0.0.1:36961_od_bj%2Fqz     ] o.a.s.c.c.SolrZkClient makePath: /node_roles/coordinator/on
   [junit4]   2> 1654721 DEBUG (TEST-ShardSplitTest.testSplitLocking-seed#[3FD002A4FD03900C]) [n:127.0.0.1:36961_od_bj%2Fqz     ] o.a.s.c.c.SolrZkClient makePath: /node_roles/coordinator/off
   [junit4]   2> 1654722 DEBUG (TEST-ShardSplitTest.testSplitLocking-seed#[3FD002A4FD03900C]) [n:127.0.0.1:36961_od_bj%2Fqz     ] o.a.s.c.c.SolrZkClient makePath: /aliases.json
   [junit4]   2> 1654722 DEBUG (TEST-ShardSplitTest.testSplitLocking-seed#[3FD002A4FD03900C]) [n:127.0.0.1:36961_od_bj%2Fqz     ] o.a.s.c.c.SolrZkClient makePath: /autoscaling/events
   [junit4]   2> 1654723 DEBUG (TEST-ShardSplitTest.testSplitLocking-seed#[3FD002A4FD03900C]) [n:127.0.0.1:36961_od_bj%2Fqz     ] o.a.s.c.c.SolrZkClient makePath: /autoscaling/triggerState
   [junit4]   2> 1654723 DEBUG (TEST-ShardSplitTest.testSplitLocking-seed#[3FD002A4FD03900C]) [n:127.0.0.1:36961_od_bj%2Fqz     ] o.a.s.c.c.SolrZkClient makePath: /autoscaling/nodeAdded
   [junit4]   2> 1654724 DEBUG (TEST-ShardSplitTest.testSplitLocking-seed#[3FD002A4FD03900C]) [n:127.0.0.1:36961_od_bj%2Fqz     ] o.a.s.c.c.SolrZkClient makePath: /autoscaling/nodeLost
   [junit4]   2> 1654724 DEBUG (TEST-ShardSplitTest.testSplitLocking-seed#[3FD002A4FD03900C]) [n:127.0.0.1:36961_od_bj%2Fqz     ] o.a.s.c.c.SolrZkClient makePath: /clusterstate.json
   [junit4]   2> 1654725 DEBUG (TEST-ShardSplitTest.testSplitLocking-seed#[3FD002A4FD03900C]) [n:127.0.0.1:36961_od_bj%2Fqz     ] o.a.s.c.c.SolrZkClient makePath: /autoscaling.json
   [junit4]   2> 1654725 DEBUG (TEST-ShardSplitTest.testSplitLocking-seed#[3FD002A4FD03900C]) [n:127.0.0.1:36961_od_bj%2Fqz     ] o.a.s.c.c.SolrZkClient makePath: /security.json
   [junit4]   2> 1654726 DEBUG (TEST-ShardSplitTest.testSplitLocking-seed#[3FD002A4FD03900C]) [n:127.0.0.1:36961_od_bj%2Fqz     ] o.a.s.c.c.SolrZkClient makePath: /configs/_default/protwords.txt
   [junit4]   2> 1654728 DEBUG (TEST-ShardSplitTest.testSplitLocking-seed#[3FD002A4FD03900C]) [n:127.0.0.1:36961_od_bj%2Fqz     ] o.a.s.c.c.SolrZkClient makePath: /configs/_default/managed-schema
   [junit4]   2> 1654729 DEBUG (TEST-ShardSplitTest.testSplitLocking-seed#[3FD002A4FD03900C]) [n:127.0.0.1:36961_od_bj%2Fqz     ] o.a.s.c.c.SolrZkClient makePath: /configs/_default/solrconfig.xml
   [junit4]   2> 1654730 DEBUG (TEST-ShardSplitTest.testSplitLocking-seed#[3FD002A4FD03900C]) [n:127.0.0.1:36961_od_bj%2Fqz     ] o.a.s.c.c.SolrZkClient makePath: /configs/_default/synonyms.txt
   [junit4]   2> 1654731 DEBUG (TEST-ShardSplitTest.testSplitLocking-seed#[3FD002A4FD03900C]) [n:127.0.0.1:36961_od_bj%2Fqz     ] o.a.s.c.c.SolrZkClient makePath: /configs/_default/lang/stopwords_it.txt
   [junit4]   2> 1654732 DEBUG (TEST-ShardSplitTest.testSplitLocking-seed#[3FD002A4FD03900C]) [n:127.0.0.1:36961_od_bj%2Fqz     ] o.a.s.c.c.SolrZkClient makePath: /configs/_default/lang/stopwords_cz.txt
   [junit4]   2> 1654733 DEBUG (TEST-ShardSplitTest.testSplitLocking-seed#[3FD002A4FD03900C]) [n:127.0.0.1:36961_od_bj%2Fqz     ] o.a.s.c.c.SolrZkClient makePath: /configs/_default/lang/stopwords_fr.txt
   [junit4]   2> 1654734 DEBUG (TEST-ShardSplitTest.testSplitLocking-seed#[3FD002A4FD03900C]) [n:127.0.0.1:36961_od_bj%2Fqz     ] o.a.s.c.c.SolrZkClient makePath: /configs/_default/lang/stopwords_no.txt
   [junit4]   2> 1654735 DEBUG (TEST-ShardSplitTest.testSplitLocking-seed#[3FD002A4FD03900C]) [n:127.0.0.1:36961_od_bj%2Fqz     ] o.a.s.c.c.SolrZkClient makePath: /configs/_default/lang/contractions_ca.txt
   [junit4]   2> 1654736 DEBUG (TEST-ShardSplitTest.testSplitLocking-seed#[3FD002A4FD03900C]) [n:127.0.0.1:36961_od_bj%2Fqz     ] o.a.s.c.c.SolrZkClient makePath: /configs/_default/lang/stopwords_sv.txt
   [junit4]   2> 1654737 DEBUG (TEST-ShardSplitTest.testSplitLocking-seed#[3FD002A4FD03900C]) [n:127.0.0.1:36961_od_bj%2Fqz     ] o.a.s.c.c.SolrZkClient makePath: /configs/_default/lang/stopwords_ca.txt
   [junit4]   2> 1654738 DEBUG (TEST-ShardSplitTest.testSplitLocking-seed#[3FD002A4FD03900C]) [n:127.0.0.1:36961_od_bj%2Fqz     ] o.a.s.c.c.SolrZkClient makePath: /configs/_default/lang/stopwords_hu.txt
   [junit4]   2> 1654739 DEBUG (TEST-ShardSplitTest.testSplitLocking-seed#[3FD002A4FD03900C]) [n:127.0.0.1:36961_od_bj%2Fqz     ] o.a.s.c.c.SolrZkClient makePath: /configs/_default/lang/stopwords_gl.txt
   [junit4]   2> 1654740 DEBUG (TEST-ShardSplitTest.testSplitLocking-seed#[3FD002A4FD03900C]) [n:127.0.0.1:36961_od_bj%2Fqz     ] o.a.s.c.c.SolrZkClient makePath: /configs/_default/lang/stopwords_bg.txt
   [junit4]   2> 1654741 DEBUG (TEST-ShardSplitTest.testSplitLocking-seed#[3FD002A4FD03900C]) [n:127.0.0.1:36961_od_bj%2Fqz     ] o.a.s.c.c.SolrZkClient makePath: /configs/_default/lang/stopwords_th.txt
   [junit4]   2> 1654742 DEBUG (TEST-ShardSplitTest.testSplitLocking-seed#[3FD002A4FD03900C]) [n:127.0.0.1:36961_od_bj%2Fqz     ] o.a.s.c.c.SolrZkClient makePath: /configs/_default/lang/stopwords_ga.txt
   [junit4]   2> 1654743 DEBUG (TEST-ShardSplitTest.testSplitLocking-seed#[3FD002A4FD03900C]) [n:127.0.0.1:36961_od_bj%2Fqz     ] o.a.s.c.c.SolrZkClient makePath: /configs/_default/lang/stopwords_da.txt
   [junit4]   2> 1654744 DEBUG (TEST-ShardSplitTest.testSplitLocking-seed#[3FD002A4FD03900C]) [n:127.0.0.1:36961_od_bj%2Fqz     ] o.a.s.c.c.SolrZkClient makePath: /configs/_default/lang/stopwords_et.txt
   [junit4]   2> 1654745 DEBUG (TEST-ShardSplitTest.testSplitLocking-seed#[3FD002A4FD03900C]) [n:127.0.0.1:36961_od_bj%2Fqz     ] o.a.s.c.c.SolrZkClient makePath: /configs/_default/lang/userdict_ja.txt
   [junit4]   2> 1654748 DEBUG (TEST-ShardSplitTest.testSplitLocking-seed#[3FD002A4FD03900C]) [n:127.0.0.1:36961_od_bj%2Fqz     ] o.a.s.c.c.SolrZkClient makePath: /configs/_default/lang/contractions_ga.txt
   [junit4]   2> 1654749 DEBUG (TEST-ShardSplitTest.testSplitLocking-seed#[3FD002A4FD03900C]) [n:127.0.0.1:36961_od_bj%2Fqz     ] o.a.s.c.c.SolrZkClient makePath: /configs/_default/lang/stopwords_id.txt
   [junit4]   2> 1654750 DEBUG (TEST-ShardSplitTest.testSplitLocking-seed#[3FD002A4FD03900C]) [n:127.0.0.1:36961_od_bj%2Fqz     ] o.a.s.c.c.SolrZkClient makePath: /configs/_default/lang/stopwords_tr.txt
   [junit4]   2> 1654751 DEBUG (TEST-ShardSplitTest.testSplitLocking-seed#[3FD002A4FD03900C]) [n:127.0.0.1:36961_od_bj%2Fqz     ] o.a.s.c.c.SolrZkClient makePath: /configs/_default/lang/stopwords_ja.txt
   [junit4]   2> 1654752 DEBUG (TEST-ShardSplitTest.testSplitLocking-seed#[3FD002A4FD03900C]) [n:127.0.0.1:36961_od_bj%2Fqz     ] o.a.s.c.c.SolrZkClient makePath: /configs/_default/lang/stopwords_ar.txt
   [junit4]   2> 1654753 DEBUG (TEST-ShardSplitTest.testSplitLocking-seed#[3FD002A4FD03900C]) [n:127.0.0.1:36961_od_bj%2Fqz     ] o.a.s.c.c.SolrZkClient makePath: /configs/_default/lang/stopwords_ru.txt
   [junit4]   2> 1654754 DEBUG (TEST-ShardSplitTest.testSplitLocking-seed#[3FD002A4FD03900C]) [n:127.0.0.1:36961_od_bj%2Fqz     ] o.a.s.c.c.SolrZkClient makePath: /configs/_default/lang/hyphenations_ga.txt
   [junit4]   2> 1654757 DEBUG (TEST-ShardSplitTest.testSplitLocking-seed#[3FD002A4FD03900C]) [n:127.0.0.1:36961_od_bj%2Fqz     ] o.a.s.c.c.SolrZkClient makePath: /configs/_default/lang/stopwords_de.txt
   [junit4]   2> 1654758 DEBUG (TEST-ShardSplitTest.testSplitLocking-seed#[3FD002A4FD03900C]) [n:127.0.0.1:36961_od_bj%2Fqz     ] o.a.s.c.c.SolrZkClient makePath: /configs/_default/lang/stopwords_en.txt
   [junit4]   2> 1654760 DEBUG (TEST-ShardSplitTest.testSplitLocking-seed#[3FD002A4FD03900C]) [n:127.0.0.1:36961_od_bj%2Fqz     ] o.a.s.c.c.SolrZkClient makePath: /configs/_default/lang/stemdict_nl.txt
   [junit4]   2> 1654761 DEBUG (TEST-ShardSplitTest.testSplitLocking-seed#[3FD002A4FD03900C]) [n:127.0.0.1:36961_od_bj%2Fqz     ] o.a.s.c.c.SolrZkClient makePath: /configs/_default/lang/stopwords_ro.txt
   [junit4]   2> 1654762 DEBUG (TEST-ShardSplitTest.testSplitLocking-seed#[3FD002A4FD03900C]) [n:127.0.0.1:36961_od_bj%2Fqz     ] o.a.s.c.c.SolrZkClient makePath: /configs/_default/lang/stopwords_hy.txt
   [junit4]   2> 1654763 DEBUG (TEST-ShardSplitTest.testSplitLocking-seed#[3FD002A4FD03900C]) [n:127.0.0.1:36961_od_bj%2Fqz     ] o.a.s.c.c.SolrZkClient makePath: /configs/_default/lang/stopwords_eu.txt
   [junit4]   2> 1654764 DEBUG (TEST-ShardSplitTest.testSplitLocking-seed#[3FD002A4FD03900C]) [n:127.0.0.1:36961_od_bj%2Fqz     ] o.a.s.c.c.SolrZkClient makePath: /configs/_default/lang/stopwords_hi.txt
   [junit4]   2> 1654765 DEBUG (TEST-ShardSplitTest.testSplitLocking-seed#[3FD002A4FD03900C]) [n:127.0.0.1:36961_od_bj%2Fqz     ] o.a.s.c.c.SolrZkClient makePath: /configs/_default/lang/stoptags_ja.txt
   [junit4]   2> 1654768 DEBUG (TEST-ShardSplitTest.testSplitLocking-seed#[3FD002A4FD03900C]) [n:127.0.0.1:36961_od_bj%2Fqz     ] o.a.s.c.c.SolrZkClient makePath: /configs/_default/lang/contractions_fr.txt
   [junit4]   2> 1654770 DEBUG (TEST-ShardSplitTest.testSplitLocking-seed#[3FD002A4FD03900C]) [n:127.0.0.1:36961_od_bj%2Fqz     ] o.a.s.c.c.SolrZkClient makePath: /configs/_default/lang/stopwords_fi.txt
   [junit4]   2> 1654771 DEBUG (TEST-ShardSplitTest.testSplitLocking-seed#[3FD002A4FD03900C]) [n:127.0.0.1:36961_od_bj%2Fqz     ] o.a.s.c.c.SolrZkClient makePath: /configs/_default/lang/stopwords_pt.txt
   [junit4]   2> 1654772 DEBUG (TEST-ShardSplitTest.testSplitLocking-seed#[3FD002A4FD03900C]) [n:127.0.0.1:36961_od_bj%2Fqz     ] o.a.s.c.c.SolrZkClient makePath: /configs/_default/lang/stopwords_lv.txt
   [junit4]   2> 1654773 DEBUG (TEST-ShardSplitTest.testSplitLocking-seed#[3FD002A4FD03900C]) [n:127.0.0.1:36961_od_bj%2Fqz     ] o.a.s.c.c.SolrZkClient makePath: /configs/_default/lang/stopwords_el.txt
   [junit4]   2> 1654774 DEBUG (TEST-ShardSplitTest.testSplitLocking-seed#[3FD002A4FD03900C]) [n:127.0.0.1:36961_od_bj%2Fqz     ] o.a.s.c.c.SolrZkClient makePath: /configs/_default/lang/contractions_it.txt
   [junit4]   2> 1654776 DEBUG (TEST-ShardSplitTest.testSplitLocking-seed#[3FD002A4FD03900C]) [n:127.0.0.1:36961_od_bj%2Fqz     ] o.a.s.c.c.SolrZkClient makePath: /configs/_default/lang/stopwords_nl.txt
   [junit4]   2> 1654777 DEBUG (TEST-ShardSplitTest.testSplitLocking-seed#[3FD002A4FD03900C]) [n:127.0.0.1:36961_od_bj%2Fqz     ] o.a.s.c.c.SolrZkClient makePath: /configs/_default/lang/stopwords_es.txt
   [junit4]   2> 1654778 DEBUG (TEST-ShardSplitTest.testSplitLocking-seed#[3FD002A4FD03900C]) [n:127.0.0.1:36961_od_bj%2Fqz     ] o.a.s.c.c.SolrZkClient makePath: /configs/_default/lang/stopwords_fa.txt
   [junit4]   2> 1654781 DEBUG (TEST-ShardSplitTest.testSplitLocking-seed#[3FD002A4FD03900C]) [n:127.0.0.1:36961_od_bj%2Fqz     ] o.a.s.c.c.SolrZkClient makePath: /configs/_default/stopwords.txt
   [junit4]   2> 1654782 WARN  (TEST-ShardSplitTest.testSplitLocking-seed#[3FD002A4FD03900C]) [n:127.0.0.1:36961_od_bj%2Fqz     ] o.a.s.c.ZkController Contents of zookeeper /security.json are world-readable; consider setting up ACLs as described in https://solr.apache.org/guide/zookeeper-access-control.html
   [junit4]   2> 1654782 DEBUG (TEST-ShardSplitTest.testSplitLocking-seed#[3FD002A4FD03900C]) [n:127.0.0.1:36961_od_bj%2Fqz     ] o.a.s.c.c.ZkStateReader Updating cluster state from ZooKeeper... 
   [junit4]   2> 1654782 DEBUG (TEST-ShardSplitTest.testSplitLocking-seed#[3FD002A4FD03900C]) [n:127.0.0.1:36961_od_bj%2Fqz     ] o.a.s.c.c.ZkStateReader Loaded cluster properties: {legacyCloud=true}
   [junit4]   2> 1654783 DEBUG (TEST-ShardSplitTest.testSplitLocking-seed#[3FD002A4FD03900C]) [n:127.0.0.1:36961_od_bj%2Fqz     ] o.a.s.c.c.ZkStateReader Updated live nodes from ZooKeeper... [] -> []
   [junit4]   2> 1654783 DEBUG (TEST-ShardSplitTest.testSplitLocking-seed#[3FD002A4FD03900C]) [n:127.0.0.1:36961_od_bj%2Fqz     ] o.a.s.c.c.ZkStateReader clusterStateSet: legacy [0] interesting [0] watched [0] lazy [2] total [2]
   [junit4]   2> 1654783 DEBUG (TEST-ShardSplitTest.testSplitLocking-seed#[3FD002A4FD03900C]) [n:127.0.0.1:36961_od_bj%2Fqz     ] o.a.s.c.c.ZkStateReader$AliasesManager Checking ZK for most up to date Aliases /aliases.json
   [junit4]   2> 1654784 DEBUG (TEST-ShardSplitTest.testSplitLocking-seed#[3FD002A4FD03900C]) [n:127.0.0.1:36961_od_bj%2Fqz     ] o.a.s.c.c.ZkStateReader$AliasesManager Aliases: cmp=-1, new definition is: Aliases{collectionAliases={}, collectionAliasProperties={}, zNodeVersion=0}
   [junit4]   2> 1654785 DEBUG (TEST-ShardSplitTest.testSplitLocking-seed#[3FD002A4FD03900C]) [n:127.0.0.1:36961_od_bj%2Fqz     ] o.a.s.c.c.SolrZkClient makePath: /overseer_elect
   [junit4]   2> 1654785 DEBUG (TEST-ShardSplitTest.testSplitLocking-seed#[3FD002A4FD03900C]) [n:127.0.0.1:36961_od_bj%2Fqz     ] o.a.s.c.c.SolrZkClient makePath: /overseer_elect/election
   [junit4]   2> 1654786 INFO  (TEST-ShardSplitTest.testSplitLocking-seed#[3FD002A4FD03900C]) [n:127.0.0.1:36961_od_bj%2Fqz     ] o.a.s.c.OverseerElectionContext I am going to be the leader 127.0.0.1:36961_od_bj%2Fqz
   [junit4]   2> 1654786 DEBUG (TEST-ShardSplitTest.testSplitLocking-seed#[3FD002A4FD03900C]) [n:127.0.0.1:36961_od_bj%2Fqz     ] o.a.s.c.c.SolrZkClient makePath: /overseer_elect/leader
   [junit4]   2> 1654787 INFO  (TEST-ShardSplitTest.testSplitLocking-seed#[3FD002A4FD03900C]) [n:127.0.0.1:36961_od_bj%2Fqz     ] o.a.s.c.Overseer Overseer (id=72093607347879940-127.0.0.1:36961_od_bj%2Fqz-n_0000000000) starting
   [junit4]   2> 1654787 DEBUG (TEST-ShardSplitTest.testSplitLocking-seed#[3FD002A4FD03900C]) [n:127.0.0.1:36961_od_bj%2Fqz     ] o.a.s.c.c.SolrZkClient makePath: /overseer/queue
   [junit4]   2> 1654788 DEBUG (TEST-ShardSplitTest.testSplitLocking-seed#[3FD002A4FD03900C]) [n:127.0.0.1:36961_od_bj%2Fqz     ] o.a.s.c.c.SolrZkClient makePath: /overseer/queue-work
   [junit4]   2> 1654790 DEBUG (TEST-ShardSplitTest.testSplitLocking-seed#[3FD002A4FD03900C]) [n:127.0.0.1:36961_od_bj%2Fqz     ] o.a.s.c.c.SolrZkClient makePath: /overseer/collection-queue-work
   [junit4]   2> 1654792 DEBUG (OverseerCollectionConfigSetProcessor-72093607347879940-127.0.0.1:36961_od_bj%2Fqz-n_0000000000) [n:127.0.0.1:36961_od_bj%2Fqz     ] o.a.s.c.OverseerTaskProcessor Process current queue of overseer operations
   [junit4]   2> 1654793 INFO  (OverseerStateUpdate-72093607347879940-127.0.0.1:36961_od_bj%2Fqz-n_0000000000) [n:127.0.0.1:36961_od_bj%2Fqz     ] o.a.s.c.Overseer Starting to work on the main queue : 127.0.0.1:36961_od_bj%2Fqz
   [junit4]   2> 1654793 INFO  (TEST-ShardSplitTest.testSplitLocking-seed#[3FD002A4FD03900C]) [n:127.0.0.1:36961_od_bj%2Fqz     ] o.a.s.c.ZkController Register node as live in ZooKeeper:/live_nodes/127.0.0.1:36961_od_bj%2Fqz
   [junit4]   2> 1654794 DEBUG (OverseerStateUpdate-72093607347879940-127.0.0.1:36961_od_bj%2Fqz-n_0000000000) [n:127.0.0.1:36961_od_bj%2Fqz     ] o.a.s.c.c.ZkStateReader Updated live nodes from ZooKeeper... [] -> []
   [junit4]   2> 1654794 DEBUG (TEST-ShardSplitTest.testSplitLocking-seed#[3FD002A4FD03900C]-EventThread) [     ] o.a.s.c.c.SolrZkClient Submitting job to respond to event WatchedEvent state:SyncConnected type:NodeChildrenChanged path:/live_nodes
   [junit4]   2> 1654794 DEBUG (OverseerStateUpdate-72093607347879940-127.0.0.1:36961_od_bj%2Fqz-n_0000000000) [n:127.0.0.1:36961_od_bj%2Fqz     ] o.a.s.c.c.ZkStateReader clusterStateSet: legacy [0] interesting [0] watched [0] lazy [2] total [2]
   [junit4]   2> 1654794 DEBUG (OverseerCollectionConfigSetProcessor-72093607347879940-127.0.0.1:36961_od_bj%2Fqz-n_0000000000) [n:127.0.0.1:36961_od_bj%2Fqz     ] o.a.s.c.OverseerTaskProcessor Cleaning up work-queue. #Running tasks: 0 #Completed tasks: 0
   [junit4]   2> 1654794 DEBUG (OverseerCollectionConfigSetProcessor-72093607347879940-127.0.0.1:36961_od_bj%2Fqz-n_0000000000) [n:127.0.0.1:36961_od_bj%2Fqz     ] o.a.s.c.OverseerTaskProcessor RunningTasks: []
   [junit4]   2> 1654794 DEBUG (zkCallback-16100-thread-1) [     ] o.a.s.c.c.ZkStateReader A live node change: [WatchedEvent state:SyncConnected type:NodeChildrenChanged path:/live_nodes], has occurred - updating... (live nodes size: [0])
   [junit4]   2> 1654794 DEBUG (OverseerCollectionConfigSetProcessor-72093607347879940-127.0.0.1:36961_od_bj%2Fqz-n_0000000000) [n:127.0.0.1:36961_od_bj%2Fqz     ] o.a.s.c.OverseerTaskProcessor BlockedTasks: []
   [junit4]   2> 1654794 DEBUG (OverseerCollectionConfigSetProcessor-72093607347879940-127.0.0.1:36961_od_bj%2Fqz-n_0000000000) [n:127.0.0.1:36961_od_bj%2Fqz     ] o.a.s.c.OverseerTaskProcessor CompletedTasks: []
   [junit4]   2> 1654794 INFO  (OverseerCollectionConfigSetProcessor-72093607347879940-127.0.0.1:36961_od_bj%2Fqz-n_0000000000) [n:127.0.0.1:36961_od_bj%2Fqz     ] o.a.s.c.OverseerTaskProcessor RunningZKTasks: []
   [junit4]   2> 1654795 INFO  (zkCallback-16100-thread-1) [     ] o.a.s.c.c.ZkStateReader Updated live nodes from ZooKeeper... (0) -> (1)
   [junit4]   2> 1654795 DEBUG (zkCallback-16100-thread-1) [     ] o.a.s.c.c.ZkStateReader Updated live nodes from ZooKeeper... [] -> [127.0.0.1:36961_od_bj%2Fqz]
   [junit4]   2> 1654795 DEBUG (OverseerAutoScalingTriggerThread-72093607347879940-127.0.0.1:36961_od_bj%2Fqz-n_0000000000) [     ] o.a.s.c.c.SolrZkClient makePath: /autoscaling/events/.scheduled_maintenance
   [junit4]   2> 1654795 INFO  (TEST-ShardSplitTest.testSplitLocking-seed#[3FD002A4FD03900C]) [n:127.0.0.1:36961_od_bj%2Fqz     ] o.a.s.c.ZkController non-data nodes now []
   [junit4]   2> 1654796 DEBUG (OverseerAutoScalingTriggerThread-72093607347879940-127.0.0.1:36961_od_bj%2Fqz-n_0000000000) [     ] o.a.s.c.c.SolrZkClient makePath: /autoscaling/events/.auto_add_replicas
   [junit4]   2> 1654798 INFO  (TEST-ShardSplitTest.testSplitLocking-seed#[3FD002A4FD03900C]) [n:127.0.0.1:36961_od_bj%2Fqz     ] o.a.s.p.PackageLoader /packages.json updated to version -1
   [junit4]   2> 1654798 WARN  (TEST-ShardSplitTest.testSplitLocking-seed#[3FD002A4FD03900C]) [n:127.0.0.1:36961_od_bj%2Fqz     ] o.a.s.c.CoreContainer Not all security plugins configured!  authentication=disabled authorization=disabled.  Solr is only as secure as you make it. Consider configuring authentication/authorization before exposing Solr to users internal or external.  See https://s.apache.org/solrsecurity for more info
   [junit4]   2> 1654835 INFO  (TEST-ShardSplitTest.testSplitLocking-seed#[3FD002A4FD03900C]) [n:127.0.0.1:36961_od_bj%2Fqz     ] o.a.s.h.a.MetricsHistoryHandler No .system collection, keeping metrics history in memory.
   [junit4]   2> 1654858 INFO  (TEST-ShardSplitTest.testSplitLocking-seed#[3FD002A4FD03900C]) [n:127.0.0.1:36961_od_bj%2Fqz     ] o.a.s.m.r.SolrJmxReporter JMX monitoring for 'solr.node' (registry 'solr.node') enabled at server: com.sun.jmx.mbeanserver.JmxMBeanServer@5688f2c9
   [junit4]   2> 1654865 INFO  (TEST-ShardSplitTest.testSplitLocking-seed#[3FD002A4FD03900C]) [n:127.0.0.1:36961_od_bj%2Fqz     ] o.a.s.m.r.SolrJmxReporter JMX monitoring for 'solr.jvm' (registry 'solr.jvm') enabled at server: com.sun.jmx.mbeanserver.JmxMBeanServer@5688f2c9
   [junit4]   2> 1654865 INFO  (TEST-ShardSplitTest.testSplitLocking-seed#[3FD002A4FD03900C]) [n:127.0.0.1:36961_od_bj%2Fqz     ] o.a.s.m.r.SolrJmxReporter JMX monitoring for 'solr.jetty' (registry 'solr.jetty') enabled at server: com.sun.jmx.mbeanserver.JmxMBeanServer@5688f2c9
   [junit4]   2> 1654867 INFO  (TEST-ShardSplitTest.testSplitLocking-seed#[3FD002A4FD03900C]) [n:127.0.0.1:36961_od_bj%2Fqz     ] o.a.s.c.CorePropertiesLocator Found 0 core definitions underneath /home/jenkins/jenkins-slave/workspace/Lucene/Lucene-Solr-Tests-8.11/solr/build/solr-core/test/J3/temp/solr.cloud.api.collections.ShardSplitTest_3FD002A4FD03900C-001/control-001/cores
   [junit4]   2> 1654879 DEBUG (TEST-ShardSplitTest.testSplitLocking-seed#[3FD002A4FD03900C]) [     ] o.a.s.c.c.SolrZkClient Using default ZkCredentialsProvider
   [junit4]   2> 1654880 INFO  (TEST-ShardSplitTest.testSplitLocking-seed#[3FD002A4FD03900C]) [     ] o.a.s.c.c.ConnectionManager Waiting for client to connect to ZooKeeper
   [junit4]   2> 1654881 DEBUG (TEST-ShardSplitTest.testSplitLocking-seed#[3FD002A4FD03900C]-EventThread) [     ] o.a.s.c.c.SolrZkClient Submitting job to respond to event WatchedEvent state:SyncConnected type:None path:null
   [junit4]   2> 1654881 DEBUG (zkConnectionManagerCallback-16118-thread-1) [     ] o.a.s.c.c.ConnectionManager Watcher org.apache.solr.common.cloud.ConnectionManager@df42dc4 name: ZooKeeperConnection Watcher:127.0.0.1:39003/solr got event WatchedEvent state:SyncConnected type:None path:null path: null type: None
   [junit4]   2> 1654881 INFO  (zkConnectionManagerCallback-16118-thread-1) [     ] o.a.s.c.c.ConnectionManager zkClient has connected
   [junit4]   2> 1654881 INFO  (TEST-ShardSplitTest.testSplitLocking-seed#[3FD002A4FD03900C]) [     ] o.a.s.c.c.ConnectionManager Client is connected to ZooKeeper
   [junit4]   2> 1654881 DEBUG (TEST-ShardSplitTest.testSplitLocking-seed#[3FD002A4FD03900C]) [     ] o.a.s.c.c.SolrZkClient Using default ZkACLProvider
   [junit4]   2> 1654881 DEBUG (TEST-ShardSplitTest.testSplitLocking-seed#[3FD002A4FD03900C]) [     ] o.a.s.c.c.ZkStateReader Updating cluster state from ZooKeeper... 
   [junit4]   2> 1654882 DEBUG (TEST-ShardSplitTest.testSplitLocking-seed#[3FD002A4FD03900C]) [     ] o.a.s.c.c.ZkStateReader Loaded cluster properties: {legacyCloud=true}
   [junit4]   2> 1654882 INFO  (TEST-ShardSplitTest.testSplitLocking-seed#[3FD002A4FD03900C]) [     ] o.a.s.c.c.ZkStateReader Updated live nodes from ZooKeeper... (0) -> (1)
   [junit4]   2> 1654882 DEBUG (TEST-ShardSplitTest.testSplitLocking-seed#[3FD002A4FD03900C]) [     ] o.a.s.c.c.ZkStateReader Updated live nodes from ZooKeeper... [] -> [127.0.0.1:36961_od_bj%2Fqz]
   [junit4]   2> 1654882 DEBUG (TEST-ShardSplitTest.testSplitLocking-seed#[3FD002A4FD03900C]) [     ] o.a.s.c.c.ZkStateReader clusterStateSet: legacy [0] interesting [0] watched [0] lazy [2] total [2]
   [junit4]   2> 1654883 DEBUG (TEST-ShardSplitTest.testSplitLocking-seed#[3FD002A4FD03900C]) [     ] o.a.s.c.c.ZkStateReader$AliasesManager Checking ZK for most up to date Aliases /aliases.json
   [junit4]   2> 1654883 DEBUG (TEST-ShardSplitTest.testSplitLocking-seed#[3FD002A4FD03900C]) [     ] o.a.s.c.c.ZkStateReader$AliasesManager Aliases: cmp=-1, new definition is: Aliases{collectionAliases={}, collectionAliasProperties={}, zNodeVersion=0}
   [junit4]   2> 1654883 INFO  (TEST-ShardSplitTest.testSplitLocking-seed#[3FD002A4FD03900C]) [     ] o.a.s.c.s.i.ZkClientClusterStateProvider Cluster at 127.0.0.1:39003/solr ready
   [junit4]   2> 1654884 INFO  (qtp1835053110-25459) [n:127.0.0.1:36961_od_bj%2Fqz     ] o.a.s.s.HttpSolrCall HttpSolrCall.init(http://127.0.0.1:36961/od_bj/qz/admin/collections?action=CREATE&name=control_collection&collection.configName=conf1&createNodeSet=127.0.0.1%3A36961_od_bj%252Fqz&numShards=1&nrtReplicas=1&wt=javabin&version=2)
   [junit4]   2> 1654885 DEBUG (TEST-ShardSplitTest.testSplitLocking-seed#[3FD002A4FD03900C]-EventThread) [     ] o.a.s.c.c.SolrZkClient Submitting job to respond to event WatchedEvent state:SyncConnected type:NodeChildrenChanged path:/overseer/collection-queue-work
   [junit4]   2> 1654886 DEBUG (TEST-ShardSplitTest.testSplitLocking-seed#[3FD002A4FD03900C]-EventThread) [     ] o.a.s.c.c.SolrZkClient Submitting job to respond to event WatchedEvent state:SyncConnected type:NodeChildrenChanged path:/overseer/collection-queue-work
   [junit4]   2> 1654886 DEBUG (OverseerCollectionConfigSetProcessor-72093607347879940-127.0.0.1:36961_od_bj%2Fqz-n_0000000000) [n:127.0.0.1:36961_od_bj%2Fqz     ] o.a.s.c.OverseerTaskProcessor Got 1 tasks from work-queue : [[org.apache.solr.cloud.OverseerTaskQueue$QueueEvent@2e684ecf]]
   [junit4]   2> 1654886 DEBUG (OverseerCollectionConfigSetProcessor-72093607347879940-127.0.0.1:36961_od_bj%2Fqz-n_0000000000) [n:127.0.0.1:36961_od_bj%2Fqz     ] o.a.s.c.OverseerTaskProcessor Marked task [/overseer/collection-queue-work/qn-0000000000] as running
   [junit4]   2> 1654886 DEBUG (OverseerCollectionConfigSetProcessor-72093607347879940-127.0.0.1:36961_od_bj%2Fqz-n_0000000000) [n:127.0.0.1:36961_od_bj%2Fqz     ] o.a.s.c.OverseerTaskProcessor Overseer Collection Message Handler: Get the message id: /overseer/collection-queue-work/qn-0000000000 message: {
   [junit4]   2>   "name":"control_collection",
   [junit4]   2>   "fromApi":"true",
   [junit4]   2>   "collection.configName":"conf1",
   [junit4]   2>   "numShards":"1",
   [junit4]   2>   "createNodeSet":"127.0.0.1:36961_od_bj%2Fqz",
   [junit4]   2>   "nrtReplicas":"1",
   [junit4]   2>   "stateFormat":"2",
   [junit4]   2>   "replicationFactor":"1",
   [junit4]   2>   "operation":"create"}
   [junit4]   2> 1654887 DEBUG (OverseerThreadFactory-16108-thread-1-processing-n:127.0.0.1:36961_od_bj%2Fqz) [n:127.0.0.1:36961_od_bj%2Fqz     ] o.a.s.c.OverseerTaskProcessor Runner processing /overseer/collection-queue-work/qn-0000000000
   [junit4]   2> 1654887 DEBUG (OverseerThreadFactory-16108-thread-1-processing-n:127.0.0.1:36961_od_bj%2Fqz) [n:127.0.0.1:36961_od_bj%2Fqz     ] o.a.s.c.a.c.OverseerCollectionMessageHandler OverseerCollectionMessageHandler.processMessage : create , {
   [junit4]   2>   "name":"control_collection",
   [junit4]   2>   "fromApi":"true",
   [junit4]   2>   "collection.configName":"conf1",
   [junit4]   2>   "numShards":"1",
   [junit4]   2>   "createNodeSet":"127.0.0.1:36961_od_bj%2Fqz",
   [junit4]   2>   "nrtReplicas":"1",
   [junit4]   2>   "stateFormat":"2",
   [junit4]   2>   "replicationFactor":"1",
   [junit4]   2>   "operation":"create"}
   [junit4]   2> 1654887 DEBUG (OverseerCollectionConfigSetProcessor-72093607347879940-127.0.0.1:36961_od_bj%2Fqz-n_0000000000) [n:127.0.0.1:36961_od_bj%2Fqz     ] o.a.s.c.OverseerTaskProcessor Cleaning up work-queue. #Running tasks: 1 #Completed tasks: 0
   [junit4]   2> 1654887 DEBUG (OverseerThreadFactory-16108-thread-1-processing-n:127.0.0.1:36961_od_bj%2Fqz) [n:127.0.0.1:36961_od_bj%2Fqz     ] o.a.s.c.c.ZkStateReader$AliasesManager Checking ZK for most up to date Aliases /aliases.json
   [junit4]   2> 1654887 DEBUG (OverseerCollectionConfigSetProcessor-72093607347879940-127.0.0.1:36961_od_bj%2Fqz-n_0000000000) [n:127.0.0.1:36961_od_bj%2Fqz     ] o.a.s.c.OverseerTaskProcessor RunningTasks: [/overseer/collection-queue-work/qn-0000000000]
   [junit4]   2> 1654887 DEBUG (OverseerCollectionConfigSetProcessor-72093607347879940-127.0.0.1:36961_od_bj%2Fqz-n_0000000000) [n:127.0.0.1:36961_od_bj%2Fqz     ] o.a.s.c.OverseerTaskProcessor BlockedTasks: []
   [junit4]   2> 1654887 DEBUG (OverseerCollectionConfigSetProcessor-72093607347879940-127.0.0.1:36961_od_bj%2Fqz-n_0000000000) [n:127.0.0.1:36961_od_bj%2Fqz     ] o.a.s.c.OverseerTaskProcessor CompletedTasks: []
   [junit4]   2> 1654887 INFO  (OverseerCollectionConfigSetProcessor-72093607347879940-127.0.0.1:36961_od_bj%2Fqz-n_0000000000) [n:127.0.0.1:36961_od_bj%2Fqz     ] o.a.s.c.OverseerTaskProcessor RunningZKTasks: [/overseer/collection-queue-work/qn-0000000000]
   [junit4]   2> 1654887 DEBUG (OverseerThreadFactory-16108-thread-1-processing-n:127.0.0.1:36961_od_bj%2Fqz) [n:127.0.0.1:36961_od_bj%2Fqz     ] o.a.s.c.c.ZkStateReader$AliasesManager Aliases: cmp=0, not overwriting ZK version.
   [junit4]   2> 1654887 INFO  (OverseerThreadFactory-16108-thread-1-processing-n:127.0.0.1:36961_od_bj%2Fqz) [n:127.0.0.1:36961_od_bj%2Fqz     ] o.a.s.c.a.c.CreateCollectionCmd Create collection control_collection
   [junit4]   2> 1654888 DEBUG (OverseerThreadFactory-16108-thread-1-processing-n:127.0.0.1:36961_od_bj%2Fqz) [n:127.0.0.1:36961_od_bj%2Fqz     ] o.a.s.c.a.c.OverseerCollectionMessageHandler creating collections conf node /collections/control_collection 
   [junit4]   2> 1654888 DEBUG (OverseerThreadFactory-16108-thread-1-processing-n:127.0.0.1:36961_od_bj%2Fqz) [n:127.0.0.1:36961_od_bj%2Fqz     ] o.a.s.c.a.c.CreateCollectionCmd Check for collection zkNode: control_collection
   [junit4]   2> 1654889 DEBUG (OverseerThreadFactory-16108-thread-1-processing-n:127.0.0.1:36961_od_bj%2Fqz) [n:127.0.0.1:36961_od_bj%2Fqz     ] o.a.s.c.a.c.CreateCollectionCmd Collection zkNode exists
   [junit4]   2> 1654890 DEBUG (TEST-ShardSplitTest.testSplitLocking-seed#[3FD002A4FD03900C]-EventThread) [     ] o.a.s.c.c.SolrZkClient Submitting job to respond to event WatchedEvent state:SyncConnected type:NodeChildrenChanged path:/overseer/queue
   [junit4]   2> 1654890 DEBUG (OverseerStateUpdate-72093607347879940-127.0.0.1:36961_od_bj%2Fqz-n_0000000000) [n:127.0.0.1:36961_od_bj%2Fqz     ] o.a.s.c.Overseer processMessage: queueSize: 1, message = {
   [junit4]   2>   "name":"control_collection",
   [junit4]   2>   "fromApi":"true",
   [junit4]   2>   "collection.configName":"conf1",
   [junit4]   2>   "numShards":"1",
   [junit4]   2>   "createNodeSet":"127.0.0.1:36961_od_bj%2Fqz",
   [junit4]   2>   "nrtReplicas":"1",
   [junit4]   2>   "stateFormat":"2",
   [junit4]   2>   "replicationFactor":"1",
   [junit4]   2>   "operation":"create"} current state version: 0
   [junit4]   2> 1654890 DEBUG (OverseerStateUpdate-72093607347879940-127.0.0.1:36961_od_bj%2Fqz-n_0000000000) [n:127.0.0.1:36961_od_bj%2Fqz     ] o.a.s.c.o.ClusterStateMutator building a new cName: control_collection
   [junit4]   2> 1654891 DEBUG (OverseerStateUpdate-72093607347879940-127.0.0.1:36961_od_bj%2Fqz-n_0000000000) [n:127.0.0.1:36961_od_bj%2Fqz     ] o.a.s.c.o.ZkStateWriter going to create_collection /collections/control_collection/state.json
   [junit4]   2> 1654891 DEBUG (TEST-ShardSplitTest.testSplitLocking-seed#[3FD002A4FD03900C]-EventThread) [     ] o.a.s.c.c.SolrZkClient Submitting job to respond to event WatchedEvent state:SyncConnected type:NodeChildrenChanged path:/overseer/queue
   [junit4]   2> 1654991 DEBUG (OverseerThreadFactory-16108-thread-1-processing-n:127.0.0.1:36961_od_bj%2Fqz) [n:127.0.0.1:36961_od_bj%2Fqz     ] o.a.s.c.a.c.CreateCollectionCmd Creating SolrCores for new collection control_collection, shardNames [shard1] , message : {
   [junit4]   2>   "name":"control_collection",
   [junit4]   2>   "fromApi":"true",
   [junit4]   2>   "collection.configName":"conf1",
   [junit4]   2>   "numShards":"1",
   [junit4]   2>   "createNodeSet":"127.0.0.1:36961_od_bj%2Fqz",
   [junit4]   2>   "nrtReplicas":"1",
   [junit4]   2>   "stateFormat":"2",
   [junit4]   2>   "replicationFactor":"1",
   [junit4]   2>   "operation":"create"}
   [junit4]   2> 1654992 DEBUG (OverseerThreadFactory-16108-thread-1-processing-n:127.0.0.1:36961_od_bj%2Fqz) [n:127.0.0.1:36961_od_bj%2Fqz     ] o.a.s.c.a.c.CreateCollectionCmd Creating core control_collection_shard1_replica_n1 as part of shard shard1 of collection control_collection on 127.0.0.1:36961_od_bj%2Fqz
   [junit4]   2> 1654993 INFO  (qtp1835053110-25461) [n:127.0.0.1:36961_od_bj%2Fqz     ] o.a.s.s.HttpSolrCall HttpSolrCall.init(http://127.0.0.1:36961/od_bj/qz/admin/cores?null)
   [junit4]   2> 1654994 INFO  (qtp1835053110-25461) [n:127.0.0.1:36961_od_bj%2Fqz    x:control_collection_shard1_replica_n1 ] o.a.s.h.a.CoreAdminOperation core create command qt=/admin/cores&collection.configName=conf1&newCollection=true&name=control_collection_shard1_replica_n1&action=CREATE&numShards=1&collection=control_collection&shard=shard1&wt=javabin&version=2&replicaType=NRT
   [junit4]   2> 1654994 INFO  (qtp1835053110-25461) [n:127.0.0.1:36961_od_bj%2Fqz    x:control_collection_shard1_replica_n1 ] o.a.s.c.TransientSolrCoreCacheDefault Allocating transient core cache for max 4 cores with initial capacity of 4
   [junit4]   2> 1654998 DEBUG (TEST-ShardSplitTest.testSplitLocking-seed#[3FD002A4FD03900C]-EventThread) [     ] o.a.s.c.c.SolrZkClient Submitting job to respond to event WatchedEvent state:SyncConnected type:NodeChildrenChanged path:/overseer/queue
   [junit4]   2> 1654999 DEBUG (OverseerStateUpdate-72093607347879940-127.0.0.1:36961_od_bj%2Fqz-n_0000000000) [n:127.0.0.1:36961_od_bj%2Fqz     ] o.a.s.c.Overseer processMessage: queueSize: 1, message = {
   [junit4]   2>   "core":"control_collection_shard1_replica_n1",
   [junit4]   2>   "roles":null,
   [junit4]   2>   "node_name":"127.0.0.1:36961_od_bj%2Fqz",
   [junit4]   2>   "base_url":"http://127.0.0.1:36961/od_bj/qz",
   [junit4]   2>   "numShards":"1",
   [junit4]   2>   "state":"down",
   [junit4]   2>   "shard":"shard1",
   [junit4]   2>   "collection":"control_collection",
   [junit4]   2>   "type":"NRT",
   [junit4]   2>   "operation":"state"} current state version: 0
   [junit4]   2> 1654999 DEBUG (OverseerStateUpdate-72093607347879940-127.0.0.1:36961_od_bj%2Fqz-n_0000000000) [n:127.0.0.1:36961_od_bj%2Fqz     ] o.a.s.c.o.ReplicaMutator Update state numShards=1 message={
   [junit4]   2>   "core":"control_collection_shard1_replica_n1",
   [junit4]   2>   "roles":null,
   [junit4]   2>   "node_name":"127.0.0.1:36961_od_bj%2Fqz",
   [junit4]   2>   "base_url":"http://127.0.0.1:36961/od_bj/qz",
   [junit4]   2>   "numShards":"1",
   [junit4]   2>   "state":"down",
   [junit4]   2>   "shard":"shard1",
   [junit4]   2>   "collection":"control_collection",
   [junit4]   2>   "type":"NRT",
   [junit4]   2>   "operation":"state"}
   [junit4]   2> 1655002 DEBUG (OverseerStateUpdate-72093607347879940-127.0.0.1:36961_od_bj%2Fqz-n_0000000000) [n:127.0.0.1:36961_od_bj%2Fqz     ] o.a.s.c.o.ReplicaMutator Will update state for replica: core_node2:{
   [junit4]   2>   "core":"control_collection_shard1_replica_n1",
   [junit4]   2>   "node_name":"127.0.0.1:36961_od_bj%2Fqz",
   [junit4]   2>   "base_url":"http://127.0.0.1:36961/od_bj/qz",
   [junit4]   2>   "state":"down",
   [junit4]   2>   "type":"NRT"}
   [junit4]   2> 1655002 DEBUG (OverseerStateUpdate-72093607347879940-127.0.0.1:36961_od_bj%2Fqz-n_0000000000) [n:127.0.0.1:36961_od_bj%2Fqz     ] o.a.s.c.o.ReplicaMutator Collection is now: DocCollection(control_collection//collections/control_collection/state.json/0 )={
   [junit4]   2>   "pullReplicas":"0",
   [junit4]   2>   "replicationFactor":"1",
   [junit4]   2>   "router":{"name":"compositeId"},
   [junit4]   2>   "maxShardsPerNode":"1",
   [junit4]   2>   "autoAddReplicas":"false",
   [junit4]   2>   "nrtReplicas":"1",
   [junit4]   2>   "tlogReplicas":"0",
   [junit4]   2>   "shards":{"shard1":{
   [junit4]   2>       "range":"80000000-7fffffff",
   [junit4]   2>       "state":"active",
   [junit4]   2>       "replicas":{"core_node2":{
   [junit4]   2>           "core":"control_collection_shard1_replica_n1",
   [junit4]   2>           "node_name":"127.0.0.1:36961_od_bj%2Fqz",
   [junit4]   2>           "base_url":"http://127.0.0.1:36961/od_bj/qz",
   [junit4]   2>           "state":"down",
   [junit4]   2>           "type":"NRT"}}}}}
   [junit4]   2> 1655106 DEBUG (OverseerStateUpdate-72093607347879940-127.0.0.1:36961_od_bj%2Fqz-n_0000000000) [n:127.0.0.1:36961_od_bj%2Fqz     ] o.a.s.c.o.ZkStateWriter going to update_collection /collections/control_collection/state.json version: 0
   [junit4]   2> 1655108 DEBUG (TEST-ShardSplitTest.testSplitLocking-seed#[3FD002A4FD03900C]-EventThread) [     ] o.a.s.c.c.SolrZkClient Submitting job to respond to event WatchedEvent state:SyncConnected type:NodeChildrenChanged path:/overseer/queue
   [junit4]   2> 1656001 DEBUG (qtp1835053110-25461) [n:127.0.0.1:36961_od_bj%2Fqz c:control_collection s:shard1  x:control_collection_shard1_replica_n1 ] o.a.s.c.c.ZkStateReader Loading collection config from: [/collections/control_collection]
   [junit4]   2> 1656009 INFO  (qtp1835053110-25461) [n:127.0.0.1:36961_od_bj%2Fqz c:control_collection s:shard1  x:control_collection_shard1_replica_n1 ] o.a.s.c.SolrConfig Using Lucene MatchVersion: 8.11.4
   [junit4]   2> 1656009 WARN  (qtp1835053110-25461) [n:127.0.0.1:36961_od_bj%2Fqz c:control_collection s:shard1  x:control_collection_shard1_replica_n1 ] o.a.s.c.SolrConfig solrconfig.xml: <jmx> is no longer supported, use solr.xml:/metrics/reporter section instead
   [junit4]   2> 1656012 INFO  (qtp1835053110-25461) [n:127.0.0.1:36961_od_bj%2Fqz c:control_collection s:shard1  x:control_collection_shard1_replica_n1 ] o.a.s.s.IndexSchema Schema name=test
   [junit4]   2> 1656016 INFO  (qtp1835053110-25461) [n:127.0.0.1:36961_od_bj%2Fqz c:control_collection s:shard1  x:control_collection_shard1_replica_n1 ] o.a.s.s.IndexSchema Loaded schema test/1.6 with uniqueid field id
   [junit4]   2> 1656032 INFO  (qtp1835053110-25461) [n:127.0.0.1:36961_od_bj%2Fqz c:control_collection s:shard1  x:control_collection_shard1_replica_n1 ] o.a.s.c.CoreContainer Creating SolrCore 'control_collection_shard1_replica_n1' using configuration from configset conf1, trusted=true
   [junit4]   2> 1656032 INFO  (qtp1835053110-25461) [n:127.0.0.1:36961_od_bj%2Fqz c:control_collection s:shard1  x:control_collection_shard1_replica_n1 ] o.a.s.m.r.SolrJmxReporter JMX monitoring for 'solr.core.control_collection.shard1.replica_n1' (registry 'solr.core.control_collection.shard1.replica_n1') enabled at server: com.sun.jmx.mbeanserver.JmxMBeanServer@5688f2c9
   [junit4]   2> 1656033 INFO  (qtp1835053110-25461) [n:127.0.0.1:36961_od_bj%2Fqz c:control_collection s:shard1  x:control_collection_shard1_replica_n1 ] o.a.s.c.SolrCore [[control_collection_shard1_replica_n1] ] Opening new SolrCore at [/home/jenkins/jenkins-slave/workspace/Lucene/Lucene-Solr-Tests-8.11/solr/build/solr-core/test/J3/temp/solr.cloud.api.collections.ShardSplitTest_3FD002A4FD03900C-001/control-001/cores/control_collection_shard1_replica_n1], dataDir=[/home/jenkins/jenkins-slave/workspace/Lucene/Lucene-Solr-Tests-8.11/solr/build/solr-core/test/J3/temp/solr.cloud.api.collections.ShardSplitTest_3FD002A4FD03900C-001/control-001/cores/control_collection_shard1_replica_n1/data/]
   [junit4]   2> 1656035 INFO  (qtp1835053110-25461) [n:127.0.0.1:36961_od_bj%2Fqz c:control_collection s:shard1  x:control_collection_shard1_replica_n1 ] o.a.s.u.RandomMergePolicy RandomMergePolicy wrapping class org.apache.lucene.index.TieredMergePolicy: [TieredMergePolicy: maxMergeAtOnce=20, maxMergeAtOnceExplicit=24, maxMergedSegmentMB=90.1767578125, floorSegmentMB=0.458984375, forceMergeDeletesPctAllowed=26.59648102553666, segmentsPerTier=28.0, maxCFSSegmentSizeMB=8.796093022207999E12, noCFSRatio=0.7770293828814097, deletesPctAllowed=27.791613588560455
   [junit4]   2> 1656052 WARN  (qtp1835053110-25461) [n:127.0.0.1:36961_od_bj%2Fqz c:control_collection s:shard1  x:control_collection_shard1_replica_n1 ] o.a.s.c.RequestHandlers INVALID paramSet a in requestHandler {type = requestHandler,name = /dump,class = DumpRequestHandler,attributes = {initParams=a, name=/dump, class=DumpRequestHandler},args = {defaults={a=A,b=B}}}
   [junit4]   2> 1656095 INFO  (qtp1835053110-25461) [n:127.0.0.1:36961_od_bj%2Fqz c:control_collection s:shard1  x:control_collection_shard1_replica_n1 ] o.a.s.u.UpdateHandler Using UpdateLog implementation: org.apache.solr.update.UpdateLog
   [junit4]   2> 1656095 INFO  (qtp1835053110-25461) [n:127.0.0.1:36961_od_bj%2Fqz c:control_collection s:shard1  x:control_collection_shard1_replica_n1 ] o.a.s.u.UpdateLog Initializing UpdateLog: dataDir= defaultSyncLevel=FLUSH numRecordsToKeep=100 maxNumLogsToKeep=10 numVersionBuckets=65536
   [junit4]   2> 1656096 INFO  (qtp1835053110-25461) [n:127.0.0.1:36961_od_bj%2Fqz c:control_collection s:shard1  x:control_collection_shard1_replica_n1 ] o.a.s.u.CommitTracker Hard AutoCommit: disabled
   [junit4]   2> 1656097 INFO  (qtp1835053110-25461) [n:127.0.0.1:36961_od_bj%2Fqz c:control_collection s:shard1  x:control_collection_shard1_replica_n1 ] o.a.s.u.CommitTracker Soft AutoCommit: disabled
   [junit4]   2> 1656097 INFO  (qtp1835053110-25461) [n:127.0.0.1:36961_od_bj%2Fqz c:control_collection s:shard1  x:control_collection_shard1_replica_n1 ] o.a.s.u.RandomMergePolicy RandomMergePolicy wrapping class org.apache.lucene.index.TieredMergePolicy: [TieredMergePolicy: maxMergeAtOnce=45, maxMergeAtOnceExplicit=13, maxMergedSegmentMB=42.28125, floorSegmentMB=1.2890625, forceMergeDeletesPctAllowed=28.878944598932268, segmentsPerTier=14.0, maxCFSSegmentSizeMB=8.796093022207999E12, noCFSRatio=0.7598259313835249, deletesPctAllowed=45.58361265675606
   [junit4]   2> 1656099 DEBUG (qtp1835053110-25461) [n:127.0.0.1:36961_od_bj%2Fqz c:control_collection s:shard1  x:control_collection_shard1_replica_n1 ] o.a.s.c.c.ZkStateReader Loading collection config from: [/collections/control_collection]
   [junit4]   2> 1656100 INFO  (qtp1835053110-25461) [n:127.0.0.1:36961_od_bj%2Fqz c:control_collection s:shard1  x:control_collection_shard1_replica_n1 ] o.a.s.r.ManagedResourceStorage Configured ZooKeeperStorageIO with znodeBase: /configs/conf1
   [junit4]   2> 1656101 INFO  (qtp1835053110-25461) [n:127.0.0.1:36961_od_bj%2Fqz c:control_collection s:shard1  x:control_collection_shard1_replica_n1 ] o.a.s.r.ManagedResourceStorage Loaded null at path _rest_managed.json using ZooKeeperStorageIO:path=/configs/conf1
   [junit4]   2> 1656101 INFO  (qtp1835053110-25461) [n:127.0.0.1:36961_od_bj%2Fqz c:control_collection s:shard1  x:control_collection_shard1_replica_n1 ] o.a.s.h.ReplicationHandler Commits will be reserved for 10000 ms
   [junit4]   2> 1656101 INFO  (qtp1835053110-25461) [n:127.0.0.1:36961_od_bj%2Fqz c:control_collection s:shard1  x:control_collection_shard1_replica_n1 ] o.a.s.u.UpdateLog Could not find max version in index or recent updates, using new clock 1796905779101433856
   [junit4]   2> 1656104 DEBUG (qtp1835053110-25461) [n:127.0.0.1:36961_od_bj%2Fqz c:control_collection s:shard1  x:control_collection_shard1_replica_n1 ] o.a.s.c.c.ZkStateReader Waiting up to 60000ms for state org.apache.solr.cloud.ZkController$$Lambda$623/1820666700@1bce6cd7
   [junit4]   2> 1656104 DEBUG (qtp1835053110-25461) [n:127.0.0.1:36961_od_bj%2Fqz c:control_collection s:shard1  x:control_collection_shard1_replica_n1 ] o.a.s.c.c.ZkStateReader Found org.apache.solr.cloud.ZkController$$Lambda$623/1820666700@1bce6cd7 directly in clusterState
   [junit4]   2> 1656105 DEBUG (qtp1835053110-25461) [n:127.0.0.1:36961_od_bj%2Fqz c:control_collection s:shard1  x:control_collection_shard1_replica_n1 ] o.a.s.c.c.SolrZkClient makePath: /collections/control_collection/terms/shard1
   [junit4]   2> 1656105 INFO  (searcherExecutor-16120-thread-1-processing-n:127.0.0.1:36961_od_bj%2Fqz x:control_collection_shard1_replica_n1 c:control_collection s:shard1) [n:127.0.0.1:36961_od_bj%2Fqz c:control_collection s:shard1  x:control_collection_shard1_replica_n1 ] o.a.s.c.SolrCore [control_collection_shard1_replica_n1]  Registered new searcher autowarm time: 0 ms
   [junit4]   2> 1656108 DEBUG (TEST-ShardSplitTest.testSplitLocking-seed#[3FD002A4FD03900C]-EventThread) [     ] o.a.s.c.c.SolrZkClient Submitting job to respond to event WatchedEvent state:SyncConnected type:NodeDataChanged path:/collections/control_collection/terms/shard1
   [junit4]   2> 1656108 INFO  (qtp1835053110-25461) [n:127.0.0.1:36961_od_bj%2Fqz c:control_collection s:shard1  x:control_collection_shard1_replica_n1 ] o.a.s.c.ZkShardTerms Successful update of terms at /collections/control_collection/terms/shard1 to Terms{values={core_node2=0}, version=0}
   [junit4]   2> 1656108 INFO  (qtp1835053110-25461) [n:127.0.0.1:36961_od_bj%2Fqz c:control_collection s:shard1  x:control_collection_shard1_replica_n1 ] o.a.s.c.ShardLeaderElectionContextBase make sure parent is created /collections/control_collection/leaders/shard1
   [junit4]   2> 1656108 DEBUG (qtp1835053110-25461) [n:127.0.0.1:36961_od_bj%2Fqz c:control_collection s:shard1  x:control_collection_shard1_replica_n1 ] o.a.s.c.c.SolrZkClient makePath: /collections/control_collection/leaders/shard1
   [junit4]   2> 1656110 DEBUG (qtp1835053110-25461) [n:127.0.0.1:36961_od_bj%2Fqz c:control_collection s:shard1  x:control_collection_shard1_replica_n1 ] o.a.s.c.c.SolrZkClient makePath: /collections/control_collection/leader_elect/shard1/election
   [junit4]   2> 1656112 INFO  (qtp1835053110-25461) [n:127.0.0.1:36961_od_bj%2Fqz c:control_collection s:shard1  x:control_collection_shard1_replica_n1 ] o.a.s.c.ShardLeaderElectionContext Enough replicas found to continue.
   [junit4]   2> 1656112 INFO  (qtp1835053110-25461) [n:127.0.0.1:36961_od_bj%2Fqz c:control_collection s:shard1  x:control_collection_shard1_replica_n1 ] o.a.s.c.ShardLeaderElectionContext I may be the new leader - try and sync
   [junit4]   2> 1656112 INFO  (qtp1835053110-25461) [n:127.0.0.1:36961_od_bj%2Fqz c:control_collection s:shard1  x:control_collection_shard1_replica_n1 ] o.a.s.c.SyncStrategy Sync replicas to http://127.0.0.1:36961/od_bj/qz/control_collection_shard1_replica_n1/
   [junit4]   2> 1656112 INFO  (qtp1835053110-25461) [n:127.0.0.1:36961_od_bj%2Fqz c:control_collection s:shard1  x:control_collection_shard1_replica_n1 ] o.a.s.c.SyncStrategy Sync Success - now sync replicas to me
   [junit4]   2> 1656112 INFO  (qtp1835053110-25461) [n:127.0.0.1:36961_od_bj%2Fqz c:control_collection s:shard1  x:control_collection_shard1_replica_n1 ] o.a.s.c.SyncStrategy http://127.0.0.1:36961/od_bj/qz/control_collection_shard1_replica_n1/ has no replicas
   [junit4]   2> 1656112 INFO  (qtp1835053110-25461) [n:127.0.0.1:36961_od_bj%2Fqz c:control_collection s:shard1  x:control_collection_shard1_replica_n1 ] o.a.s.c.ShardLeaderElectionContextBase Creating leader registration node /collections/control_collection/leaders/shard1/leader after winning as /collections/control_collection/leader_elect/shard1/election/72093607347879940-core_node2-n_0000000000
   [junit4]   2> 1656118 DEBUG (TEST-ShardSplitTest.testSplitLocking-seed#[3FD002A4FD03900C]-EventThread) [     ] o.a.s.c.c.SolrZkClient Submitting job to respond to event WatchedEvent state:SyncConnected type:NodeChildrenChanged path:/overseer/queue
   [junit4]   2> 1656119 INFO  (qtp1835053110-25461) [n:127.0.0.1:36961_od_bj%2Fqz c:control_collection s:shard1  x:control_collection_shard1_replica_n1 ] o.a.s.c.ShardLeaderElectionContext I am the new leader: http://127.0.0.1:36961/od_bj/qz/control_collection_shard1_replica_n1/ shard1
   [junit4]   2> 1656119 DEBUG (qtp1835053110-25461) [n:127.0.0.1:36961_od_bj%2Fqz c:control_collection s:shard1  x:control_collection_shard1_replica_n1 ] o.a.s.c.c.ZkStateReader already watching , added to stateWatchers
   [junit4]   2> 1656119 DEBUG (OverseerStateUpdate-72093607347879940-127.0.0.1:36961_od_bj%2Fqz-n_0000000000) [n:127.0.0.1:36961_od_bj%2Fqz     ] o.a.s.c.Overseer processMessage: queueSize: 1, message = {
   [junit4]   2>   "operation":"leader",
   [junit4]   2>   "shard":"shard1",
   [junit4]   2>   "collection":"control_collection",
   [junit4]   2>   "node_name":"127.0.0.1:36961_od_bj%2Fqz",
   [junit4]   2>   "base_url":"http://127.0.0.1:36961/od_bj/qz",
   [junit4]   2>   "core":"control_collection_shard1_replica_n1",
   [junit4]   2>   "state":"active"} current state version: 0
   [junit4]   2> 1656120 DEBUG (qtp1835053110-25461) [n:127.0.0.1:36961_od_bj%2Fqz c:control_collection s:shard1  x:control_collection_shard1_replica_n1 ] o.a.s.c.c.ZkStateReader Add data for [control_collection] ver [1]
   [junit4]   2> 1656120 DEBUG (qtp1835053110-25461) [n:127.0.0.1:36961_od_bj%2Fqz c:control_collection s:shard1  x:control_collection_shard1_replica_n1 ] o.a.s.c.c.ZkStateReader clusterStateSet: legacy [0] interesting [1] watched [1] lazy [2] total [2]
   [junit4]   2> 1656120 DEBUG (qtp1835053110-25461) [n:127.0.0.1:36961_od_bj%2Fqz c:control_collection s:shard1  x:control_collection_shard1_replica_n1 ] o.a.s.c.c.ZkStateReader updated per-replica states changed for: control_collection, ver: 0 , new vals: []
   [junit4]   2> 1656120 DEBUG (watches-16102-thread-1-processing-n:127.0.0.1:36961_od_bj%2Fqz x:control_collection_shard1_replica_n1 c:control_collection s:shard1) [n:127.0.0.1:36961_od_bj%2Fqz c:control_collection s:shard1  x:control_collection_shard1_replica_n1 ] o.a.s.c.c.ZkStateReader  CollectionStatePredicate failed for control_collection, cversion : -1
   [junit4]   2> 1656120 DEBUG (qtp1835053110-25461) [n:127.0.0.1:36961_od_bj%2Fqz c:control_collection s:shard1  x:control_collection_shard1_replica_n1 ] o.a.s.c.c.ZkStateReader clusterStateSet: legacy [0] interesting [1] watched [1] lazy [2] total [2]
   [junit4]   2> 1656120 DEBUG (qtp1835053110-25461) [n:127.0.0.1:36961_od_bj%2Fqz c:control_collection s:shard1  x:control_collection_shard1_replica_n1 ] o.a.s.c.c.ZkStateReader  CollectionStatePredicate failed for control_collection, cversion : -1
   [junit4]   2> 1656120 DEBUG (qtp1835053110-25461) [n:127.0.0.1:36961_od_bj%2Fqz c:control_collection s:shard1  x:control_collection_shard1_replica_n1 ] o.a.s.c.c.ZkStateReader  CollectionStatePredicate failed for control_collection, cversion : -1
   [junit4]   2> 1656120 DEBUG (watches-16102-thread-1-processing-n:127.0.0.1:36961_od_bj%2Fqz x:control_collection_shard1_replica_n1 c:control_collection s:shard1) [n:127.0.0.1:36961_od_bj%2Fqz c:control_collection s:shard1  x:control_collection_shard1_replica_n1 ] o.a.s.c.c.ZkStateReader  CollectionStatePredicate failed for control_collection, cversion : -1
   [junit4]   2> 1656120 DEBUG (qtp1835053110-25461) [n:127.0.0.1:36961_od_bj%2Fqz c:control_collection s:shard1  x:control_collection_shard1_replica_n1 ] o.a.s.c.c.ZkStateReader  CollectionStatePredicate failed for control_collection, cversion : -1
   [junit4]   2> 1656220 DEBUG (OverseerStateUpdate-72093607347879940-127.0.0.1:36961_od_bj%2Fqz-n_0000000000) [n:127.0.0.1:36961_od_bj%2Fqz     ] o.a.s.c.o.ZkStateWriter going to update_collection /collections/control_collection/state.json version: 1
   [junit4]   2> 1656220 DEBUG (TEST-ShardSplitTest.testSplitLocking-seed#[3FD002A4FD03900C]-EventThread) [     ] o.a.s.c.c.SolrZkClient Submitting job to respond to event WatchedEvent state:SyncConnected type:NodeDataChanged path:/collections/control_collection/state.json
   [junit4]   2> 1656220 INFO  (zkCallback-16100-thread-1) [     ] o.a.s.c.c.ZkStateReader A cluster state change: [WatchedEvent state:SyncConnected type:NodeDataChanged path:/collections/control_collection/state.json] for collection [control_collection] has occurred - updating... (live nodes size: [1])
   [junit4]   2> 1656221 DEBUG (TEST-ShardSplitTest.testSplitLocking-seed#[3FD002A4FD03900C]-EventThread) [     ] o.a.s.c.c.SolrZkClient Submitting job to respond to event WatchedEvent state:SyncConnected type:NodeChildrenChanged path:/overseer/queue
   [junit4]   2> 1656221 DEBUG (zkCallback-16100-thread-1) [     ] o.a.s.c.c.ZkStateReader Updating data for [control_collection] from [1] to [2]
   [junit4]   2> 1656221 DEBUG (zkCallback-16100-thread-1) [     ] o.a.s.c.c.ZkStateReader clusterStateSet: legacy [0] interesting [1] watched [1] lazy [2] total [2]
   [junit4]   2> 1656221 DEBUG (watches-16102-thread-1) [     ] o.a.s.c.c.ZkStateReader leader found for control_collection/shard1 to be core_node2:{
   [junit4]   2>   "core":"control_collection_shard1_replica_n1",
   [junit4]   2>   "node_name":"127.0.0.1:36961_od_bj%2Fqz",
   [junit4]   2>   "base_url":"http://127.0.0.1:36961/od_bj/qz",
   [junit4]   2>   "state":"down",
   [junit4]   2>   "type":"NRT",
   [junit4]   2>   "leader":"true"}
   [junit4]   2> 1656221 DEBUG (watches-16102-thread-1) [     ] o.a.s.c.c.ZkStateReader clusterStateSet: legacy [0] interesting [0] watched [0] lazy [2] total [2]
   [junit4]   2> 1656221 INFO  (qtp1835053110-25461) [n:127.0.0.1:36961_od_bj%2Fqz c:control_collection s:shard1  x:control_collection_shard1_replica_n1 ] o.a.s.c.ZkController I am the leader, no recovery necessary
   [junit4]   2> 1656222 DEBUG (TEST-ShardSplitTest.testSplitLocking-seed#[3FD002A4FD03900C]-EventThread) [     ] o.a.s.c.c.SolrZkClient Submitting job to respond to event WatchedEvent state:SyncConnected type:NodeChildrenChanged path:/overseer/queue
   [junit4]   2> 1656222 DEBUG (qtp1835053110-25461) [n:127.0.0.1:36961_od_bj%2Fqz c:control_collection s:shard1  x:control_collection_shard1_replica_n1 ] o.a.s.c.c.ZkStateReader Refreshing lazily-loaded state for collection control_collection
   [junit4]   2> 1656222 DEBUG (qtp1835053110-25461) [n:127.0.0.1:36961_od_bj%2Fqz c:control_collection s:shard1  x:control_collection_shard1_replica_n1 ] o.a.s.c.c.ZkStateReader already watching , added to stateWatchers
   [junit4]   2> 1656222 DEBUG (OverseerStateUpdate-72093607347879940-127.0.0.1:36961_od_bj%2Fqz-n_0000000000) [n:127.0.0.1:36961_od_bj%2Fqz     ] o.a.s.c.Overseer processMessage: queueSize: 1, message = {
   [junit4]   2>   "core":"control_collection_shard1_replica_n1",
   [junit4]   2>   "core_node_name":"core_node2",
   [junit4]   2>   "roles":null,
   [junit4]   2>   "node_name":"127.0.0.1:36961_od_bj%2Fqz",
   [junit4]   2>   "base_url":"http://127.0.0.1:36961/od_bj/qz",
   [junit4]   2>   "numShards":"1",
   [junit4]   2>   "state":"active",
   [junit4]   2>   "shard":"shard1",
   [junit4]   2>   "collection":"control_collection",
   [junit4]   2>   "type":"NRT",
   [junit4]   2>   "operation":"state"} current state version: 0
   [junit4]   2> 1656222 DEBUG (OverseerStateUpdate-72093607347879940-127.0.0.1:36961_od_bj%2Fqz-n_0000000000) [n:127.0.0.1:36961_od_bj%2Fqz     ] o.a.s.c.o.ReplicaMutator Update state numShards=1 message={
   [junit4]   2>   "core":"control_collection_shard1_replica_n1",
   [junit4]   2>   "core_node_name":"core_node2",
   [junit4]   2>   "roles":null,
   [junit4]   2>   "node_name":"127.0.0.1:36961_od_bj%2Fqz",
   [junit4]   2>   "base_url":"http://127.0.0.1:36961/od_bj/qz",
   [junit4]   2>   "numShards":"1",
   [junit4]   2>   "state":"active",
   [junit4]   2>   "shard":"shard1",
   [junit4]   2>   "collection":"control_collection",
   [junit4]   2>   "type":"NRT",
   [junit4]   2>   "operation":"state"}
   [junit4]   2> 1656223 DEBUG (OverseerStateUpdate-72093607347879940-127.0.0.1:36961_od_bj%2Fqz-n_0000000000) [n:127.0.0.1:36961_od_bj%2Fqz     ] o.a.s.c.o.ReplicaMutator Will update state for replica: core_node2:{
   [junit4]   2>   "core":"control_collection_shard1_replica_n1",
   [junit4]   2>   "node_name":"127.0.0.1:36961_od_bj%2Fqz",
   [junit4]   2>   "base_url":"http://127.0.0.1:36961/od_bj/qz",
   [junit4]   2>   "state":"active",
   [junit4]   2>   "type":"NRT",
   [junit4]   2>   "leader":"true"}
   [junit4]   2> 1656223 DEBUG (OverseerStateUpdate-72093607347879940-127.0.0.1:36961_od_bj%2Fqz-n_0000000000) [n:127.0.0.1:36961_od_bj%2Fqz     ] o.a.s.c.o.ReplicaMutator Collection is now: DocCollection(control_collection//collections/control_collection/state.json/2 )={
   [junit4]   2>   "pullReplicas":"0",
   [junit4]   2>   "replicationFactor":"1",
   [junit4]   2>   "router":{"name":"compositeId"},
   [junit4]   2>   "maxShardsPerNode":"1",
   [junit4]   2>   "autoAddReplicas":"false",
   [junit4]   2>   "nrtReplicas":"1",
   [junit4]   2>   "tlogReplicas":"0",
   [junit4]   2>   "shards":{"shard1":{
   [junit4]   2>       "range":"80000000-7fffffff",
   [junit4]   2>       "state":"active",
   [junit4]   2>       "replicas":{"core_node2":{
   [junit4]   2>           "core":"control_collection_shard1_replica_n1",
   [junit4]   2>           "node_name":"127.0.0.1:36961_od_bj%2Fqz",
   [junit4]   2>           "base_url":"http://127.0.0.1:36961/od_bj/qz",
   [junit4]   2>           "state":"active",
   [junit4]   2>           "type":"NRT",
   [junit4]   2>           "leader":"true"}}}}}
   [junit4]   2> 1656223 DEBUG (qtp1835053110-25461) [n:127.0.0.1:36961_od_bj%2Fqz c:control_collection s:shard1  x:control_collection_shard1_replica_n1 ] o.a.s.c.c.ZkStateReader Add data for [control_collection] ver [2]
   [junit4]   2> 1656223 DEBUG (qtp1835053110-25461) [n:127.0.0.1:36961_od_bj%2Fqz c:control_collection s:shard1  x:control_collection_shard1_replica_n1 ] o.a.s.c.c.ZkStateReader clusterStateSet: legacy [0] interesting [1] watched [1] lazy [2] total [2]
   [junit4]   2> 1656223 DEBUG (qtp1835053110-25461) [n:127.0.0.1:36961_od_bj%2Fqz c:control_collection s:shard1  x:control_collection_shard1_replica_n1 ] o.a.s.c.c.ZkStateReader updated per-replica states changed for: control_collection, ver: 0 , new vals: []
   [junit4]   2> 1656223 DEBUG (qtp1835053110-25461) [n:127.0.0.1:36961_od_bj%2Fqz c:control_collection s:shard1  x:control_collection_shard1_replica_n1 ] o.a.s.c.c.ZkStateReader clusterStateSet: legacy [0] interesting [1] watched [1] lazy [2] total [2]
   [junit4]   2> 1656224 INFO  (qtp1835053110-25461) [n:127.0.0.1:36961_od_bj%2Fqz    

[...truncated too long message...]

00C]) [     ] o.a.s.c.ZkTestServer Shutting down ZkTestServer.
   [junit4]   2> 1978560 WARN  (TEST-ShardSplitTest.testSplitShardWithRuleLink-seed#[3FD002A4FD03900C]-SendThread(127.0.0.1:42953)) [     ] o.a.z.ClientCnxn An exception was thrown while closing send thread for session 0x10020c5a6640000.
   [junit4]   2>           => EndOfStreamException: Unable to read additional data from server sessionid 0x10020c5a6640000, likely server has closed socket
   [junit4]   2> 	at org.apache.zookeeper.ClientCnxnSocketNIO.doIO(ClientCnxnSocketNIO.java:77)
   [junit4]   2> org.apache.zookeeper.ClientCnxn$EndOfStreamException: Unable to read additional data from server sessionid 0x10020c5a6640000, likely server has closed socket
   [junit4]   2> 	at org.apache.zookeeper.ClientCnxnSocketNIO.doIO(ClientCnxnSocketNIO.java:77) ~[zookeeper-3.6.2.jar:3.6.2]
   [junit4]   2> 	at org.apache.zookeeper.ClientCnxnSocketNIO.doTransport(ClientCnxnSocketNIO.java:350) ~[zookeeper-3.6.2.jar:3.6.2]
   [junit4]   2> 	at org.apache.zookeeper.ClientCnxn$SendThread.run(ClientCnxn.java:1275) [zookeeper-3.6.2.jar:3.6.2]
   [junit4]   2> 1978660 DEBUG (TEST-ShardSplitTest.testSplitShardWithRuleLink-seed#[3FD002A4FD03900C]-EventThread) [     ] o.a.s.c.c.SolrZkClient Submitting job to respond to event WatchedEvent state:Closed type:None path:null
   [junit4]   2> 1978661 WARN  (TEST-ShardSplitTest.testSplitShardWithRuleLink-seed#[3FD002A4FD03900C]-SendThread(127.0.0.1:42953)) [     ] o.a.z.ClientCnxn An exception was thrown while closing send thread for session 0x10020c5a6640001.
   [junit4]   2>           => EndOfStreamException: Unable to read additional data from server sessionid 0x10020c5a6640001, likely server has closed socket
   [junit4]   2> 	at org.apache.zookeeper.ClientCnxnSocketNIO.doIO(ClientCnxnSocketNIO.java:77)
   [junit4]   2> org.apache.zookeeper.ClientCnxn$EndOfStreamException: Unable to read additional data from server sessionid 0x10020c5a6640001, likely server has closed socket
   [junit4]   2> 	at org.apache.zookeeper.ClientCnxnSocketNIO.doIO(ClientCnxnSocketNIO.java:77) ~[zookeeper-3.6.2.jar:3.6.2]
   [junit4]   2> 	at org.apache.zookeeper.ClientCnxnSocketNIO.doTransport(ClientCnxnSocketNIO.java:350) ~[zookeeper-3.6.2.jar:3.6.2]
   [junit4]   2> 	at org.apache.zookeeper.ClientCnxn$SendThread.run(ClientCnxn.java:1275) [zookeeper-3.6.2.jar:3.6.2]
   [junit4]   2> 1978823 DEBUG (TEST-ShardSplitTest.testSplitShardWithRuleLink-seed#[3FD002A4FD03900C]-EventThread) [     ] o.a.s.c.c.SolrZkClient Submitting job to respond to event WatchedEvent state:Closed type:None path:null
   [junit4]   2> 1978825 WARN  (ZkTestServer Run Thread) [     ] o.a.s.c.ZkTestServer Watch limit violations: 
   [junit4]   2> Maximum concurrent create/delete watches above limit:
   [junit4]   2> 
   [junit4]   2> 	8	/solr/collections/shardSplitWithRule_link/terms/shard1_0
   [junit4]   2> 	8	/solr/collections/shardSplitWithRule_link/terms/shard1_1
   [junit4]   2> 	7	/solr/aliases.json
   [junit4]   2> 	6	/solr/collections/shardSplitWithRule_link/terms/shard1
   [junit4]   2> 	5	/solr/packages.json
   [junit4]   2> 	5	/solr/security.json
   [junit4]   2> 	5	/solr/configs/conf1
   [junit4]   2> 	5	/solr/collections/collection1/terms/shard1
   [junit4]   2> 	5	/solr/collections/collection1/terms/shard2
   [junit4]   2> 	4	/solr/collections/collection1/collectionprops.json
   [junit4]   2> 	4	/solr/collections/shardSplitWithRule_link/collectionprops.json
   [junit4]   2> 	2	/solr/collections/control_collection/terms/shard1
   [junit4]   2> 
   [junit4]   2> Maximum concurrent data watches above limit:
   [junit4]   2> 
   [junit4]   2> 	49	/solr/collections/collection1/state.json
   [junit4]   2> 	34	/solr/collections/shardSplitWithRule_link/state.json
   [junit4]   2> 	13	/solr/clusterprops.json
   [junit4]   2> 	7	/solr/collections/control_collection/state.json
   [junit4]   2> 	7	/solr/clusterstate.json
   [junit4]   2> 	2	/solr/overseer_elect/election/72093627310145548-127.0.0.1:37423_od_bj%2Fqz-n_0000000001
   [junit4]   2> 
   [junit4]   2> Maximum concurrent children watches above limit:
   [junit4]   2> 
   [junit4]   2> 	70	/solr/collections/shardSplitWithRule_link/state.json
   [junit4]   2> 	66	/solr/overseer/queue
   [junit4]   2> 	28	/solr/live_nodes
   [junit4]   2> 	22	/solr/overseer/collection-queue-work
   [junit4]   2> 	13	/solr/collections
   [junit4]   2> 	7	/solr/collections/collection1/state.json
   [junit4]   2> 	2	/solr/collections/control_collection/state.json
   [junit4]   2> 
   [junit4]   2> 1978829 INFO  (TEST-ShardSplitTest.testSplitShardWithRuleLink-seed#[3FD002A4FD03900C]) [     ] o.a.s.c.ZkTestServer waitForServerDown: 127.0.0.1:42953
   [junit4]   2> 1978829 INFO  (TEST-ShardSplitTest.testSplitShardWithRuleLink-seed#[3FD002A4FD03900C]) [     ] o.a.s.c.ZkTestServer parse host and port list: 127.0.0.1:42953
   [junit4]   2> 1978829 INFO  (TEST-ShardSplitTest.testSplitShardWithRuleLink-seed#[3FD002A4FD03900C]) [     ] o.a.s.c.ZkTestServer connecting to 127.0.0.1 42953
   [junit4]   2> 1978831 INFO  (SUITE-ShardSplitTest-seed#[3FD002A4FD03900C]-worker) [     ] o.a.s.u.ErrorLogMuter Closing ErrorLogMuter-regex-21321 after mutting 0 log messages
   [junit4]   2> 1978831 INFO  (SUITE-ShardSplitTest-seed#[3FD002A4FD03900C]-worker) [     ] o.a.s.u.ErrorLogMuter Creating ErrorLogMuter-regex-21322 for ERROR logs matching regex: ignore_exception
   [junit4]   2> NOTE: leaving temporary files on disk at: /home/jenkins/jenkins-slave/workspace/Lucene/Lucene-Solr-Tests-8.11/solr/build/solr-core/test/J3/temp/solr.cloud.api.collections.ShardSplitTest_3FD002A4FD03900C-001
   [junit4]   2> Apr 21, 2024 1:33:33 AM com.carrotsearch.randomizedtesting.ThreadLeakControl checkThreadLeaks
   [junit4]   2> WARNING: Will linger awaiting termination of 1 leaked thread(s).
   [junit4]   2> NOTE: test params are: codec=Asserting(Lucene87), sim=Asserting(RandomSimilarity(queryNorm=false): {}), locale=es-PE, timezone=Etc/GMT-7
   [junit4]   2> NOTE: Linux 4.15.0-213-generic amd64/Temurin 1.8.0_362 (64-bit)/cpus=4,threads=1,free=218982616,total=493879296
   [junit4]   2> NOTE: All tests run in this JVM: [CollectionPropsTest, HdfsTlogReplayBufferedWhileIndexingTest, TestSolrCLIRunExample, TestDynamicLoading, JWTAuthPluginIntegrationTest, PingRequestHandlerTest, TestBulkSchemaConcurrent, TestMinMaxOnMultiValuedField, TestInfoStreamLogging, TestNumericTerms32, ComputePlanActionTest, ResponseLogComponentTest, TestDeprecatedFilters, TestTermsQParserPlugin, CoreAdminRequestStatusTest, TestConfigSetsAPIExclusivity, ConnectionManagerTest, TestFieldCacheSortRandom, OutOfBoxZkACLAndCredentialsProvidersTest, DeleteStatusTest, TestCollectionsAPIViaSolrCloudCluster, RandomizedTaggerTest, CursorPagingTest, SolrMetricManagerTest, TestRequestStatusCollectionAPI, TestEmbeddedSolrServerSchemaAPI, TestStressIncrementalBackup, ConjunctionSolrSpellCheckerTest, AlternateDirectoryTest, TestNonDefinedSimilarityFactory, PeerSyncWithBufferUpdatesTest, TestBooleanSimilarityFactory, TestRandomFaceting, SOLR749Test, MBeansHandlerTest, TestReqParamsAPI, RootFieldTest, BigEndianAscendingWordDeserializerTest, TestChildDocTransformerHierarchy, SpellCheckCollatorTest, SparseHLLTest, CdcrWithNodesRestartsTest, ZkShardTermsTest, ZkCLITest, TermVectorComponentTest, TestStreamBody, QueryResultKeyTest, BJQParserTest, MinimalSchemaTest, JvmMetricsTest, SystemLogListenerTest, HdfsChaosMonkeyNothingIsSafeTest, OrderedExecutorTest, SignificantTermsQParserPluginTest, TestConfigOverlay, SolrXmlInZkTest, PolyFieldTest, V2StandaloneTest, TriggerIntegrationTest, ShardBackupIdTest, DateMathParserTest, TestFastLRUCache, TestLegacyFieldReuse, TestJavabinTupleStreamParser, TestQueryingOnDownCollection, TestNumericRangeQuery32, TestSchemaManager, TestClusterStateMutator, TestDelegationWithHadoopAuth, TestPseudoReturnFields, DeleteLastCustomShardedReplicaTest, TestMacros, TestHighFrequencyDictionaryFactory, TestStressUserVersions, TestNestedDocsSort, HdfsRecoveryZkTest, TestSimGenericDistributedQueue, FieldMutatingUpdateProcessorTest, CrossCollectionJoinQueryTest, TestUnifiedSolrHighlighterWithoutStoredId, ImplicitSnitchTest, SolrPluginUtilsTest, SolrShardReporterTest, ForceLeaderWithTlogReplicasTest, TestRandomCollapseQParserPlugin, ManagedSchemaRoundRobinCloudTest, TestJsonRangeFacets, DistributedFacetPivotWhiteBoxTest, V2CollectionBackupsAPIMappingTest, AutoscalingHistoryHandlerTest, LegacyCloudClusterPropTest, TestSearchPerf, TestDocTermOrdsUninvertLimit, TestLeaderElectionZkExpiry, OverseerRolesTest, TestInPlaceUpdatesStandalone, TestTlogReplayVsRecovery, TestUtilizeNode, TestIncrementalCoreBackup, TestQuerySenderNoQuery, NestedAtomicUpdateTest, AddReplicaTest, TestCSVLoader, TestSolrCloudWithSecureImpersonation, SolrJmxReporterCloudTest, TestBulkSchemaAPI, TestCollationFieldDocValues, TestHttpShardHandlerFactory, TokenizerChainTest, TestNoOpRegenerator, TestCollectionAPIs, XmlInterpolationTest, MetricTriggerTest, TestSerializedLuceneMatchVersion, ClassificationUpdateProcessorFactoryTest, HighlighterTest, ManagedSchemaDiffTest, AssignBackwardCompatibilityTest, BasicDistributedZkTest, CleanupOldIndexTest, DeleteInactiveReplicaTest, HttpPartitionOnCommitTest, HttpPartitionWithTlogReplicasTest, MultiSolrCloudTestCaseTest, OverriddenZkACLAndCredentialsProvidersTest, OverseerTaskQueueTest, ReplaceNodeNoTargetTest, ReplaceNodeTest, SSLMigrationTest, SaslZkACLProviderTest, ShardRoutingCustomTest, ShardTermsTest, SharedFSAutoReplicaFailoverTest, SliceStateTest, SolrCLIZkUtilsTest, SplitShardTest, TestCloudPhrasesIdentificationComponent, TestCloudSearcherWarming, TestPullReplicaWithAuth, TestRandomRequestDistribution, TestRebalanceLeaders, TestWaitForStateWithJettyShutdowns, TestWithCollection, TestZkChroot, ZkSolrClientTest, CollectionsAPIDistributedZkTest, PurgeGraphTest, ShardSplitTest]
   [junit4] Completed [668/959 (1!)] on J3 in 326.60s, 11 tests, 1 error, 3 skipped <<< FAILURES!

[...truncated 55257 lines...]