You are viewing a plain text version of this content. The canonical link for it is here.
Posted to builds@mesos.apache.org by Apache Jenkins Server <je...@builds.apache.org> on 2018/06/25 21:56:05 UTC

Build failed in Jenkins: Mesos-Reviewbot #22793

See <https://builds.apache.org/job/Mesos-Reviewbot/22793/display/redirect>

------------------------------------------
[...truncated 37.32 MB...]
I0625 21:55:59.698009 18288 slave.cpp:6929] Finished recovering checkpointed state from '/tmp/Endpoint_SlaveEndpointTest_AuthorizedRequest_2_I1LKat/meta', beginning agent recovery
I0625 21:55:59.698161 18287 task_status_update_manager.cpp:207] Recovering task status update manager
I0625 21:55:59.698477 18284 containerizer.cpp:718] Recovering Mesos containers
I0625 21:55:59.698840 18284 containerizer.cpp:1025] Recovering isolators
I0625 21:55:59.699461 18281 containerizer.cpp:1064] Recovering provisioner
I0625 21:55:59.700201 18293 provisioner.cpp:494] Provisioner recovery complete
I0625 21:55:59.700857 18288 composing.cpp:339] Finished recovering all containerizers
I0625 21:55:59.700974 18287 slave.cpp:7158] Recovering executors
I0625 21:55:59.701148 18287 slave.cpp:7311] Finished recovery
I0625 21:55:59.704380 18291 process.cpp:3583] Handling HTTP event for process 'slave(1009)' with path: '/slave(1009)/containers'
I0625 21:55:59.705868 18295 http.cpp:1099] HTTP GET for /slave(1009)/containers from 172.17.0.2:49086
I0625 21:55:59.705962 18295 http.cpp:936] Authorizing principal 'test-principal' to GET the '/containers' endpoint
I0625 21:55:59.709520 18288 slave.cpp:931] Agent terminating
[       OK ] Endpoint/SlaveEndpointTest.AuthorizedRequest/2 (33 ms)
[ RUN      ] Endpoint/SlaveEndpointTest.UnauthorizedRequest/0
I0625 21:55:59.722410 18277 containerizer.cpp:300] Using isolation { environment_secret, posix/cpu, posix/mem, filesystem/posix, network/cni }
W0625 21:55:59.722970 18277 backend.cpp:76] Failed to create 'aufs' backend: AufsBackend requires root privileges
W0625 21:55:59.723000 18277 backend.cpp:76] Failed to create 'bind' backend: BindBackend requires root privileges
I0625 21:55:59.723032 18277 provisioner.cpp:298] Using default backend 'copy'
I0625 21:55:59.727061 18289 slave.cpp:268] Mesos agent started on (1010)@172.17.0.2:46840
I0625 21:55:59.727087 18289 slave.cpp:269] Flags at startup: --acls="" --appc_simple_discovery_uri_prefix="http://" --appc_store_dir="/tmp/Endpoint_SlaveEndpointTest_UnauthorizedRequest_0_mN1imk/store/appc" --authenticate_http_readonly="true" --authenticate_http_readwrite="false" --authenticatee="crammd5" --authentication_backoff_factor="1secs" --authorizer="local" --cgroups_cpu_enable_pids_and_tids_count="false" --cgroups_enable_cfs="false" --cgroups_hierarchy="/sys/fs/cgroup" --cgroups_limit_swap="false" --cgroups_root="mesos" --container_disk_watch_interval="15secs" --containerizers="mesos" --credential="/tmp/Endpoint_SlaveEndpointTest_UnauthorizedRequest_0_mN1imk/credential" --default_role="*" --disallow_sharing_agent_pid_namespace="false" --disk_watch_interval="1mins" --docker="docker" --docker_kill_orphans="true" --docker_registry="https://registry-1.docker.io" --docker_remove_delay="6hrs" --docker_socket="/var/run/docker.sock" --docker_stop_timeout="0ns" --docker_store_dir="/tmp/Endpoint_SlaveEndpointTest_UnauthorizedRequest_0_mN1imk/store/docker" --docker_volume_checkpoint_dir="/var/run/mesos/isolators/docker/volume" --enforce_container_disk_quota="false" --executor_registration_timeout="1mins" --executor_reregistration_timeout="2secs" --executor_shutdown_grace_period="5secs" --fetcher_cache_dir="/tmp/Endpoint_SlaveEndpointTest_UnauthorizedRequest_0_mN1imk/fetch" --fetcher_cache_size="2GB" --fetcher_stall_timeout="1mins" --frameworks_home="" --gc_delay="1weeks" --gc_disk_headroom="0.1" --help="false" --hostname_lookup="true" --http_command_executor="false" --http_credentials="/tmp/Endpoint_SlaveEndpointTest_UnauthorizedRequest_0_mN1imk/http_credentials" --http_heartbeat_interval="30secs" --initialize_driver_logging="true" --isolation="posix/cpu,posix/mem" --launcher="posix" --launcher_dir="/tmp/SRC/build/mesos-1.7.0/_build/sub/src" --logbufsecs="0" --logging_level="INFO" --max_completed_executors_per_framework="150" --memory_profiling="false" --oversubscribed_resources_interval="15secs" --perf_duration="10secs" --perf_interval="1mins" --port="5051" --qos_correction_interval_min="0ns" --quiet="false" --reconfiguration_policy="equal" --recover="reconnect" --recovery_timeout="15mins" --registration_backoff_factor="10ms" --resources="cpus:2;gpus:0;mem:1024;disk:1024;ports:[31000-32000]" --revocable_cpu_low_priority="true" --runtime_dir="/tmp/Endpoint_SlaveEndpointTest_UnauthorizedRequest_0_mN1imk" --sandbox_directory="/mnt/mesos/sandbox" --strict="true" --switch_user="true" --systemd_enable_support="true" --systemd_runtime_directory="/run/systemd/system" --version="false" --work_dir="/tmp/Endpoint_SlaveEndpointTest_UnauthorizedRequest_0_kVLY5l" --zk_session_timeout="10secs"
I0625 21:55:59.727466 18289 credentials.hpp:86] Loading credential for authentication from '/tmp/Endpoint_SlaveEndpointTest_UnauthorizedRequest_0_mN1imk/credential'
I0625 21:55:59.727632 18289 slave.cpp:301] Agent using credential for: test-principal
I0625 21:55:59.727658 18289 credentials.hpp:37] Loading credentials for authentication from '/tmp/Endpoint_SlaveEndpointTest_UnauthorizedRequest_0_mN1imk/http_credentials'
I0625 21:55:59.727897 18289 http.cpp:959] Creating default 'basic' HTTP authenticator for realm 'mesos-agent-readonly'
I0625 21:55:59.728219 18289 disk_profile_adaptor.cpp:80] Creating default disk profile adaptor module
I0625 21:55:59.729475 18289 slave.cpp:616] Agent resources: [{"name":"cpus","scalar":{"value":2.0},"type":"SCALAR"},{"name":"mem","scalar":{"value":1024.0},"type":"SCALAR"},{"name":"disk","scalar":{"value":1024.0},"type":"SCALAR"},{"name":"ports","ranges":{"range":[{"begin":31000,"end":32000}]},"type":"RANGES"}]
I0625 21:55:59.729678 18289 slave.cpp:624] Agent attributes: [  ]
I0625 21:55:59.729697 18289 slave.cpp:633] Agent hostname: b38d1072b0fe
I0625 21:55:59.729838 18301 task_status_update_manager.cpp:181] Pausing sending task status updates
I0625 21:55:59.731318 18284 state.cpp:66] Recovering state from '/tmp/Endpoint_SlaveEndpointTest_UnauthorizedRequest_0_kVLY5l/meta'
I0625 21:55:59.731511 18287 slave.cpp:6929] Finished recovering checkpointed state from '/tmp/Endpoint_SlaveEndpointTest_UnauthorizedRequest_0_kVLY5l/meta', beginning agent recovery
I0625 21:55:59.731673 18283 task_status_update_manager.cpp:207] Recovering task status update manager
I0625 21:55:59.732023 18297 containerizer.cpp:718] Recovering Mesos containers
I0625 21:55:59.732337 18297 containerizer.cpp:1025] Recovering isolators
I0625 21:55:59.733013 18285 containerizer.cpp:1064] Recovering provisioner
I0625 21:55:59.733723 18301 provisioner.cpp:494] Provisioner recovery complete
I0625 21:55:59.734347 18287 composing.cpp:339] Finished recovering all containerizers
I0625 21:55:59.734467 18283 slave.cpp:7158] Recovering executors
I0625 21:55:59.734627 18283 slave.cpp:7311] Finished recovery
I0625 21:55:59.737805 18280 process.cpp:3583] Handling HTTP event for process 'slave(1010)' with path: '/slave(1010)/monitor/statistics'
I0625 21:55:59.739223 18284 http.cpp:1099] HTTP GET for /slave(1010)/monitor/statistics from 172.17.0.2:49088
I0625 21:55:59.739302 18284 http.cpp:936] Authorizing principal 'test-principal' to GET the '/monitor/statistics' endpoint
I0625 21:55:59.740797 18277 slave.cpp:931] Agent terminating
[       OK ] Endpoint/SlaveEndpointTest.UnauthorizedRequest/0 (32 ms)
[ RUN      ] Endpoint/SlaveEndpointTest.UnauthorizedRequest/1
I0625 21:55:59.753996 18277 containerizer.cpp:300] Using isolation { environment_secret, posix/cpu, posix/mem, filesystem/posix, network/cni }
W0625 21:55:59.754595 18277 backend.cpp:76] Failed to create 'aufs' backend: AufsBackend requires root privileges
W0625 21:55:59.754628 18277 backend.cpp:76] Failed to create 'bind' backend: BindBackend requires root privileges
I0625 21:55:59.754676 18277 provisioner.cpp:298] Using default backend 'copy'
I0625 21:55:59.758831 18288 slave.cpp:268] Mesos agent started on (1011)@172.17.0.2:46840
I0625 21:55:59.758859 18288 slave.cpp:269] Flags at startup: --acls="" --appc_simple_discovery_uri_prefix="http://" --appc_store_dir="/tmp/Endpoint_SlaveEndpointTest_UnauthorizedRequest_1_nHuGFd/store/appc" --authenticate_http_readonly="true" --authenticate_http_readwrite="false" --authenticatee="crammd5" --authentication_backoff_factor="1secs" --authorizer="local" --cgroups_cpu_enable_pids_and_tids_count="false" --cgroups_enable_cfs="false" --cgroups_hierarchy="/sys/fs/cgroup" --cgroups_limit_swap="false" --cgroups_root="mesos" --container_disk_watch_interval="15secs" --containerizers="mesos" --credential="/tmp/Endpoint_SlaveEndpointTest_UnauthorizedRequest_1_nHuGFd/credential" --default_role="*" --disallow_sharing_agent_pid_namespace="false" --disk_watch_interval="1mins" --docker="docker" --docker_kill_orphans="true" --docker_registry="https://registry-1.docker.io" --docker_remove_delay="6hrs" --docker_socket="/var/run/docker.sock" --docker_stop_timeout="0ns" --docker_store_dir="/tmp/Endpoint_SlaveEndpointTest_UnauthorizedRequest_1_nHuGFd/store/docker" --docker_volume_checkpoint_dir="/var/run/mesos/isolators/docker/volume" --enforce_container_disk_quota="false" --executor_registration_timeout="1mins" --executor_reregistration_timeout="2secs" --executor_shutdown_grace_period="5secs" --fetcher_cache_dir="/tmp/Endpoint_SlaveEndpointTest_UnauthorizedRequest_1_nHuGFd/fetch" --fetcher_cache_size="2GB" --fetcher_stall_timeout="1mins" --frameworks_home="" --gc_delay="1weeks" --gc_disk_headroom="0.1" --help="false" --hostname_lookup="true" --http_command_executor="false" --http_credentials="/tmp/Endpoint_SlaveEndpointTest_UnauthorizedRequest_1_nHuGFd/http_credentials" --http_heartbeat_interval="30secs" --initialize_driver_logging="true" --isolation="posix/cpu,posix/mem" --launcher="posix" --launcher_dir="/tmp/SRC/build/mesos-1.7.0/_build/sub/src" --logbufsecs="0" --logging_level="INFO" --max_completed_executors_per_framework="150" --memory_profiling="false" --oversubscribed_resources_interval="15secs" --perf_duration="10secs" --perf_interval="1mins" --port="5051" --qos_correction_interval_min="0ns" --quiet="false" --reconfiguration_policy="equal" --recover="reconnect" --recovery_timeout="15mins" --registration_backoff_factor="10ms" --resources="cpus:2;gpus:0;mem:1024;disk:1024;ports:[31000-32000]" --revocable_cpu_low_priority="true" --runtime_dir="/tmp/Endpoint_SlaveEndpointTest_UnauthorizedRequest_1_nHuGFd" --sandbox_directory="/mnt/mesos/sandbox" --strict="true" --switch_user="true" --systemd_enable_support="true" --systemd_runtime_directory="/run/systemd/system" --version="false" --work_dir="/tmp/Endpoint_SlaveEndpointTest_UnauthorizedRequest_1_ewPDkf" --zk_session_timeout="10secs"
I0625 21:55:59.759281 18288 credentials.hpp:86] Loading credential for authentication from '/tmp/Endpoint_SlaveEndpointTest_UnauthorizedRequest_1_nHuGFd/credential'
I0625 21:55:59.759477 18288 slave.cpp:301] Agent using credential for: test-principal
I0625 21:55:59.759502 18288 credentials.hpp:37] Loading credentials for authentication from '/tmp/Endpoint_SlaveEndpointTest_UnauthorizedRequest_1_nHuGFd/http_credentials'
I0625 21:55:59.759745 18288 http.cpp:959] Creating default 'basic' HTTP authenticator for realm 'mesos-agent-readonly'
I0625 21:55:59.760077 18288 disk_profile_adaptor.cpp:80] Creating default disk profile adaptor module
I0625 21:55:59.761337 18288 slave.cpp:616] Agent resources: [{"name":"cpus","scalar":{"value":2.0},"type":"SCALAR"},{"name":"mem","scalar":{"value":1024.0},"type":"SCALAR"},{"name":"disk","scalar":{"value":1024.0},"type":"SCALAR"},{"name":"ports","ranges":{"range":[{"begin":31000,"end":32000}]},"type":"RANGES"}]
I0625 21:55:59.761548 18288 slave.cpp:624] Agent attributes: [  ]
I0625 21:55:59.761565 18288 slave.cpp:633] Agent hostname: b38d1072b0fe
I0625 21:55:59.761714 18292 task_status_update_manager.cpp:181] Pausing sending task status updates
I0625 21:55:59.763224 18298 state.cpp:66] Recovering state from '/tmp/Endpoint_SlaveEndpointTest_UnauthorizedRequest_1_ewPDkf/meta'
I0625 21:55:59.763419 18284 slave.cpp:6929] Finished recovering checkpointed state from '/tmp/Endpoint_SlaveEndpointTest_UnauthorizedRequest_1_ewPDkf/meta', beginning agent recovery
I0625 21:55:59.763557 18298 task_status_update_manager.cpp:207] Recovering task status update manager
I0625 21:55:59.763882 18290 containerizer.cpp:718] Recovering Mesos containers
I0625 21:55:59.764235 18290 containerizer.cpp:1025] Recovering isolators
I0625 21:55:59.764884 18296 containerizer.cpp:1064] Recovering provisioner
I0625 21:55:59.765624 18292 provisioner.cpp:494] Provisioner recovery complete
I0625 21:55:59.766310 18284 composing.cpp:339] Finished recovering all containerizers
I0625 21:55:59.766432 18298 slave.cpp:7158] Recovering executors
I0625 21:55:59.766595 18298 slave.cpp:7311] Finished recovery
I0625 21:55:59.770081 18296 process.cpp:3583] Handling HTTP event for process 'slave(1011)' with path: '/slave(1011)/monitor/statistics.json'
I0625 21:55:59.771957 18289 http.cpp:1099] HTTP GET for /slave(1011)/monitor/statistics.json from 172.17.0.2:49090
I0625 21:55:59.772042 18289 http.cpp:936] Authorizing principal 'test-principal' to GET the '/monitor/statistics.json' endpoint
I0625 21:55:59.773648 18294 slave.cpp:931] Agent terminating
[       OK ] Endpoint/SlaveEndpointTest.UnauthorizedRequest/1 (32 ms)
[ RUN      ] Endpoint/SlaveEndpointTest.UnauthorizedRequest/2
I0625 21:55:59.786620 18277 containerizer.cpp:300] Using isolation { environment_secret, posix/cpu, posix/mem, filesystem/posix, network/cni }
W0625 21:55:59.787189 18277 backend.cpp:76] Failed to create 'aufs' backend: AufsBackend requires root privileges
W0625 21:55:59.787220 18277 backend.cpp:76] Failed to create 'bind' backend: BindBackend requires root privileges
I0625 21:55:59.787253 18277 provisioner.cpp:298] Using default backend 'copy'
I0625 21:55:59.791410 18298 slave.cpp:268] Mesos agent started on (1012)@172.17.0.2:46840
I0625 21:55:59.791440 18298 slave.cpp:269] Flags at startup: --acls="" --appc_simple_discovery_uri_prefix="http://" --appc_store_dir="/tmp/Endpoint_SlaveEndpointTest_UnauthorizedRequest_2_u3ppi7/store/appc" --authenticate_http_readonly="true" --authenticate_http_readwrite="false" --authenticatee="crammd5" --authentication_backoff_factor="1secs" --authorizer="local" --cgroups_cpu_enable_pids_and_tids_count="false" --cgroups_enable_cfs="false" --cgroups_hierarchy="/sys/fs/cgroup" --cgroups_limit_swap="false" --cgroups_root="mesos" --container_disk_watch_interval="15secs" --containerizers="mesos" --credential="/tmp/Endpoint_SlaveEndpointTest_UnauthorizedRequest_2_u3ppi7/credential" --default_role="*" --disallow_sharing_agent_pid_namespace="false" --disk_watch_interval="1mins" --docker="docker" --docker_kill_orphans="true" --docker_registry="https://registry-1.docker.io" --docker_remove_delay="6hrs" --docker_socket="/var/run/docker.sock" --docker_stop_timeout="0ns" --docker_store_dir="/tmp/Endpoint_SlaveEndpointTest_UnauthorizedRequest_2_u3ppi7/store/docker" --docker_volume_checkpoint_dir="/var/run/mesos/isolators/docker/volume" --enforce_container_disk_quota="false" --executor_registration_timeout="1mins" --executor_reregistration_timeout="2secs" --executor_shutdown_grace_period="5secs" --fetcher_cache_dir="/tmp/Endpoint_SlaveEndpointTest_UnauthorizedRequest_2_u3ppi7/fetch" --fetcher_cache_size="2GB" --fetcher_stall_timeout="1mins" --frameworks_home="" --gc_delay="1weeks" --gc_disk_headroom="0.1" --help="false" --hostname_lookup="true" --http_command_executor="false" --http_credentials="/tmp/Endpoint_SlaveEndpointTest_UnauthorizedRequest_2_u3ppi7/http_credentials" --http_heartbeat_interval="30secs" --initialize_driver_logging="true" --isolation="posix/cpu,posix/mem" --launcher="posix" --launcher_dir="/tmp/SRC/build/mesos-1.7.0/_build/sub/src" --logbufsecs="0" --logging_level="INFO" --max_completed_executors_per_framework="150" --memory_profiling="false" --oversubscribed_resources_interval="15secs" --perf_duration="10secs" --perf_interval="1mins" --port="5051" --qos_correction_interval_min="0ns" --quiet="false" --reconfiguration_policy="equal" --recover="reconnect" --recovery_timeout="15mins" --registration_backoff_factor="10ms" --resources="cpus:2;gpus:0;mem:1024;disk:1024;ports:[31000-32000]" --revocable_cpu_low_priority="true" --runtime_dir="/tmp/Endpoint_SlaveEndpointTest_UnauthorizedRequest_2_u3ppi7" --sandbox_directory="/mnt/mesos/sandbox" --strict="true" --switch_user="true" --systemd_enable_support="true" --systemd_runtime_directory="/run/systemd/system" --version="false" --work_dir="/tmp/Endpoint_SlaveEndpointTest_UnauthorizedRequest_2_fuwvS8" --zk_session_timeout="10secs"
I0625 21:55:59.791906 18298 credentials.hpp:86] Loading credential for authentication from '/tmp/Endpoint_SlaveEndpointTest_UnauthorizedRequest_2_u3ppi7/credential'
I0625 21:55:59.792114 18298 slave.cpp:301] Agent using credential for: test-principal
I0625 21:55:59.792141 18298 credentials.hpp:37] Loading credentials for authentication from '/tmp/Endpoint_SlaveEndpointTest_UnauthorizedRequest_2_u3ppi7/http_credentials'
I0625 21:55:59.792387 18298 http.cpp:959] Creating default 'basic' HTTP authenticator for realm 'mesos-agent-readonly'
I0625 21:55:59.792738 18298 disk_profile_adaptor.cpp:80] Creating default disk profile adaptor module
I0625 21:55:59.794028 18298 slave.cpp:616] Agent resources: [{"name":"cpus","scalar":{"value":2.0},"type":"SCALAR"},{"name":"mem","scalar":{"value":1024.0},"type":"SCALAR"},{"name":"disk","scalar":{"value":1024.0},"type":"SCALAR"},{"name":"ports","ranges":{"range":[{"begin":31000,"end":32000}]},"type":"RANGES"}]
I0625 21:55:59.794237 18298 slave.cpp:624] Agent attributes: [  ]
I0625 21:55:59.794255 18298 slave.cpp:633] Agent hostname: b38d1072b0fe
I0625 21:55:59.794414 18295 task_status_update_manager.cpp:181] Pausing sending task status updates
I0625 21:55:59.796052 18279 state.cpp:66] Recovering state from '/tmp/Endpoint_SlaveEndpointTest_UnauthorizedRequest_2_fuwvS8/meta'
I0625 21:55:59.796283 18289 slave.cpp:6929] Finished recovering checkpointed state from '/tmp/Endpoint_SlaveEndpointTest_UnauthorizedRequest_2_fuwvS8/meta', beginning agent recovery
I0625 21:55:59.796507 18299 task_status_update_manager.cpp:207] Recovering task status update manager
I0625 21:55:59.796814 18282 containerizer.cpp:718] Recovering Mesos containers
I0625 21:55:59.797184 18282 containerizer.cpp:1025] Recovering isolators
I0625 21:55:59.797842 18285 containerizer.cpp:1064] Recovering provisioner
I0625 21:55:59.798602 18295 provisioner.cpp:494] Provisioner recovery complete
I0625 21:55:59.799269 18289 composing.cpp:339] Finished recovering all containerizers
I0625 21:55:59.799398 18299 slave.cpp:7158] Recovering executors
I0625 21:55:59.799588 18299 slave.cpp:7311] Finished recovery
I0625 21:55:59.802752 18285 process.cpp:3583] Handling HTTP event for process 'slave(1012)' with path: '/slave(1012)/containers'
I0625 21:55:59.804637 18280 http.cpp:1099] HTTP GET for /slave(1012)/containers from 172.17.0.2:49092
I0625 21:55:59.804738 18280 http.cpp:936] Authorizing principal 'test-principal' to GET the '/containers' endpoint
I0625 21:55:59.806346 18296 slave.cpp:931] Agent terminating
[       OK ] Endpoint/SlaveEndpointTest.UnauthorizedRequest/2 (33 ms)
[ RUN      ] Endpoint/SlaveEndpointTest.NoAuthorizer/0
I0625 21:55:59.820837 18277 containerizer.cpp:300] Using isolation { environment_secret, posix/cpu, posix/mem, filesystem/posix, network/cni }
W0625 21:55:59.821442 18277 backend.cpp:76] Failed to create 'aufs' backend: AufsBackend requires root privileges
W0625 21:55:59.821473 18277 backend.cpp:76] Failed to create 'bind' backend: BindBackend requires root privileges
I0625 21:55:59.821508 18277 provisioner.cpp:298] Using default backend 'copy'
I0625 21:55:59.823720 18277 cluster.cpp:479] Creating default 'local' authorizer
I0625 21:55:59.825948 18296 slave.cpp:268] Mesos agent started on (1013)@172.17.0.2:46840
I0625 21:55:59.826009 18296 slave.cpp:269] Flags at startup: --acls="" --appc_simple_discovery_uri_prefix="http://" --appc_store_dir="/tmp/Endpoint_SlaveEndpointTest_NoAuthorizer_0_kGV5e1/store/appc" --authenticate_http_readonly="true" --authenticate_http_readwrite="false" --authenticatee="crammd5" --authentication_backoff_factor="1secs" --authorizer="local" --cgroups_cpu_enable_pids_and_tids_count="false" --cgroups_enable_cfs="false" --cgroups_hierarchy="/sys/fs/cgroup" --cgroups_limit_swap="false" --cgroups_root="mesos" --container_disk_watch_interval="15secs" --containerizers="mesos" --credential="/tmp/Endpoint_SlaveEndpointTest_NoAuthorizer_0_kGV5e1/credential" --default_role="*" --disallow_sharing_agent_pid_namespace="false" --disk_watch_interval="1mins" --docker="docker" --docker_kill_orphans="true" --docker_registry="https://registry-1.docker.io" --docker_remove_delay="6hrs" --docker_socket="/var/run/docker.sock" --docker_stop_timeout="0ns" --docker_store_dir="/tmp/Endpoint_SlaveEndpointTest_NoAuthorizer_0_kGV5e1/store/docker" --docker_volume_checkpoint_dir="/var/run/mesos/isolators/docker/volume" --enforce_container_disk_quota="false" --executor_registration_timeout="1mins" --executor_reregistration_timeout="2secs" --executor_shutdown_grace_period="5secs" --fetcher_cache_dir="/tmp/Endpoint_SlaveEndpointTest_NoAuthorizer_0_kGV5e1/fetch" --fetcher_cache_size="2GB" --fetcher_stall_timeout="1mins" --frameworks_home="" --gc_delay="1weeks" --gc_disk_headroom="0.1" --help="false" --hostname_lookup="true" --http_command_executor="false" --http_credentials="/tmp/Endpoint_SlaveEndpointTest_NoAuthorizer_0_kGV5e1/http_credentials" --http_heartbeat_interval="30secs" --initialize_driver_logging="true" --isolation="posix/cpu,posix/mem" --launcher="posix" --launcher_dir="/tmp/SRC/build/mesos-1.7.0/_build/sub/src" --logbufsecs="0" --logging_level="INFO" --max_completed_executors_per_framework="150" --memory_profiling="false" --oversubscribed_resources_interval="15secs" --perf_duration="10secs" --perf_interval="1mins" --port="5051" --qos_correction_interval_min="0ns" --quiet="false" --reconfiguration_policy="equal" --recover="reconnect" --recovery_timeout="15mins" --registration_backoff_factor="10ms" --resources="cpus:2;gpus:0;mem:1024;disk:1024;ports:[31000-32000]" --revocable_cpu_low_priority="true" --runtime_dir="/tmp/Endpoint_SlaveEndpointTest_NoAuthorizer_0_kGV5e1" --sandbox_directory="/mnt/mesos/sandbox" --strict="true" --switch_user="true" --systemd_enable_support="true" --systemd_runtime_directory="/run/systemd/system" --version="false" --work_dir="/tmp/Endpoint_SlaveEndpointTest_NoAuthorizer_0_AXQaK2" --zk_session_timeout="10secs"
I0625 21:55:59.826702 18296 credentials.hpp:86] Loading credential for authentication from '/tmp/Endpoint_SlaveEndpointTest_NoAuthorizer_0_kGV5e1/credential'
I0625 21:55:59.826937 18296 slave.cpp:301] Agent using credential for: test-principal
I0625 21:55:59.826972 18296 credentials.hpp:37] Loading credentials for authentication from '/tmp/Endpoint_SlaveEndpointTest_NoAuthorizer_0_kGV5e1/http_credentials'
I0625 21:55:59.827328 18296 http.cpp:959] Creating default 'basic' HTTP authenticator for realm 'mesos-agent-readonly'
I0625 21:55:59.827785 18296 disk_profile_adaptor.cpp:80] Creating default disk profile adaptor module
I0625 21:55:59.829123 18296 slave.cpp:616] Agent resources: [{"name":"cpus","scalar":{"value":2.0},"type":"SCALAR"},{"name":"mem","scalar":{"value":1024.0},"type":"SCALAR"},{"name":"disk","scalar":{"value":1024.0},"type":"SCALAR"},{"name":"ports","ranges":{"range":[{"begin":31000,"end":32000}]},"type":"RANGES"}]
I0625 21:55:59.829339 18296 slave.cpp:624] Agent attributes: [  ]
I0625 21:55:59.829356 18296 slave.cpp:633] Agent hostname: b38d1072b0fe
I0625 21:55:59.829527 18300 task_status_update_manager.cpp:181] Pausing sending task status updates
I0625 21:55:59.831215 18289 state.cpp:66] Recovering state from '/tmp/Endpoint_SlaveEndpointTest_NoAuthorizer_0_AXQaK2/meta'
I0625 21:55:59.831431 18280 slave.cpp:6929] Finished recovering checkpointed state from '/tmp/Endpoint_SlaveEndpointTest_NoAuthorizer_0_AXQaK2/meta', beginning agent recovery
I0625 21:55:59.831583 18289 task_status_update_manager.cpp:207] Recovering task status update manager
I0625 21:55:59.831895 18291 containerizer.cpp:718] Recovering Mesos containers
I0625 21:55:59.832226 18291 containerizer.cpp:1025] Recovering isolators
I0625 21:55:59.832854 18292 containerizer.cpp:1064] Recovering provisioner
I0625 21:55:59.833616 18300 provisioner.cpp:494] Provisioner recovery complete
I0625 21:55:59.834393 18279 composing.cpp:339] Finished recovering all containerizers
I0625 21:55:59.834563 18280 slave.cpp:7158] Recovering executors
I0625 21:55:59.834733 18280 slave.cpp:7311] Finished recovery
I0625 21:55:59.837978 18292 process.cpp:3583] Handling HTTP event for process 'slave(1013)' with path: '/slave(1013)/monitor/statistics'
I0625 21:55:59.839663 18298 http.cpp:1099] HTTP GET for /slave(1013)/monitor/statistics from 172.17.0.2:49094
I0625 21:55:59.839767 18298 http.cpp:936] Authorizing principal 'test-principal' to GET the '/monitor/statistics' endpoint
I0625 21:55:59.842855 18297 slave.cpp:931] Agent terminating
[       OK ] Endpoint/SlaveEndpointTest.NoAuthorizer/0 (36 ms)
[ RUN      ] Endpoint/SlaveEndpointTest.NoAuthorizer/1
I0625 21:55:59.857652 18277 containerizer.cpp:300] Using isolation { environment_secret, posix/cpu, posix/mem, filesystem/posix, network/cni }
W0625 21:55:59.858280 18277 backend.cpp:76] Failed to create 'aufs' backend: AufsBackend requires root privileges
W0625 21:55:59.858311 18277 backend.cpp:76] Failed to create 'bind' backend: BindBackend requires root privileges
I0625 21:55:59.858347 18277 provisioner.cpp:298] Using default backend 'copy'
I0625 21:55:59.860817 18277 cluster.cpp:479] Creating default 'local' authorizer
I0625 21:55:59.863747 18278 slave.cpp:268] Mesos agent started on (1014)@172.17.0.2:46840
I0625 21:55:59.863776 18278 slave.cpp:269] Flags at startup: --acls="" --appc_simple_discovery_uri_prefix="http://" --appc_store_dir="/tmp/Endpoint_SlaveEndpointTest_NoAuthorizer_1_vttjxV/store/appc" --authenticate_http_readonly="true" --authenticate_http_readwrite="false" --authenticatee="crammd5" --authentication_backoff_factor="1secs" --authorizer="local" --cgroups_cpu_enable_pids_and_tids_count="false" --cgroups_enable_cfs="false" --cgroups_hierarchy="/sys/fs/cgroup" --cgroups_limit_swap="false" --cgroups_root="mesos" --container_disk_watch_interval="15secs" --containerizers="mesos" --credential="/tmp/Endpoint_SlaveEndpointTest_NoAuthorizer_1_vttjxV/credential" --default_role="*" --disallow_sharing_agent_pid_namespace="false" --disk_watch_interval="1mins" --docker="docker" --docker_kill_orphans="true" --docker_registry="https://registry-1.docker.io" --docker_remove_delay="6hrs" --docker_socket="/var/run/docker.sock" --docker_stop_timeout="0ns" --docker_store_dir="/tmp/Endpoint_SlaveEndpointTest_NoAuthorizer_1_vttjxV/store/docker" --docker_volume_checkpoint_dir="/var/run/mesos/isolators/docker/volume" --enforce_container_disk_quota="false" --executor_registration_timeout="1mins" --executor_reregistration_timeout="2secs" --executor_shutdown_grace_period="5secs" --fetcher_cache_dir="/tmp/Endpoint_SlaveEndpointTest_NoAuthorizer_1_vttjxV/fetch" --fetcher_cache_size="2GB" --fetcher_stall_timeout="1mins" --frameworks_home="" --gc_delay="1weeks" --gc_disk_headroom="0.1" --help="false" --hostname_lookup="true" --http_command_executor="false" --http_credentials="/tmp/Endpoint_SlaveEndpointTest_NoAuthorizer_1_vttjxV/http_credentials" --http_heartbeat_interval="30secs" --initialize_driver_logging="true" --isolation="posix/cpu,posix/mem" --launcher="posix" --launcher_dir="/tmp/SRC/build/mesos-1.7.0/_build/sub/src" --logbufsecs="0" --logging_level="INFO" --max_completed_executors_per_framework="150" --memory_profiling="false" --oversubscribed_resources_interval="15secs" --perf_duration="10secs" --perf_interval="1mins" --port="5051" --qos_correction_interval_min="0ns" --quiet="false" --reconfiguration_policy="equal" --recover="reconnect" --recovery_timeout="15mins" --registration_backoff_factor="10ms" --resources="cpus:2;gpus:0;mem:1024;disk:1024;ports:[31000-32000]" --revocable_cpu_low_priority="true" --runtime_dir="/tmp/Endpoint_SlaveEndpointTest_NoAuthorizer_1_vttjxV" --sandbox_directory="/mnt/mesos/sandbox" --strict="true" --switch_user="true" --systemd_enable_support="true" --systemd_runtime_directory="/run/systemd/system" --version="false" --work_dir="/tmp/Endpoint_SlaveEndpointTest_NoAuthorizer_1_wrnXWW" --zk_session_timeout="10secs"
I0625 21:55:59.864245 18278 credentials.hpp:86] Loading credential for authentication from '/tmp/Endpoint_SlaveEndpointTest_NoAuthorizer_1_vttjxV/credential'
I0625 21:55:59.864480 18278 slave.cpp:301] Agent using credential for: test-principal
I0625 21:55:59.864506 18278 credentials.hpp:37] Loading credentials for authentication from '/tmp/Endpoint_SlaveEndpointTest_NoAuthorizer_1_vttjxV/http_credentials'
I0625 21:55:59.864763 18278 http.cpp:959] Creating default 'basic' HTTP authenticator for realm 'mesos-agent-readonly'
I0625 21:55:59.865115 18278 disk_profile_adaptor.cpp:80] Creating default disk profile adaptor module
I0625 21:55:59.866443 18278 slave.cpp:616] Agent resources: [{"name":"cpus","scalar":{"value":2.0},"type":"SCALAR"},{"name":"mem","scalar":{"value":1024.0},"type":"SCALAR"},{"name":"disk","scalar":{"value":1024.0},"type":"SCALAR"},{"name":"ports","ranges":{"range":[{"begin":31000,"end":32000}]},"type":"RANGES"}]
I0625 21:55:59.866659 18278 slave.cpp:624] Agent attributes: [  ]
I0625 21:55:59.866680 18278 slave.cpp:633] Agent hostname: b38d1072b0fe
I0625 21:55:59.866842 18284 task_status_update_manager.cpp:181] Pausing sending task status updates
I0625 21:55:59.868374 18286 state.cpp:66] Recovering state from '/tmp/Endpoint_SlaveEndpointTest_NoAuthorizer_1_wrnXWW/meta'
I0625 21:55:59.868592 18289 slave.cpp:6929] Finished recovering checkpointed state from '/tmp/Endpoint_SlaveEndpointTest_NoAuthorizer_1_wrnXWW/meta', beginning agent recovery
I0625 21:55:59.868788 18281 task_status_update_manager.cpp:207] Recovering task status update manager
I0625 21:55:59.869143 18282 containerizer.cpp:718] Recovering Mesos containers
I0625 21:55:59.869451 18282 containerizer.cpp:1025] Recovering isolators
I0625 21:55:59.870110 18298 containerizer.cpp:1064] Recovering provisioner
I0625 21:55:59.870810 18296 provisioner.cpp:494] Provisioner recovery complete
I0625 21:55:59.871476 18291 composing.cpp:339] Finished recovering all containerizers
I0625 21:55:59.871614 18289 slave.cpp:7158] Recovering executors
I0625 21:55:59.871851 18289 slave.cpp:7311] Finished recovery
I0625 21:55:59.875123 18298 process.cpp:3583] Handling HTTP event for process 'slave(1014)' with path: '/slave(1014)/monitor/statistics.json'
I0625 21:55:59.876907 18278 http.cpp:1099] HTTP GET for /slave(1014)/monitor/statistics.json from 172.17.0.2:49096
I0625 21:55:59.876999 18278 http.cpp:936] Authorizing principal 'test-principal' to GET the '/monitor/statistics.json' endpoint
I0625 21:55:59.879834 18293 slave.cpp:931] Agent terminating
[       OK ] Endpoint/SlaveEndpointTest.NoAuthorizer/1 (36 ms)
[ RUN      ] Endpoint/SlaveEndpointTest.NoAuthorizer/2
I0625 21:55:59.893622 18277 containerizer.cpp:300] Using isolation { environment_secret, posix/cpu, posix/mem, filesystem/posix, network/cni }
W0625 21:55:59.894212 18277 backend.cpp:76] Failed to create 'aufs' backend: AufsBackend requires root privileges
W0625 21:55:59.894242 18277 backend.cpp:76] Failed to create 'bind' backend: BindBackend requires root privileges
I0625 21:55:59.894278 18277 provisioner.cpp:298] Using default backend 'copy'
I0625 21:55:59.896299 18277 cluster.cpp:479] Creating default 'local' authorizer
I0625 21:55:59.898490 18299 slave.cpp:268] Mesos agent started on (1015)@172.17.0.2:46840
I0625 21:55:59.898525 18299 slave.cpp:269] Flags at startup: --acls="" --appc_simple_discovery_uri_prefix="http://" --appc_store_dir="/tmp/Endpoint_SlaveEndpointTest_NoAuthorizer_2_IkphbQ/store/appc" --authenticate_http_readonly="true" --authenticate_http_readwrite="false" --authenticatee="crammd5" --authentication_backoff_factor="1secs" --authorizer="local" --cgroups_cpu_enable_pids_and_tids_count="false" --cgroups_enable_cfs="false" --cgroups_hierarchy="/sys/fs/cgroup" --cgroups_limit_swap="false" --cgroups_root="mesos" --container_disk_watch_interval="15secs" --containerizers="mesos" --credential="/tmp/Endpoint_SlaveEndpointTest_NoAuthorizer_2_IkphbQ/credential" --default_role="*" --disallow_sharing_agent_pid_namespace="false" --disk_watch_interval="1mins" --docker="docker" --docker_kill_orphans="true" --docker_registry="https://registry-1.docker.io" --docker_remove_delay="6hrs" --docker_socket="/var/run/docker.sock" --docker_stop_timeout="0ns" --docker_store_dir="/tmp/Endpoint_SlaveEndpointTest_NoAuthorizer_2_IkphbQ/store/docker" --docker_volume_checkpoint_dir="/var/run/mesos/isolators/docker/volume" --enforce_container_disk_quota="false" --executor_registration_timeout="1mins" --executor_reregistration_timeout="2secs" --executor_shutdown_grace_period="5secs" --fetcher_cache_dir="/tmp/Endpoint_SlaveEndpointTest_NoAuthorizer_2_IkphbQ/fetch" --fetcher_cache_size="2GB" --fetcher_stall_timeout="1mins" --frameworks_home="" --gc_delay="1weeks" --gc_disk_headroom="0.1" --help="false" --hostname_lookup="true" --http_command_executor="false" --http_credentials="/tmp/Endpoint_SlaveEndpointTest_NoAuthorizer_2_IkphbQ/http_credentials" --http_heartbeat_interval="30secs" --initialize_driver_logging="true" --isolation="posix/cpu,posix/mem" --launcher="posix" --launcher_dir="/tmp/SRC/build/mesos-1.7.0/_build/sub/src" --logbufsecs="0" --logging_level="INFO" --max_completed_executors_per_framework="150" --memory_profiling="false" --oversubscribed_resources_interval="15secs" --perf_duration="10secs" --perf_interval="1mins" --port="5051" --qos_correction_interval_min="0ns" --quiet="false" --reconfiguration_policy="equal" --recover="reconnect" --recovery_timeout="15mins" --registration_backoff_factor="10ms" --resources="cpus:2;gpus:0;mem:1024;disk:1024;ports:[31000-32000]" --revocable_cpu_low_priority="true" --runtime_dir="/tmp/Endpoint_SlaveEndpointTest_NoAuthorizer_2_IkphbQ" --sandbox_directory="/mnt/mesos/sandbox" --strict="true" --switch_user="true" --systemd_enable_support="true" --systemd_runtime_directory="/run/systemd/system" --version="false" --work_dir="/tmp/Endpoint_SlaveEndpointTest_NoAuthorizer_2_21lwvR" --zk_session_timeout="10secs"
I0625 21:55:59.898970 18299 credentials.hpp:86] Loading credential for authentication from '/tmp/Endpoint_SlaveEndpointTest_NoAuthorizer_2_IkphbQ/credential'
I0625 21:55:59.899193 18299 slave.cpp:301] Agent using credential for: test-principal
I0625 21:55:59.899222 18299 credentials.hpp:37] Loading credentials for authentication from '/tmp/Endpoint_SlaveEndpointTest_NoAuthorizer_2_IkphbQ/http_credentials'
I0625 21:55:59.899475 18299 http.cpp:959] Creating default 'basic' HTTP authenticator for realm 'mesos-agent-readonly'
I0625 21:55:59.899888 18299 disk_profile_adaptor.cpp:80] Creating default disk profile adaptor module
I0625 21:55:59.901204 18299 slave.cpp:616] Agent resources: [{"name":"cpus","scalar":{"value":2.0},"type":"SCALAR"},{"name":"mem","scalar":{"value":1024.0},"type":"SCALAR"},{"name":"disk","scalar":{"value":1024.0},"type":"SCALAR"},{"name":"ports","ranges":{"range":[{"begin":31000,"end":32000}]},"type":"RANGES"}]
I0625 21:55:59.901418 18299 slave.cpp:624] Agent attributes: [  ]
I0625 21:55:59.901441 18299 slave.cpp:633] Agent hostname: b38d1072b0fe
I0625 21:55:59.901619 18296 task_status_update_manager.cpp:181] Pausing sending task status updates
I0625 21:55:59.903216 18297 state.cpp:66] Recovering state from '/tmp/Endpoint_SlaveEndpointTest_NoAuthorizer_2_21lwvR/meta'
I0625 21:55:59.903441 18295 slave.cpp:6929] Finished recovering checkpointed state from '/tmp/Endpoint_SlaveEndpointTest_NoAuthorizer_2_21lwvR/meta', beginning agent recovery
I0625 21:55:59.903620 18292 task_status_update_manager.cpp:207] Recovering task status update manager
I0625 21:55:59.903961 18288 containerizer.cpp:718] Recovering Mesos containers
I0625 21:55:59.904274 18288 containerizer.cpp:1025] Recovering isolators
I0625 21:55:59.904918 18279 containerizer.cpp:1064] Recovering provisioner
I0625 21:55:59.905740 18280 provisioner.cpp:494] Provisioner recovery complete
I0625 21:55:59.906421 18292 composing.cpp:339] Finished recovering all containerizers
I0625 21:55:59.906574 18290 slave.cpp:7158] Recovering executors
I0625 21:55:59.906750 18290 slave.cpp:7311] Finished recovery
I0625 21:55:59.910562 18278 process.cpp:3583] Handling HTTP event for process 'slave(1015)' with path: '/slave(1015)/containers'
I0625 21:55:59.912118 18295 http.cpp:1099] HTTP GET for /slave(1015)/containers from 172.17.0.2:49098
I0625 21:55:59.912220 18295 http.cpp:936] Authorizing principal 'test-principal' to GET the '/containers' endpoint
I0625 21:55:59.915733 18291 slave.cpp:931] Agent terminating
[       OK ] Endpoint/SlaveEndpointTest.NoAuthorizer/2 (35 ms)
[----------] 9 tests from Endpoint/SlaveEndpointTest (309 ms total)

[----------] 2 tests from ContainerizerType/DefaultContainerDNSFlagTest
[ RUN      ] ContainerizerType/DefaultContainerDNSFlagTest.ValidateFlag/0
[       OK ] ContainerizerType/DefaultContainerDNSFlagTest.ValidateFlag/0 (10 ms)
[ RUN      ] ContainerizerType/DefaultContainerDNSFlagTest.ValidateFlag/1
[       OK ] ContainerizerType/DefaultContainerDNSFlagTest.ValidateFlag/1 (9 ms)
[----------] 2 tests from ContainerizerType/DefaultContainerDNSFlagTest (19 ms total)

[----------] Global test environment tear-down
[==========] 1965 tests from 201 test cases ran. (832048 ms total)
[  PASSED  ] 1964 tests.
[  FAILED  ] 1 test, listed below:
[  FAILED  ] ExamplesTest.DynamicReservationFramework

 1 FAILED TEST
  YOU HAVE 22 DISABLED TESTS

I0625 21:55:59.996361 18302 process.cpp:940] Stopped the socket accept loop
Makefile:14789: recipe for target 'check-local' failed
make[4]: *** [check-local] Error 1
make[4]: Leaving directory '/tmp/SRC/build/mesos-1.7.0/_build/sub/src'
Makefile:13903: recipe for target 'check-am' failed
make[3]: *** [check-am] Error 2
make[3]: Leaving directory '/tmp/SRC/build/mesos-1.7.0/_build/sub/src'
Makefile:13907: recipe for target 'check' failed
make[2]: *** [check] Error 2
make[2]: Leaving directory '/tmp/SRC/build/mesos-1.7.0/_build/sub/src'
Makefile:777: recipe for target 'check-recursive' failed
make[1]: *** [check-recursive] Error 1
make[1]: Leaving directory '/tmp/SRC/build/mesos-1.7.0/_build/sub'
Makefile:983: recipe for target 'distcheck' failed
make: *** [distcheck] Error 1
Untagged: mesos/mesos-build:ubuntu-16.04
Untagged: mesos/mesos-build@sha256:8685ea3c3e17663e4a1764d08df701102b4e9286c6c1a7116afccbe382777290
Deleted: sha256:4ecb5a128921ae9aad805a57a0e4d24dbcfbe84b09304997c7e2798819aa155a
Deleted: sha256:91a3c8a13a99414ff67baa2d1c6a6a82b43c237327a78d7f815414e155578ac1
Deleted: sha256:d05373b7ffe6961840e0962d4b16df22a14b1bbba3416f5aee58b579f08a2bcd
Deleted: sha256:db96690681268d3c4fdd48cd5edc2ca128c6b2493c67333983b63119622cc485
Deleted: sha256:70f40beaddd4e8dc15479d4f78d75b121fd4428c7bb29319a0fae0babd257e37
Deleted: sha256:77e6ddba346d8ad1e436256f6373dede5af4002006981b7d4116c561c759cefa
Deleted: sha256:8db758ab2fdb54da0aec53aeac876934337e6170f5a8c8872b3d4171e3d465b7
Deleted: sha256:a7fc6b405fe8ef71edfa6163d1dc9f1cb1df426049eefaa7d388e9df21a061ad
Deleted: sha256:5a3e35538f7f2e2727c8ac92f08c30002b9e8a77737de0dab91244344d59f69b
Deleted: sha256:ff986b10a018b48074e6d3a68b39aad8ccc002cdad912d4148c0f92b3729323e
Build step 'Execute shell' marked build as failure


Jenkins build is back to normal : Mesos-Reviewbot #22794

Posted by Apache Jenkins Server <je...@builds.apache.org>.
See <https://builds.apache.org/job/Mesos-Reviewbot/22794/display/redirect?page=changes>