You are viewing a plain text version of this content. The canonical link for it is here.
Posted to dev@lucene.apache.org by bu...@flonkings.com on 2013/05/08 20:21:21 UTC
[JENKINS] Lucene-trunk-Linux-Java7-64-test-only - Build # 38460 -
Failure!
Build: builds.flonkings.com/job/Lucene-trunk-Linux-Java7-64-test-only/38460/
1 tests failed.
REGRESSION: org.apache.lucene.index.TestIndexWriterOnDiskFull.testImmediateDiskFull
Error Message:
did not hit disk full
Stack Trace:
java.lang.AssertionError: did not hit disk full
at __randomizedtesting.SeedInfo.seed([E79CBF17F77C5418:76DA2D7B8B7DBADC]:0)
at org.junit.Assert.fail(Assert.java:93)
at org.apache.lucene.index.TestIndexWriterOnDiskFull.testImmediateDiskFull(TestIndexWriterOnDiskFull.java:537)
at sun.reflect.NativeMethodAccessorImpl.invoke0(Native Method)
at sun.reflect.NativeMethodAccessorImpl.invoke(NativeMethodAccessorImpl.java:57)
at sun.reflect.DelegatingMethodAccessorImpl.invoke(DelegatingMethodAccessorImpl.java:43)
at java.lang.reflect.Method.invoke(Method.java:601)
at com.carrotsearch.randomizedtesting.RandomizedRunner.invoke(RandomizedRunner.java:1559)
at com.carrotsearch.randomizedtesting.RandomizedRunner.access$600(RandomizedRunner.java:79)
at com.carrotsearch.randomizedtesting.RandomizedRunner$6.evaluate(RandomizedRunner.java:737)
at com.carrotsearch.randomizedtesting.RandomizedRunner$7.evaluate(RandomizedRunner.java:773)
at com.carrotsearch.randomizedtesting.RandomizedRunner$8.evaluate(RandomizedRunner.java:787)
at org.apache.lucene.util.TestRuleSetupTeardownChained$1.evaluate(TestRuleSetupTeardownChained.java:50)
at org.apache.lucene.util.TestRuleFieldCacheSanity$1.evaluate(TestRuleFieldCacheSanity.java:51)
at org.apache.lucene.util.AbstractBeforeAfterRule$1.evaluate(AbstractBeforeAfterRule.java:46)
at com.carrotsearch.randomizedtesting.rules.SystemPropertiesInvariantRule$1.evaluate(SystemPropertiesInvariantRule.java:55)
at org.apache.lucene.util.TestRuleThreadAndTestName$1.evaluate(TestRuleThreadAndTestName.java:49)
at org.apache.lucene.util.TestRuleIgnoreAfterMaxFailures$1.evaluate(TestRuleIgnoreAfterMaxFailures.java:70)
at org.apache.lucene.util.TestRuleMarkFailure$1.evaluate(TestRuleMarkFailure.java:48)
at com.carrotsearch.randomizedtesting.rules.StatementAdapter.evaluate(StatementAdapter.java:36)
at com.carrotsearch.randomizedtesting.ThreadLeakControl$StatementRunner.run(ThreadLeakControl.java:358)
at com.carrotsearch.randomizedtesting.ThreadLeakControl.forkTimeoutingTask(ThreadLeakControl.java:782)
at com.carrotsearch.randomizedtesting.ThreadLeakControl$3.evaluate(ThreadLeakControl.java:442)
at com.carrotsearch.randomizedtesting.RandomizedRunner.runSingleTest(RandomizedRunner.java:746)
at com.carrotsearch.randomizedtesting.RandomizedRunner$3.evaluate(RandomizedRunner.java:648)
at com.carrotsearch.randomizedtesting.RandomizedRunner$4.evaluate(RandomizedRunner.java:682)
at com.carrotsearch.randomizedtesting.RandomizedRunner$5.evaluate(RandomizedRunner.java:693)
at org.apache.lucene.util.AbstractBeforeAfterRule$1.evaluate(AbstractBeforeAfterRule.java:46)
at org.apache.lucene.util.TestRuleStoreClassName$1.evaluate(TestRuleStoreClassName.java:42)
at com.carrotsearch.randomizedtesting.rules.SystemPropertiesInvariantRule$1.evaluate(SystemPropertiesInvariantRule.java:55)
at com.carrotsearch.randomizedtesting.rules.NoShadowingOrOverridesOnMethodsRule$1.evaluate(NoShadowingOrOverridesOnMethodsRule.java:39)
at com.carrotsearch.randomizedtesting.rules.NoShadowingOrOverridesOnMethodsRule$1.evaluate(NoShadowingOrOverridesOnMethodsRule.java:39)
at com.carrotsearch.randomizedtesting.rules.StatementAdapter.evaluate(StatementAdapter.java:36)
at org.apache.lucene.util.TestRuleAssertionsRequired$1.evaluate(TestRuleAssertionsRequired.java:43)
at org.apache.lucene.util.TestRuleMarkFailure$1.evaluate(TestRuleMarkFailure.java:48)
at org.apache.lucene.util.TestRuleIgnoreAfterMaxFailures$1.evaluate(TestRuleIgnoreAfterMaxFailures.java:70)
at org.apache.lucene.util.TestRuleIgnoreTestSuites$1.evaluate(TestRuleIgnoreTestSuites.java:55)
at com.carrotsearch.randomizedtesting.rules.StatementAdapter.evaluate(StatementAdapter.java:36)
at com.carrotsearch.randomizedtesting.ThreadLeakControl$StatementRunner.run(ThreadLeakControl.java:358)
at java.lang.Thread.run(Thread.java:722)
Build Log:
[...truncated 945 lines...]
[junit4:junit4] Suite: org.apache.lucene.index.TestIndexWriterOnDiskFull
[junit4:junit4] 2> NOTE: reproduce with: ant test -Dtestcase=TestIndexWriterOnDiskFull -Dtests.method=testImmediateDiskFull -Dtests.seed=E79CBF17F77C5418 -Dtests.slow=true -Dtests.locale=sr_RS_#Latn -Dtests.timezone=America/Montreal -Dtests.file.encoding=UTF-8
[junit4:junit4] FAILURE 0.03s J6 | TestIndexWriterOnDiskFull.testImmediateDiskFull <<<
[junit4:junit4] > Throwable #1: java.lang.AssertionError: did not hit disk full
[junit4:junit4] > at __randomizedtesting.SeedInfo.seed([E79CBF17F77C5418:76DA2D7B8B7DBADC]:0)
[junit4:junit4] > at org.apache.lucene.index.TestIndexWriterOnDiskFull.testImmediateDiskFull(TestIndexWriterOnDiskFull.java:537)
[junit4:junit4] > at java.lang.Thread.run(Thread.java:722)
[junit4:junit4] 2> NOTE: test params are: codec=SimpleText, sim=RandomSimilarityProvider(queryNorm=true,coord=crazy): {field=DFR I(F)L3(800.0), id=DFR G3(800.0), content=DFR I(ne)B3(800.0), f=DFR I(n)L1}, locale=sr_RS_#Latn, timezone=America/Montreal
[junit4:junit4] 2> NOTE: Linux 3.2.0-26-generic amd64/Oracle Corporation 1.7.0_05 (64-bit)/cpus=8,threads=1,free=67787624,total=231014400
[junit4:junit4] 2> NOTE: All tests run in this JVM: [TestBlockPostingsFormat, TestMinShouldMatch2, TestByteArrayDataInput, TestTransactions, TestLucene40TermVectorsFormat, TestBinaryTerms, TestIndexableField, TestTermsEnum, TestPrefixFilter, Nested1, TestBytesRefHash, Before3, Before3, TestIndexWriterUnicode, TestBinaryDocument, TestNewestSegment, TestFlex, TestMockCharFilter, TestTermVectors, TestBagOfPostings, TestFilterIterator, TestNumericUtils, TestUTF32ToUTF8, TestTermVectorsFormat, TestLucene42DocValuesFormat, TestBooleanOr, TestLucene40DocValuesFormat, TestCompressingStoredFieldsFormat, TestSort, TestSimpleSearchEquivalence, TestIndexWriterOnDiskFull]
[junit4:junit4] Completed on J6 in 5.27s, 4 tests, 1 failure <<< FAILURES!
[...truncated 343 lines...]
BUILD FAILED
/var/lib/jenkins/workspace/Lucene-trunk-Linux-Java7-64-test-only/checkout/lucene/build.xml:50: The following error occurred while executing this line:
/var/lib/jenkins/workspace/Lucene-trunk-Linux-Java7-64-test-only/checkout/lucene/common-build.xml:1240: The following error occurred while executing this line:
/var/lib/jenkins/workspace/Lucene-trunk-Linux-Java7-64-test-only/checkout/lucene/common-build.xml:884: There were test failures: 355 suites, 2254 tests, 1 failure, 59 ignored (47 assumptions)
Total time: 4 minutes 38 seconds
Build step 'Invoke Ant' marked build as failure
Archiving artifacts
Recording test results
Email was triggered for: Failure
Sending email for trigger: Failure
Re: [JENKINS] Lucene-trunk-Linux-Java7-64-test-only - Build # 38460 - Failure!
Posted by Steve Rowe <sa...@gmail.com>.
This seed reproduces for me on trunk and branch_4x, on OS X w/Apple 1.6 (branch_4x) and Oracle 1.7 (trunk) JVMs. - Steve
On May 8, 2013, at 11:21 AM, builder@flonkings.com wrote:
> Build: builds.flonkings.com/job/Lucene-trunk-Linux-Java7-64-test-only/38460/
>
> 1 tests failed.
> REGRESSION: org.apache.lucene.index.TestIndexWriterOnDiskFull.testImmediateDiskFull
>
> Error Message:
> did not hit disk full
>
> Stack Trace:
> java.lang.AssertionError: did not hit disk full
> at __randomizedtesting.SeedInfo.seed([E79CBF17F77C5418:76DA2D7B8B7DBADC]:0)
> at org.junit.Assert.fail(Assert.java:93)
> at org.apache.lucene.index.TestIndexWriterOnDiskFull.testImmediateDiskFull(TestIndexWriterOnDiskFull.java:537)
> at sun.reflect.NativeMethodAccessorImpl.invoke0(Native Method)
> at sun.reflect.NativeMethodAccessorImpl.invoke(NativeMethodAccessorImpl.java:57)
> at sun.reflect.DelegatingMethodAccessorImpl.invoke(DelegatingMethodAccessorImpl.java:43)
> at java.lang.reflect.Method.invoke(Method.java:601)
> at com.carrotsearch.randomizedtesting.RandomizedRunner.invoke(RandomizedRunner.java:1559)
> at com.carrotsearch.randomizedtesting.RandomizedRunner.access$600(RandomizedRunner.java:79)
> at com.carrotsearch.randomizedtesting.RandomizedRunner$6.evaluate(RandomizedRunner.java:737)
> at com.carrotsearch.randomizedtesting.RandomizedRunner$7.evaluate(RandomizedRunner.java:773)
> at com.carrotsearch.randomizedtesting.RandomizedRunner$8.evaluate(RandomizedRunner.java:787)
> at org.apache.lucene.util.TestRuleSetupTeardownChained$1.evaluate(TestRuleSetupTeardownChained.java:50)
> at org.apache.lucene.util.TestRuleFieldCacheSanity$1.evaluate(TestRuleFieldCacheSanity.java:51)
> at org.apache.lucene.util.AbstractBeforeAfterRule$1.evaluate(AbstractBeforeAfterRule.java:46)
> at com.carrotsearch.randomizedtesting.rules.SystemPropertiesInvariantRule$1.evaluate(SystemPropertiesInvariantRule.java:55)
> at org.apache.lucene.util.TestRuleThreadAndTestName$1.evaluate(TestRuleThreadAndTestName.java:49)
> at org.apache.lucene.util.TestRuleIgnoreAfterMaxFailures$1.evaluate(TestRuleIgnoreAfterMaxFailures.java:70)
> at org.apache.lucene.util.TestRuleMarkFailure$1.evaluate(TestRuleMarkFailure.java:48)
> at com.carrotsearch.randomizedtesting.rules.StatementAdapter.evaluate(StatementAdapter.java:36)
> at com.carrotsearch.randomizedtesting.ThreadLeakControl$StatementRunner.run(ThreadLeakControl.java:358)
> at com.carrotsearch.randomizedtesting.ThreadLeakControl.forkTimeoutingTask(ThreadLeakControl.java:782)
> at com.carrotsearch.randomizedtesting.ThreadLeakControl$3.evaluate(ThreadLeakControl.java:442)
> at com.carrotsearch.randomizedtesting.RandomizedRunner.runSingleTest(RandomizedRunner.java:746)
> at com.carrotsearch.randomizedtesting.RandomizedRunner$3.evaluate(RandomizedRunner.java:648)
> at com.carrotsearch.randomizedtesting.RandomizedRunner$4.evaluate(RandomizedRunner.java:682)
> at com.carrotsearch.randomizedtesting.RandomizedRunner$5.evaluate(RandomizedRunner.java:693)
> at org.apache.lucene.util.AbstractBeforeAfterRule$1.evaluate(AbstractBeforeAfterRule.java:46)
> at org.apache.lucene.util.TestRuleStoreClassName$1.evaluate(TestRuleStoreClassName.java:42)
> at com.carrotsearch.randomizedtesting.rules.SystemPropertiesInvariantRule$1.evaluate(SystemPropertiesInvariantRule.java:55)
> at com.carrotsearch.randomizedtesting.rules.NoShadowingOrOverridesOnMethodsRule$1.evaluate(NoShadowingOrOverridesOnMethodsRule.java:39)
> at com.carrotsearch.randomizedtesting.rules.NoShadowingOrOverridesOnMethodsRule$1.evaluate(NoShadowingOrOverridesOnMethodsRule.java:39)
> at com.carrotsearch.randomizedtesting.rules.StatementAdapter.evaluate(StatementAdapter.java:36)
> at org.apache.lucene.util.TestRuleAssertionsRequired$1.evaluate(TestRuleAssertionsRequired.java:43)
> at org.apache.lucene.util.TestRuleMarkFailure$1.evaluate(TestRuleMarkFailure.java:48)
> at org.apache.lucene.util.TestRuleIgnoreAfterMaxFailures$1.evaluate(TestRuleIgnoreAfterMaxFailures.java:70)
> at org.apache.lucene.util.TestRuleIgnoreTestSuites$1.evaluate(TestRuleIgnoreTestSuites.java:55)
> at com.carrotsearch.randomizedtesting.rules.StatementAdapter.evaluate(StatementAdapter.java:36)
> at com.carrotsearch.randomizedtesting.ThreadLeakControl$StatementRunner.run(ThreadLeakControl.java:358)
> at java.lang.Thread.run(Thread.java:722)
>
>
>
>
> Build Log:
> [...truncated 945 lines...]
> [junit4:junit4] Suite: org.apache.lucene.index.TestIndexWriterOnDiskFull
> [junit4:junit4] 2> NOTE: reproduce with: ant test -Dtestcase=TestIndexWriterOnDiskFull -Dtests.method=testImmediateDiskFull -Dtests.seed=E79CBF17F77C5418 -Dtests.slow=true -Dtests.locale=sr_RS_#Latn -Dtests.timezone=America/Montreal -Dtests.file.encoding=UTF-8
> [junit4:junit4] FAILURE 0.03s J6 | TestIndexWriterOnDiskFull.testImmediateDiskFull <<<
> [junit4:junit4] > Throwable #1: java.lang.AssertionError: did not hit disk full
> [junit4:junit4] > at __randomizedtesting.SeedInfo.seed([E79CBF17F77C5418:76DA2D7B8B7DBADC]:0)
> [junit4:junit4] > at org.apache.lucene.index.TestIndexWriterOnDiskFull.testImmediateDiskFull(TestIndexWriterOnDiskFull.java:537)
> [junit4:junit4] > at java.lang.Thread.run(Thread.java:722)
> [junit4:junit4] 2> NOTE: test params are: codec=SimpleText, sim=RandomSimilarityProvider(queryNorm=true,coord=crazy): {field=DFR I(F)L3(800.0), id=DFR G3(800.0), content=DFR I(ne)B3(800.0), f=DFR I(n)L1}, locale=sr_RS_#Latn, timezone=America/Montreal
> [junit4:junit4] 2> NOTE: Linux 3.2.0-26-generic amd64/Oracle Corporation 1.7.0_05 (64-bit)/cpus=8,threads=1,free=67787624,total=231014400
> [junit4:junit4] 2> NOTE: All tests run in this JVM: [TestBlockPostingsFormat, TestMinShouldMatch2, TestByteArrayDataInput, TestTransactions, TestLucene40TermVectorsFormat, TestBinaryTerms, TestIndexableField, TestTermsEnum, TestPrefixFilter, Nested1, TestBytesRefHash, Before3, Before3, TestIndexWriterUnicode, TestBinaryDocument, TestNewestSegment, TestFlex, TestMockCharFilter, TestTermVectors, TestBagOfPostings, TestFilterIterator, TestNumericUtils, TestUTF32ToUTF8, TestTermVectorsFormat, TestLucene42DocValuesFormat, TestBooleanOr, TestLucene40DocValuesFormat, TestCompressingStoredFieldsFormat, TestSort, TestSimpleSearchEquivalence, TestIndexWriterOnDiskFull]
> [junit4:junit4] Completed on J6 in 5.27s, 4 tests, 1 failure <<< FAILURES!
>
> [...truncated 343 lines...]
> BUILD FAILED
> /var/lib/jenkins/workspace/Lucene-trunk-Linux-Java7-64-test-only/checkout/lucene/build.xml:50: The following error occurred while executing this line:
> /var/lib/jenkins/workspace/Lucene-trunk-Linux-Java7-64-test-only/checkout/lucene/common-build.xml:1240: The following error occurred while executing this line:
> /var/lib/jenkins/workspace/Lucene-trunk-Linux-Java7-64-test-only/checkout/lucene/common-build.xml:884: There were test failures: 355 suites, 2254 tests, 1 failure, 59 ignored (47 assumptions)
>
> Total time: 4 minutes 38 seconds
> Build step 'Invoke Ant' marked build as failure
> Archiving artifacts
> Recording test results
> Email was triggered for: Failure
> Sending email for trigger: Failure
>
>
>
>
> ---------------------------------------------------------------------
> To unsubscribe, e-mail: dev-unsubscribe@lucene.apache.org
> For additional commands, e-mail: dev-help@lucene.apache.org
---------------------------------------------------------------------
To unsubscribe, e-mail: dev-unsubscribe@lucene.apache.org
For additional commands, e-mail: dev-help@lucene.apache.org