You are viewing a plain text version of this content. The canonical link for it is here.
Posted to dev@mahout.apache.org by Apache Jenkins Server <je...@builds.apache.org> on 2013/06/23 01:12:40 UTC
Build failed in Jenkins: mahout-nightly #1270
See <https://builds.apache.org/job/mahout-nightly/1270/changes>
Changes:
[srowen] More from IntelliJ inspection
------------------------------------------
[...truncated 2093 lines...]
[INFO] --- maven-clean-plugin:2.4.1:clean (default-clean) @ mahout-integration ---
[INFO] Using 'UTF-8' encoding to copy filtered resources.
[INFO] [INFO] Copying 0 resource
[INFO] --- maven-resources-plugin:2.6:resources (default-resources) @ mahout-integration ---
[INFO]
[INFO] --- maven-compiler-plugin:3.1:compile (default-compile) @ mahout-integration ---
[INFO] Changes detected - recompiling the module!
[INFO] Compiling 127 source files to <https://builds.apache.org/job/mahout-nightly/ws/trunk/integration/target/classes>
[WARNING] Note: Some input files use or override a deprecated API.
[WARNING] Note: Recompile with -Xlint:deprecation for details.
[WARNING] Note: <https://builds.apache.org/job/mahout-nightly/ws/trunk/integration/src/main/java/org/apache/mahout/cf/taste/impl/model/mongodb/MongoDBDataModel.java> uses unchecked or unsafe operations.
[WARNING] Note: Recompile with -Xlint:unchecked for details.
[INFO] [INFO] Using 'UTF-8' encoding to copy filtered resources.
[INFO] Copying 10 resources
[INFO] --- maven-resources-plugin:2.6:testResources (default-testResources) @ mahout-integration ---
[INFO]
[INFO] --- maven-compiler-plugin:3.1:testCompile (default-testCompile) @ mahout-integration ---
[INFO] Changes detected - recompiling the module!
[INFO] Compiling 39 source files to <https://builds.apache.org/job/mahout-nightly/ws/trunk/integration/target/test-classes>
[WARNING] Note: Some input files use or override a deprecated API.
[WARNING] Note: Recompile with -Xlint:deprecation for details.
[INFO] [INFO] Surefire report directory: <https://builds.apache.org/job/mahout-nightly/ws/trunk/integration/target/surefire-reports>
-------------------------------------------------------
T E S T S
-------------------------------------------------------
-------------------------------------------------------
T E S T S
-------------------------------------------------------
[INFO] --- maven-surefire-plugin:2.14.1:test (default-test) @ mahout-integration ---
parallel='classes', perCoreThreadCount=false, threadCount=1, useUnlimitedThreads=false
parallel='classes', perCoreThreadCount=false, threadCount=1, useUnlimitedThreads=false
parallel='classes', perCoreThreadCount=false, threadCount=1, useUnlimitedThreads=false
parallel='classes', perCoreThreadCount=false, threadCount=1, useUnlimitedThreads=false
parallel='classes', perCoreThreadCount=false, threadCount=1, useUnlimitedThreads=false
parallel='classes', perCoreThreadCount=false, threadCount=1, useUnlimitedThreads=false
parallel='classes', perCoreThreadCount=false, threadCount=1, useUnlimitedThreads=false
parallel='classes', perCoreThreadCount=false, threadCount=1, useUnlimitedThreads=false
parallel='classes', perCoreThreadCount=false, threadCount=1, useUnlimitedThreads=false
parallel='classes', perCoreThreadCount=false, threadCount=1, useUnlimitedThreads=false
Running org.apache.mahout.text.SequenceFilesFromMailArchivesTest
parallel='classes', perCoreThreadCount=false, threadCount=1, useUnlimitedThreads=false
Running org.apache.mahout.text.LuceneSegmentInputFormatTest
Running org.apache.mahout.text.SequenceFilesFromLuceneStorageDriverTest
Running org.apache.mahout.utils.email.MailProcessorTest
Running org.apache.mahout.text.TestSequenceFilesFromDirectory
parallel='classes', perCoreThreadCount=false, threadCount=1, useUnlimitedThreads=false
Running org.apache.mahout.utils.SplitInputTest
Running org.apache.mahout.text.MailArchivesClusteringAnalyzerTest
Running org.apache.mahout.text.SequenceFilesFromLuceneStorageTest
Running org.apache.mahout.text.LuceneSegmentRecordReaderTest
Tests run: 1, Failures: 0, Errors: 0, Skipped: 0, Time elapsed: 0.121 sec
Running org.apache.mahout.text.LuceneSegmentInputSplitTest
Running org.apache.mahout.text.SequenceFilesFromLuceneStorageMRJobTest
Tests run: 2, Failures: 0, Errors: 0, Skipped: 0, Time elapsed: 0.3 sec
Running org.apache.mahout.text.LuceneStorageConfigurationTest
parallel='classes', perCoreThreadCount=false, threadCount=1, useUnlimitedThreads=false
parallel='classes', perCoreThreadCount=false, threadCount=1, useUnlimitedThreads=false
Running org.apache.mahout.utils.TestConcatenateVectorsJob
Tests run: 1, Failures: 0, Errors: 0, Skipped: 0, Time elapsed: 2.09 sec
Running org.apache.mahout.utils.Bump125Test
Tests run: 1, Failures: 0, Errors: 0, Skipped: 0, Time elapsed: 2.038 sec
Tests run: 1, Failures: 0, Errors: 0, Skipped: 0, Time elapsed: 0.031 sec
Tests run: 2, Failures: 0, Errors: 0, Skipped: 0, Time elapsed: 1.79 sec
parallel='classes', perCoreThreadCount=false, threadCount=1, useUnlimitedThreads=false
parallel='classes', perCoreThreadCount=false, threadCount=1, useUnlimitedThreads=false
parallel='classes', perCoreThreadCount=false, threadCount=1, useUnlimitedThreads=false
parallel='classes', perCoreThreadCount=false, threadCount=1, useUnlimitedThreads=false
Tests run: 1, Failures: 0, Errors: 0, Skipped: 0, Time elapsed: 1.342 sec
Running org.apache.mahout.utils.vectors.arff.MapBackedARFFModelTest
Tests run: 1, Failures: 0, Errors: 0, Skipped: 0, Time elapsed: 0.018 sec
Running org.apache.mahout.utils.vectors.io.VectorWriterTest
Running org.apache.mahout.utils.vectors.csv.CSVVectorIteratorTest
Running org.apache.mahout.utils.vectors.arff.ARFFTypeTest
Tests run: 1, Failures: 0, Errors: 0, Skipped: 0, Time elapsed: 0.015 sec
Tests run: 1, Failures: 0, Errors: 0, Skipped: 0, Time elapsed: 0.337 sec
parallel='classes', perCoreThreadCount=false, threadCount=1, useUnlimitedThreads=false
parallel='classes', perCoreThreadCount=false, threadCount=1, useUnlimitedThreads=false
Running org.apache.mahout.utils.vectors.arff.DriverTest
parallel='classes', perCoreThreadCount=false, threadCount=1, useUnlimitedThreads=false
Running org.apache.mahout.utils.vectors.arff.ARFFVectorIterableTest
Tests run: 8, Failures: 0, Errors: 0, Skipped: 0, Time elapsed: 0.217 sec
Running org.apache.mahout.utils.vectors.VectorHelperTest
Tests run: 3, Failures: 0, Errors: 0, Skipped: 0, Time elapsed: 0.081 sec
parallel='classes', perCoreThreadCount=false, threadCount=1, useUnlimitedThreads=false
Tests run: 2, Failures: 0, Errors: 0, Skipped: 0, Time elapsed: 1.217 sec
Running org.apache.mahout.utils.vectors.lucene.LuceneIterableTest
parallel='classes', perCoreThreadCount=false, threadCount=1, useUnlimitedThreads=false
Tests run: 2, Failures: 0, Errors: 0, Skipped: 0, Time elapsed: 1.134 sec
parallel='classes', perCoreThreadCount=false, threadCount=1, useUnlimitedThreads=false
Tests run: 1, Failures: 0, Errors: 0, Skipped: 0, Time elapsed: 5.2 sec
Running org.apache.mahout.utils.vectors.lucene.DriverTest
parallel='classes', perCoreThreadCount=false, threadCount=1, useUnlimitedThreads=false
Running org.apache.mahout.utils.vectors.lucene.CachedTermInfoTest
Tests run: 1, Failures: 0, Errors: 0, Skipped: 0, Time elapsed: 5.284 sec
Running org.apache.mahout.utils.nlp.collocations.llr.BloomTokenFilterTest
Tests run: 5, Failures: 0, Errors: 0, Skipped: 0, Time elapsed: 0.068 sec
parallel='classes', perCoreThreadCount=false, threadCount=1, useUnlimitedThreads=false
parallel='classes', perCoreThreadCount=false, threadCount=1, useUnlimitedThreads=false
Tests run: 3, Failures: 0, Errors: 0, Skipped: 0, Time elapsed: 1.46 sec
Tests run: 2, Failures: 0, Errors: 0, Skipped: 0, Time elapsed: 5.977 sec
Running org.apache.mahout.utils.regex.RegexUtilsTest
Tests run: 1, Failures: 0, Errors: 0, Skipped: 0, Time elapsed: 0.058 sec
Running org.apache.mahout.utils.regex.RegexMapperTest
parallel='classes', perCoreThreadCount=false, threadCount=1, useUnlimitedThreads=false
parallel='classes', perCoreThreadCount=false, threadCount=1, useUnlimitedThreads=false
Tests run: 1, Failures: 0, Errors: 0, Skipped: 0, Time elapsed: 1.364 sec
parallel='classes', perCoreThreadCount=false, threadCount=1, useUnlimitedThreads=false
Running org.apache.mahout.clustering.dirichlet.TestL1ModelClustering
Running org.apache.mahout.cf.taste.impl.similarity.jdbc.MySQLJDBCInMemoryItemSimilarityTest
parallel='classes', perCoreThreadCount=false, threadCount=1, useUnlimitedThreads=false
parallel='classes', perCoreThreadCount=false, threadCount=1, useUnlimitedThreads=false
Running org.apache.mahout.clustering.cdbw.TestCDbwEvaluator
Tests run: 1, Failures: 0, Errors: 0, Skipped: 0, Time elapsed: 0.425 sec
Running org.apache.mahout.clustering.TestClusterEvaluator
Running org.apache.mahout.clustering.TestClusterDumper
Tests run: 3, Failures: 0, Errors: 0, Skipped: 0, Time elapsed: 1.637 sec
Tests run: 1, Failures: 0, Errors: 0, Skipped: 0, Time elapsed: 3.689 sec
Tests run: 1, Failures: 0, Errors: 0, Skipped: 0, Time elapsed: 8.616 sec
Tests run: 5, Failures: 0, Errors: 1, Skipped: 0, Time elapsed: 8.984 sec <<< FAILURE!
testRunInvalidQuery(org.apache.mahout.text.SequenceFilesFromLuceneStorageDriverTest) Time elapsed: 1.261 sec <<< ERROR!
java.lang.RuntimeException: org.xml.sax.SAXParseException: Premature end of file.
at org.apache.xerces.parsers.DOMParser.parse(Unknown Source)
at org.apache.xerces.jaxp.DocumentBuilderImpl.parse(Unknown Source)
at javax.xml.parsers.DocumentBuilder.parse(DocumentBuilder.java:124)
at org.apache.hadoop.conf.Configuration.loadResource(Configuration.java:1161)
at org.apache.hadoop.conf.Configuration.loadResources(Configuration.java:1109)
at org.apache.hadoop.conf.Configuration.getProps(Configuration.java:1045)
at org.apache.hadoop.conf.Configuration.get(Configuration.java:397)
at org.apache.hadoop.mapred.JobConf.checkAndWarnDeprecation(JobConf.java:1910)
at org.apache.hadoop.mapred.JobConf.<init>(JobConf.java:378)
at org.apache.hadoop.mapred.LocalJobRunner$Job.<init>(LocalJobRunner.java:150)
at org.apache.hadoop.mapred.LocalJobRunner.submitJob(LocalJobRunner.java:437)
at org.apache.hadoop.mapred.JobClient$2.run(JobClient.java:983)
at org.apache.hadoop.mapred.JobClient$2.run(JobClient.java:912)
at java.security.AccessController.doPrivileged(Native Method)
at javax.security.auth.Subject.doAs(Subject.java:396)
at org.apache.hadoop.security.UserGroupInformation.doAs(UserGroupInformation.java:1149)
at org.apache.hadoop.mapred.JobClient.submitJobInternal(JobClient.java:912)
at org.apache.hadoop.mapreduce.Job.submit(Job.java:500)
at org.apache.hadoop.mapreduce.Job.waitForCompletion(Job.java:530)
at org.apache.mahout.text.SequenceFilesFromLuceneStorageMRJob.run(SequenceFilesFromLuceneStorageMRJob.java:63)
at org.apache.mahout.text.SequenceFilesFromLuceneStorageDriver.run(SequenceFilesFromLuceneStorageDriver.java:120)
at org.apache.mahout.text.SequenceFilesFromLuceneStorageDriverTest.testRunInvalidQuery(SequenceFilesFromLuceneStorageDriverTest.java:157)
Tests run: 4, Failures: 0, Errors: 0, Skipped: 0, Time elapsed: 2.2 sec
Tests run: 12, Failures: 0, Errors: 0, Skipped: 0, Time elapsed: 9.688 sec
Tests run: 6, Failures: 0, Errors: 0, Skipped: 0, Time elapsed: 9.82 sec
Tests run: 6, Failures: 0, Errors: 0, Skipped: 0, Time elapsed: 8.065 sec
Tests run: 12, Failures: 0, Errors: 0, Skipped: 0, Time elapsed: 8.741 sec
Tests run: 12, Failures: 0, Errors: 0, Skipped: 0, Time elapsed: 18.018 sec
Results :
Tests in error:
SequenceFilesFromLuceneStorageDriverTest.testRunInvalidQuery:157 ? Runtime org...
Tests run: 104, Failures: 0, Errors: 1, Skipped: 0
[JENKINS] Recording test results
[INFO] ------------------------------------------------------------------------
[INFO] Reactor Summary:
[INFO]
[INFO] Apache Mahout ..................................... SUCCESS [22.486s]
[INFO] Mahout Build Tools ................................ SUCCESS [9.944s]
[INFO] Mahout Math ....................................... SUCCESS [1:11.341s]
[INFO] Mahout Core ....................................... SUCCESS [5:23.510s]
[INFO] Mahout Integration ................................ FAILURE [41.907s]
[INFO] Mahout Examples ................................... SKIPPED
[INFO] Mahout Release Package ............................ SKIPPED
[INFO] ------------------------------------------------------------------------
[INFO] BUILD FAILURE
[INFO] ------------------------------------------------------------------------
[INFO] Total time: 7:52.898s
[INFO] Finished at: Sat Jun 22 23:09:55 UTC 2013
[INFO] Final Memory: 38M/376M
[INFO] ------------------------------------------------------------------------
[JENKINS] Archiving <https://builds.apache.org/job/mahout-nightly/ws/trunk/buildtools/pom.xml> to /home/hudson/hudson/jobs/mahout-nightly/modules/org.apache.mahout$mahout-buildtools/builds/2013-06-22_23-01-48/archive/org.apache.mahout/mahout-buildtools/0.8-SNAPSHOT/mahout-buildtools-0.8-SNAPSHOT.pom
[JENKINS] Archiving <https://builds.apache.org/job/mahout-nightly/ws/trunk/buildtools/target/mahout-buildtools-0.8-SNAPSHOT.jar> to /home/hudson/hudson/jobs/mahout-nightly/modules/org.apache.mahout$mahout-buildtools/builds/2013-06-22_23-01-48/archive/org.apache.mahout/mahout-buildtools/0.8-20130622.230235-355/mahout-buildtools-0.8-20130622.230235-355.jar
[JENKINS] Archiving <https://builds.apache.org/job/mahout-nightly/ws/trunk/examples/pom.xml> to /home/hudson/hudson/jobs/mahout-nightly/modules/org.apache.mahout$mahout-examples/builds/2013-06-22_23-01-49/archive/org.apache.mahout/mahout-examples/0.8-SNAPSHOT/mahout-examples-0.8-SNAPSHOT.pom
[JENKINS] Archiving <https://builds.apache.org/job/mahout-nightly/ws/trunk/distribution/pom.xml> to /home/hudson/hudson/jobs/mahout-nightly/modules/org.apache.mahout$mahout-distribution/builds/2013-06-22_23-01-49/archive/org.apache.mahout/mahout-distribution/0.8-SNAPSHOT/mahout-distribution-0.8-SNAPSHOT.pom
[JENKINS] Archiving <https://builds.apache.org/job/mahout-nightly/ws/trunk/pom.xml> to /home/hudson/hudson/jobs/mahout-nightly/modules/org.apache.mahout$mahout/builds/2013-06-22_23-01-48/archive/org.apache.mahout/mahout/0.8-SNAPSHOT/mahout-0.8-SNAPSHOT.pom
[JENKINS] Archiving <https://builds.apache.org/job/mahout-nightly/ws/trunk/integration/pom.xml> to /home/hudson/hudson/jobs/mahout-nightly/modules/org.apache.mahout$mahout-integration/builds/2013-06-22_23-01-49/archive/org.apache.mahout/mahout-integration/0.8-SNAPSHOT/mahout-integration-0.8-SNAPSHOT.pom
[JENKINS] Archiving <https://builds.apache.org/job/mahout-nightly/ws/trunk/core/pom.xml> to /home/hudson/hudson/jobs/mahout-nightly/modules/org.apache.mahout$mahout-core/builds/2013-06-22_23-01-49/archive/org.apache.mahout/mahout-core/0.8-SNAPSHOT/mahout-core-0.8-SNAPSHOT.pom
[JENKINS] Archiving <https://builds.apache.org/job/mahout-nightly/ws/trunk/core/target/mahout-core-0.8-SNAPSHOT.jar> to /home/hudson/hudson/jobs/mahout-nightly/modules/org.apache.mahout$mahout-core/builds/2013-06-22_23-01-49/archive/org.apache.mahout/mahout-core/0.8-20130622.230903-279/mahout-core-0.8-20130622.230903-279.jar
[JENKINS] Archiving <https://builds.apache.org/job/mahout-nightly/ws/trunk/core/target/mahout-core-0.8-SNAPSHOT-tests.jar> to /home/hudson/hudson/jobs/mahout-nightly/modules/org.apache.mahout$mahout-core/builds/2013-06-22_23-01-49/archive/org.apache.mahout/mahout-core/0.8-20130622.230903-279/mahout-core-0.8-20130622.230903-279-tests.jar
[JENKINS] Archiving <https://builds.apache.org/job/mahout-nightly/ws/trunk/core/target/mahout-core-0.8-SNAPSHOT-job.jar> to /home/hudson/hudson/jobs/mahout-nightly/modules/org.apache.mahout$mahout-core/builds/2013-06-22_23-01-49/archive/org.apache.mahout/mahout-core/0.8-20130622.230903-279/mahout-core-0.8-20130622.230903-279-job.jar
[JENKINS] Archiving <https://builds.apache.org/job/mahout-nightly/ws/trunk/core/target/mahout-core-0.8-SNAPSHOT-sources.jar> to /home/hudson/hudson/jobs/mahout-nightly/modules/org.apache.mahout$mahout-core/builds/2013-06-22_23-01-49/archive/org.apache.mahout/mahout-core/0.8-20130622.230903-279/mahout-core-0.8-20130622.230903-279-sources.jar
[JENKINS] Archiving <https://builds.apache.org/job/mahout-nightly/ws/trunk/math/pom.xml> to /home/hudson/hudson/jobs/mahout-nightly/modules/org.apache.mahout$mahout-math/builds/2013-06-22_23-01-48/archive/org.apache.mahout/mahout-math/0.8-SNAPSHOT/mahout-math-0.8-SNAPSHOT.pom
[JENKINS] Archiving <https://builds.apache.org/job/mahout-nightly/ws/trunk/math/target/mahout-math-0.8-SNAPSHOT.jar> to /home/hudson/hudson/jobs/mahout-nightly/modules/org.apache.mahout$mahout-math/builds/2013-06-22_23-01-48/archive/org.apache.mahout/mahout-math/0.8-20130622.230344-334/mahout-math-0.8-20130622.230344-334.jar
[JENKINS] Archiving <https://builds.apache.org/job/mahout-nightly/ws/trunk/math/target/mahout-math-0.8-SNAPSHOT-tests.jar> to /home/hudson/hudson/jobs/mahout-nightly/modules/org.apache.mahout$mahout-math/builds/2013-06-22_23-01-48/archive/org.apache.mahout/mahout-math/0.8-20130622.230344-334/mahout-math-0.8-20130622.230344-334-tests.jar
[JENKINS] Archiving <https://builds.apache.org/job/mahout-nightly/ws/trunk/math/target/mahout-math-0.8-SNAPSHOT-sources.jar> to /home/hudson/hudson/jobs/mahout-nightly/modules/org.apache.mahout$mahout-math/builds/2013-06-22_23-01-48/archive/org.apache.mahout/mahout-math/0.8-20130622.230344-334/mahout-math-0.8-20130622.230344-334-sources.jar
Waiting for Jenkins to finish collecting data
mavenExecutionResult exceptions not empty
message : Failed to execute goal org.apache.maven.plugins:maven-surefire-plugin:2.14.1:test (default-test) on project mahout-integration: There are test failures.
Please refer to <https://builds.apache.org/job/mahout-nightly/ws/trunk/integration/target/surefire-reports> for the individual test results.
cause : There are test failures.
Please refer to <https://builds.apache.org/job/mahout-nightly/ws/trunk/integration/target/surefire-reports> for the individual test results.
Stack trace :
org.apache.maven.lifecycle.LifecycleExecutionException: Failed to execute goal org.apache.maven.plugins:maven-surefire-plugin:2.14.1:test (default-test) on project mahout-integration: There are test failures.
Please refer to <https://builds.apache.org/job/mahout-nightly/ws/trunk/integration/target/surefire-reports> for the individual test results.
at org.apache.maven.lifecycle.internal.MojoExecutor.execute(MojoExecutor.java:213)
at org.apache.maven.lifecycle.internal.MojoExecutor.execute(MojoExecutor.java:153)
at org.apache.maven.lifecycle.internal.MojoExecutor.execute(MojoExecutor.java:145)
at org.apache.maven.lifecycle.internal.LifecycleModuleBuilder.buildProject(LifecycleModuleBuilder.java:84)
at org.apache.maven.lifecycle.internal.LifecycleModuleBuilder.buildProject(LifecycleModuleBuilder.java:59)
at org.apache.maven.lifecycle.internal.LifecycleStarter.singleThreadedBuild(LifecycleStarter.java:183)
at org.apache.maven.lifecycle.internal.LifecycleStarter.execute(LifecycleStarter.java:161)
at org.apache.maven.DefaultMaven.doExecute(DefaultMaven.java:320)
at org.apache.maven.DefaultMaven.execute(DefaultMaven.java:156)
at org.jvnet.hudson.maven3.launcher.Maven3Launcher.main(Maven3Launcher.java:79)
at sun.reflect.NativeMethodAccessorImpl.invoke0(Native Method)
at sun.reflect.NativeMethodAccessorImpl.invoke(NativeMethodAccessorImpl.java:39)
at sun.reflect.DelegatingMethodAccessorImpl.invoke(DelegatingMethodAccessorImpl.java:25)
at java.lang.reflect.Method.invoke(Method.java:597)
at org.codehaus.plexus.classworlds.launcher.Launcher.launchStandard(Launcher.java:329)
at org.codehaus.plexus.classworlds.launcher.Launcher.launch(Launcher.java:239)
at org.jvnet.hudson.maven3.agent.Maven3Main.launch(Maven3Main.java:158)
at hudson.maven.Maven3Builder.call(Maven3Builder.java:100)
at hudson.maven.Maven3Builder.call(Maven3Builder.java:66)
at hudson.remoting.UserRequest.perform(UserRequest.java:118)
at hudson.remoting.UserRequest.perform(UserRequest.java:48)
at hudson.remoting.Request$2.run(Request.java:326)
at hudson.remoting.InterceptingExecutorService$1.call(InterceptingExecutorService.java:72)
at java.util.concurrent.FutureTask$Sync.innerRun(FutureTask.java:303)
at java.util.concurrent.FutureTask.run(FutureTask.java:138)
at java.util.concurrent.ThreadPoolExecutor$Worker.runTask(ThreadPoolExecutor.java:895)
at java.util.concurrent.ThreadPoolExecutor$Worker.run(ThreadPoolExecutor.java:918)
at java.lang.Thread.run(Thread.java:662)
Caused by: org.apache.maven.plugin.MojoFailureException: There are test failures.
Please refer to <https://builds.apache.org/job/mahout-nightly/ws/trunk/integration/target/surefire-reports> for the individual test results.
at org.apache.maven.plugin.surefire.SurefireHelper.reportExecution(SurefireHelper.java:82)
at org.apache.maven.plugin.surefire.SurefirePlugin.handleSummary(SurefirePlugin.java:169)
at org.apache.maven.plugin.surefire.AbstractSurefireMojo.executeAfterPreconditionsChecked(AbstractSurefireMojo.java:733)
at org.apache.maven.plugin.surefire.AbstractSurefireMojo.execute(AbstractSurefireMojo.java:631)
at org.apache.maven.plugin.DefaultBuildPluginManager.executeMojo(DefaultBuildPluginManager.java:101)
at org.apache.maven.lifecycle.internal.MojoExecutor.execute(MojoExecutor.java:209)
... 27 more
Sending e-mails to: dev@mahout.apache.org
channel stopped
Jenkins build is back to normal : mahout-nightly #1275
Posted by Apache Jenkins Server <je...@builds.apache.org>.
See <https://builds.apache.org/job/mahout-nightly/1275/changes>
Build failed in Jenkins: mahout-nightly #1274
Posted by Apache Jenkins Server <je...@builds.apache.org>.
See <https://builds.apache.org/job/mahout-nightly/1274/changes>
Changes:
[smarthi] MAHOUT-833: Make conversion to sequence files map-reduce (changes based on feedback from code review)
[smarthi] MAHOUT-833: Make conversion to sequence files map-reduce - (changes based on feedback from review).
[sslavic] Fixed typo in javadoc
[sslavic] Configured svn:ignore for buildtools and distribution modules to ignore Eclipse IDE specific files
------------------------------------------
[...truncated 1811 lines...]
parallel='classes', perCoreThreadCount=false, threadCount=1, useUnlimitedThreads=false
parallel='classes', perCoreThreadCount=false, threadCount=1, useUnlimitedThreads=false
Running org.apache.mahout.classifier.naivebayes.ComplementaryNaiveBayesClassifierTest
Running org.apache.mahout.classifier.naivebayes.NaiveBayesTest
Tests run: 1, Failures: 0, Errors: 0, Skipped: 0, Time elapsed: 0.082 sec
parallel='classes', perCoreThreadCount=false, threadCount=1, useUnlimitedThreads=false
parallel='classes', perCoreThreadCount=false, threadCount=1, useUnlimitedThreads=false
Running org.apache.mahout.classifier.naivebayes.training.ThetaMapperTest
Running org.apache.mahout.classifier.naivebayes.training.WeightsMapperTest
parallel='classes', perCoreThreadCount=false, threadCount=1, useUnlimitedThreads=false
Tests run: 3, Failures: 0, Errors: 0, Skipped: 0, Time elapsed: 38.76 sec
Tests run: 1, Failures: 0, Errors: 0, Skipped: 0, Time elapsed: 0.497 sec
Running org.apache.mahout.classifier.naivebayes.training.IndexInstancesMapperTest
Tests run: 1, Failures: 0, Errors: 0, Skipped: 0, Time elapsed: 0.674 sec
Tests run: 2, Failures: 0, Errors: 0, Skipped: 0, Time elapsed: 0.531 sec
parallel='classes', perCoreThreadCount=false, threadCount=1, useUnlimitedThreads=false
parallel='classes', perCoreThreadCount=false, threadCount=1, useUnlimitedThreads=false
Running org.apache.mahout.classifier.naivebayes.NaiveBayesModelTest
Tests run: 1, Failures: 0, Errors: 0, Skipped: 0, Time elapsed: 0.05 sec
parallel='classes', perCoreThreadCount=false, threadCount=1, useUnlimitedThreads=false
Running org.apache.mahout.classifier.naivebayes.StandardNaiveBayesClassifierTest
Tests run: 1, Failures: 0, Errors: 0, Skipped: 0, Time elapsed: 0.085 sec
Running org.apache.mahout.classifier.evaluation.AucTest
parallel='classes', perCoreThreadCount=false, threadCount=1, useUnlimitedThreads=false
parallel='classes', perCoreThreadCount=false, threadCount=1, useUnlimitedThreads=false
Running org.apache.mahout.classifier.sequencelearning.hmm.HMMUtilsTest
Tests run: 7, Failures: 0, Errors: 0, Skipped: 0, Time elapsed: 0.094 sec
parallel='classes', perCoreThreadCount=false, threadCount=1, useUnlimitedThreads=false
Running org.apache.mahout.classifier.sequencelearning.hmm.HMMAlgorithmsTest
Tests run: 6, Failures: 0, Errors: 0, Skipped: 0, Time elapsed: 0.024 sec
Running org.apache.mahout.classifier.sequencelearning.hmm.HMMModelTest
Tests run: 3, Failures: 0, Errors: 0, Skipped: 0, Time elapsed: 0.754 sec
Tests run: 1, Failures: 0, Errors: 0, Skipped: 0, Time elapsed: 0.103 sec
parallel='classes', perCoreThreadCount=false, threadCount=1, useUnlimitedThreads=false
parallel='classes', perCoreThreadCount=false, threadCount=1, useUnlimitedThreads=false
Running org.apache.mahout.classifier.sequencelearning.hmm.HMMEvaluatorTest
parallel='classes', perCoreThreadCount=false, threadCount=1, useUnlimitedThreads=false
Tests run: 2, Failures: 0, Errors: 0, Skipped: 0, Time elapsed: 0.11 sec
Running org.apache.mahout.classifier.sequencelearning.hmm.HMMTrainerTest
Tests run: 4, Failures: 0, Errors: 0, Skipped: 0, Time elapsed: 0.063 sec
parallel='classes', perCoreThreadCount=false, threadCount=1, useUnlimitedThreads=false
Running org.apache.mahout.classifier.sgd.OnlineLogisticRegressionTest
Running org.apache.mahout.classifier.sgd.CsvRecordFactoryTest
parallel='classes', perCoreThreadCount=false, threadCount=1, useUnlimitedThreads=false
Tests run: 2, Failures: 0, Errors: 0, Skipped: 0, Time elapsed: 0.542 sec
parallel='classes', perCoreThreadCount=false, threadCount=1, useUnlimitedThreads=false
Running org.apache.mahout.classifier.sgd.ModelSerializerTest
Running org.apache.mahout.classifier.sgd.PassiveAggressiveTest
Tests run: 1, Failures: 0, Errors: 0, Skipped: 0, Time elapsed: 0.195 sec
parallel='classes', perCoreThreadCount=false, threadCount=1, useUnlimitedThreads=false
Running org.apache.mahout.classifier.sgd.GradientMachineTest
parallel='classes', perCoreThreadCount=false, threadCount=1, useUnlimitedThreads=false
Running org.apache.mahout.classifier.sgd.AdaptiveLogisticRegressionTest
Tests run: 1, Failures: 0, Errors: 0, Skipped: 0, Time elapsed: 0.409 sec
Tests run: 4, Failures: 0, Errors: 0, Skipped: 0, Time elapsed: 2.223 sec
parallel='classes', perCoreThreadCount=false, threadCount=1, useUnlimitedThreads=false
Running org.apache.mahout.classifier.discriminative.WinnowTrainerTest
Tests run: 1, Failures: 0, Errors: 0, Skipped: 0, Time elapsed: 0.294 sec
parallel='classes', perCoreThreadCount=false, threadCount=1, useUnlimitedThreads=false
Running org.apache.mahout.classifier.discriminative.LinearModelTest
Tests run: 3, Failures: 0, Errors: 0, Skipped: 0, Time elapsed: 0.199 sec
parallel='classes', perCoreThreadCount=false, threadCount=1, useUnlimitedThreads=false
Tests run: 2, Failures: 0, Errors: 0, Skipped: 0, Time elapsed: 47.629 sec
Running org.apache.mahout.classifier.discriminative.PerceptronTrainerTest
Tests run: 1, Failures: 0, Errors: 0, Skipped: 0, Time elapsed: 0.238 sec
parallel='classes', perCoreThreadCount=false, threadCount=1, useUnlimitedThreads=false
Running org.apache.mahout.clustering.dirichlet.TestDirichletClustering
Tests run: 2, Failures: 0, Errors: 0, Skipped: 0, Time elapsed: 9.325 sec
parallel='classes', perCoreThreadCount=false, threadCount=1, useUnlimitedThreads=false
parallel='classes', perCoreThreadCount=false, threadCount=1, useUnlimitedThreads=false
Running org.apache.mahout.clustering.dirichlet.TestDistributions
Running org.apache.mahout.clustering.dirichlet.TestMapReduce
parallel='classes', perCoreThreadCount=false, threadCount=1, useUnlimitedThreads=false
Tests run: 9, Failures: 0, Errors: 0, Skipped: 0, Time elapsed: 0.634 sec
Running org.apache.mahout.clustering.topdown.postprocessor.ClusterOutputPostProcessorTest
parallel='classes', perCoreThreadCount=false, threadCount=1, useUnlimitedThreads=false
Running org.apache.mahout.clustering.topdown.postprocessor.ClusterCountReaderTest
Tests run: 1, Failures: 0, Errors: 0, Skipped: 0, Time elapsed: 3.953 sec
Tests run: 1, Failures: 0, Errors: 0, Skipped: 0, Time elapsed: 3.921 sec
parallel='classes', perCoreThreadCount=false, threadCount=1, useUnlimitedThreads=false
Running org.apache.mahout.clustering.topdown.PathDirectoryTest
Tests run: 5, Failures: 0, Errors: 0, Skipped: 0, Time elapsed: 0.008 sec
parallel='classes', perCoreThreadCount=false, threadCount=1, useUnlimitedThreads=false
Running org.apache.mahout.clustering.classify.ClusterClassificationDriverTest
parallel='classes', perCoreThreadCount=false, threadCount=1, useUnlimitedThreads=false
Running org.apache.mahout.clustering.iterator.TestClusterClassifier
Tests run: 5, Failures: 0, Errors: 0, Skipped: 0, Time elapsed: 12.035 sec
Tests run: 2, Failures: 0, Errors: 0, Skipped: 0, Time elapsed: 9.741 sec
parallel='classes', perCoreThreadCount=false, threadCount=1, useUnlimitedThreads=false
Running org.apache.mahout.clustering.lda.cvb.TestCVBModelTrainer
parallel='classes', perCoreThreadCount=false, threadCount=1, useUnlimitedThreads=false
Running org.apache.mahout.clustering.spectral.common.TestAffinityMatrixInputJob
Tests run: 2, Failures: 0, Errors: 0, Skipped: 0, Time elapsed: 1.489 sec
Tests run: 3, Failures: 0, Errors: 0, Skipped: 0, Time elapsed: 4.95 sec
parallel='classes', perCoreThreadCount=false, threadCount=1, useUnlimitedThreads=false
parallel='classes', perCoreThreadCount=false, threadCount=1, useUnlimitedThreads=false
Running org.apache.mahout.clustering.spectral.common.TestVectorMatrixMultiplicationJob
Running org.apache.mahout.clustering.spectral.common.TestUnitVectorizerJob
Tests run: 1, Failures: 0, Errors: 0, Skipped: 0, Time elapsed: 1.033 sec
Tests run: 1, Failures: 0, Errors: 0, Skipped: 0, Time elapsed: 0.997 sec
parallel='classes', perCoreThreadCount=false, threadCount=1, useUnlimitedThreads=false
parallel='classes', perCoreThreadCount=false, threadCount=1, useUnlimitedThreads=false
Running org.apache.mahout.clustering.spectral.common.TestMatrixDiagonalizeJob
Running org.apache.mahout.clustering.spectral.common.TestVectorCache
Tests run: 2, Failures: 0, Errors: 0, Skipped: 0, Time elapsed: 1.449 sec
Tests run: 3, Failures: 0, Errors: 0, Skipped: 0, Time elapsed: 1.479 sec
parallel='classes', perCoreThreadCount=false, threadCount=1, useUnlimitedThreads=false
parallel='classes', perCoreThreadCount=false, threadCount=1, useUnlimitedThreads=false
Running org.apache.mahout.clustering.spectral.eigencuts.TestEigencutsAffinityCutsJob
Running org.apache.mahout.clustering.spectral.eigencuts.TestEigencutsSensitivityJob
Tests run: 15, Failures: 0, Errors: 0, Skipped: 0, Time elapsed: 9.997 sec
Tests run: 2, Failures: 0, Errors: 0, Skipped: 0, Time elapsed: 1.117 sec
Tests run: 3, Failures: 0, Errors: 0, Skipped: 0, Time elapsed: 1.524 sec
parallel='classes', perCoreThreadCount=false, threadCount=1, useUnlimitedThreads=false
parallel='classes', perCoreThreadCount=false, threadCount=1, useUnlimitedThreads=false
Running org.apache.mahout.clustering.streaming.cluster.BallKMeansTest
parallel='classes', perCoreThreadCount=false, threadCount=1, useUnlimitedThreads=false
Running org.apache.mahout.clustering.meanshift.TestMeanShift
Running org.apache.mahout.clustering.streaming.cluster.StreamingKMeansTest
Running org.apache.mahout.math.neighborhood.SearchQualityTest
Tests run: 4, Failures: 0, Errors: 0, Skipped: 0, Time elapsed: 23.984 sec
parallel='classes', perCoreThreadCount=false, threadCount=1, useUnlimitedThreads=false
Running org.apache.mahout.clustering.minhash.TestMinHashClustering
Tests run: 6, Failures: 0, Errors: 1, Skipped: 0, Time elapsed: 124.13 sec <<< FAILURE!
completeJobImplicitToyExample(org.apache.mahout.cf.taste.hadoop.als.ParallelALSFactorizationJobTest) Time elapsed: 16.586 sec <<< ERROR!
java.lang.IllegalStateException: Job failed!
at org.apache.mahout.cf.taste.hadoop.als.ParallelALSFactorizationJob.runSolver(ParallelALSFactorizationJob.java:362)
at org.apache.mahout.cf.taste.hadoop.als.ParallelALSFactorizationJob.run(ParallelALSFactorizationJob.java:212)
at org.apache.mahout.cf.taste.hadoop.als.ParallelALSFactorizationJobTest.implicitExample(ParallelALSFactorizationJobTest.java:187)
at org.apache.mahout.cf.taste.hadoop.als.ParallelALSFactorizationJobTest.completeJobImplicitToyExample(ParallelALSFactorizationJobTest.java:156)
Tests run: 8, Failures: 0, Errors: 0, Skipped: 0, Time elapsed: 16.954 sec
parallel='classes', perCoreThreadCount=false, threadCount=1, useUnlimitedThreads=false
Running org.apache.mahout.clustering.kmeans.TestRandomSeedGenerator
Tests run: 9, Failures: 0, Errors: 0, Skipped: 0, Time elapsed: 12.665 sec
parallel='classes', perCoreThreadCount=false, threadCount=1, useUnlimitedThreads=false
Running org.apache.mahout.clustering.kmeans.TestKmeansClustering
parallel='classes', perCoreThreadCount=false, threadCount=1, useUnlimitedThreads=false
Running org.apache.mahout.clustering.fuzzykmeans.TestFuzzyKmeansClustering
Tests run: 1, Failures: 0, Errors: 0, Skipped: 0, Time elapsed: 1.526 sec
parallel='classes', perCoreThreadCount=false, threadCount=1, useUnlimitedThreads=false
Running org.apache.mahout.clustering.TestGaussianAccumulators
Tests run: 6, Failures: 0, Errors: 0, Skipped: 0, Time elapsed: 5.932 sec
parallel='classes', perCoreThreadCount=false, threadCount=1, useUnlimitedThreads=false
Running org.apache.mahout.clustering.TestClusterInterface
Tests run: 12, Failures: 0, Errors: 0, Skipped: 0, Time elapsed: 0.09 sec
parallel='classes', perCoreThreadCount=false, threadCount=1, useUnlimitedThreads=false
Running org.apache.mahout.clustering.canopy.TestCanopyCreation
Tests run: 6, Failures: 0, Errors: 0, Skipped: 0, Time elapsed: 59.472 sec
Tests run: 17, Failures: 0, Errors: 0, Skipped: 0, Time elapsed: 14.105 sec
Tests run: 3, Failures: 0, Errors: 0, Skipped: 0, Time elapsed: 24.224 sec
Tests run: 2, Failures: 0, Errors: 0, Skipped: 0, Time elapsed: 89.928 sec
Tests run: 18, Failures: 0, Errors: 0, Skipped: 0, Time elapsed: 92.136 sec
Tests run: 2, Failures: 0, Errors: 0, Skipped: 0, Time elapsed: 36.24 sec
Tests run: 3, Failures: 0, Errors: 0, Skipped: 0, Time elapsed: 57.048 sec
Tests run: 2, Failures: 0, Errors: 0, Skipped: 0, Time elapsed: 76.575 sec
Tests run: 8, Failures: 0, Errors: 0, Skipped: 0, Time elapsed: 74.433 sec
Tests run: 2, Failures: 0, Errors: 0, Skipped: 0, Time elapsed: 183.336 sec
Tests run: 8, Failures: 0, Errors: 0, Skipped: 0, Time elapsed: 134.609 sec
Tests run: 2, Failures: 0, Errors: 0, Skipped: 0, Time elapsed: 236.478 sec
Results :
Tests in error:
ParallelALSFactorizationJobTest.completeJobImplicitToyExample:156->implicitExample:187 ? IllegalState
Tests run: 834, Failures: 0, Errors: 1, Skipped: 0
[JENKINS] Recording test results
[INFO] ------------------------------------------------------------------------
[INFO] Reactor Summary:
[INFO]
[INFO] Apache Mahout ..................................... SUCCESS [28.050s]
[INFO] Mahout Build Tools ................................ SUCCESS [8.377s]
[INFO] Mahout Math ....................................... SUCCESS [1:04.874s]
[INFO] Mahout Core ....................................... FAILURE [4:46.414s]
[INFO] Mahout Integration ................................ SKIPPED
[INFO] Mahout Examples ................................... SKIPPED
[INFO] Mahout Release Package ............................ SKIPPED
[INFO] ------------------------------------------------------------------------
[INFO] BUILD FAILURE
[INFO] ------------------------------------------------------------------------
[INFO] Total time: 6:30.803s
[INFO] Finished at: Wed Jun 26 23:08:38 UTC 2013
[INFO] Final Memory: 27M/321M
[INFO] ------------------------------------------------------------------------
[JENKINS] Archiving <https://builds.apache.org/job/mahout-nightly/ws/trunk/buildtools/pom.xml> to /home/hudson/hudson/jobs/mahout-nightly/modules/org.apache.mahout$mahout-buildtools/builds/2013-06-26_23-01-49/archive/org.apache.mahout/mahout-buildtools/0.8-SNAPSHOT/mahout-buildtools-0.8-SNAPSHOT.pom
[JENKINS] Archiving <https://builds.apache.org/job/mahout-nightly/ws/trunk/buildtools/target/mahout-buildtools-0.8-SNAPSHOT.jar> to /home/hudson/hudson/jobs/mahout-nightly/modules/org.apache.mahout$mahout-buildtools/builds/2013-06-26_23-01-49/archive/org.apache.mahout/mahout-buildtools/0.8-20130626.230243-359/mahout-buildtools-0.8-20130626.230243-359.jar
[JENKINS] Archiving <https://builds.apache.org/job/mahout-nightly/ws/trunk/examples/pom.xml> to /home/hudson/hudson/jobs/mahout-nightly/modules/org.apache.mahout$mahout-examples/builds/2013-06-26_23-01-50/archive/org.apache.mahout/mahout-examples/0.8-SNAPSHOT/mahout-examples-0.8-SNAPSHOT.pom
[JENKINS] Archiving <https://builds.apache.org/job/mahout-nightly/ws/trunk/distribution/pom.xml> to /home/hudson/hudson/jobs/mahout-nightly/modules/org.apache.mahout$mahout-distribution/builds/2013-06-26_23-01-50/archive/org.apache.mahout/mahout-distribution/0.8-SNAPSHOT/mahout-distribution-0.8-SNAPSHOT.pom
[JENKINS] Archiving <https://builds.apache.org/job/mahout-nightly/ws/trunk/pom.xml> to /home/hudson/hudson/jobs/mahout-nightly/modules/org.apache.mahout$mahout/builds/2013-06-26_23-01-49/archive/org.apache.mahout/mahout/0.8-SNAPSHOT/mahout-0.8-SNAPSHOT.pom
[JENKINS] Archiving <https://builds.apache.org/job/mahout-nightly/ws/trunk/integration/pom.xml> to /home/hudson/hudson/jobs/mahout-nightly/modules/org.apache.mahout$mahout-integration/builds/2013-06-26_23-01-49/archive/org.apache.mahout/mahout-integration/0.8-SNAPSHOT/mahout-integration-0.8-SNAPSHOT.pom
[JENKINS] Archiving <https://builds.apache.org/job/mahout-nightly/ws/trunk/core/pom.xml> to /home/hudson/hudson/jobs/mahout-nightly/modules/org.apache.mahout$mahout-core/builds/2013-06-26_23-01-49/archive/org.apache.mahout/mahout-core/0.8-SNAPSHOT/mahout-core-0.8-SNAPSHOT.pom
[JENKINS] Archiving <https://builds.apache.org/job/mahout-nightly/ws/trunk/math/pom.xml> to /home/hudson/hudson/jobs/mahout-nightly/modules/org.apache.mahout$mahout-math/builds/2013-06-26_23-01-49/archive/org.apache.mahout/mahout-math/0.8-SNAPSHOT/mahout-math-0.8-SNAPSHOT.pom
[JENKINS] Archiving <https://builds.apache.org/job/mahout-nightly/ws/trunk/math/target/mahout-math-0.8-SNAPSHOT.jar> to /home/hudson/hudson/jobs/mahout-nightly/modules/org.apache.mahout$mahout-math/builds/2013-06-26_23-01-49/archive/org.apache.mahout/mahout-math/0.8-20130626.230345-338/mahout-math-0.8-20130626.230345-338.jar
[JENKINS] Archiving <https://builds.apache.org/job/mahout-nightly/ws/trunk/math/target/mahout-math-0.8-SNAPSHOT-tests.jar> to /home/hudson/hudson/jobs/mahout-nightly/modules/org.apache.mahout$mahout-math/builds/2013-06-26_23-01-49/archive/org.apache.mahout/mahout-math/0.8-20130626.230345-338/mahout-math-0.8-20130626.230345-338-tests.jar
[JENKINS] Archiving <https://builds.apache.org/job/mahout-nightly/ws/trunk/math/target/mahout-math-0.8-SNAPSHOT-sources.jar> to /home/hudson/hudson/jobs/mahout-nightly/modules/org.apache.mahout$mahout-math/builds/2013-06-26_23-01-49/archive/org.apache.mahout/mahout-math/0.8-20130626.230345-338/mahout-math-0.8-20130626.230345-338-sources.jar
Waiting for Jenkins to finish collecting data
mavenExecutionResult exceptions not empty
message : Failed to execute goal org.apache.maven.plugins:maven-surefire-plugin:2.14.1:test (default-test) on project mahout-core: There are test failures.
Please refer to <https://builds.apache.org/job/mahout-nightly/ws/trunk/core/target/surefire-reports> for the individual test results.
cause : There are test failures.
Please refer to <https://builds.apache.org/job/mahout-nightly/ws/trunk/core/target/surefire-reports> for the individual test results.
Stack trace :
org.apache.maven.lifecycle.LifecycleExecutionException: Failed to execute goal org.apache.maven.plugins:maven-surefire-plugin:2.14.1:test (default-test) on project mahout-core: There are test failures.
Please refer to <https://builds.apache.org/job/mahout-nightly/ws/trunk/core/target/surefire-reports> for the individual test results.
at org.apache.maven.lifecycle.internal.MojoExecutor.execute(MojoExecutor.java:213)
at org.apache.maven.lifecycle.internal.MojoExecutor.execute(MojoExecutor.java:153)
at org.apache.maven.lifecycle.internal.MojoExecutor.execute(MojoExecutor.java:145)
at org.apache.maven.lifecycle.internal.LifecycleModuleBuilder.buildProject(LifecycleModuleBuilder.java:84)
at org.apache.maven.lifecycle.internal.LifecycleModuleBuilder.buildProject(LifecycleModuleBuilder.java:59)
at org.apache.maven.lifecycle.internal.LifecycleStarter.singleThreadedBuild(LifecycleStarter.java:183)
at org.apache.maven.lifecycle.internal.LifecycleStarter.execute(LifecycleStarter.java:161)
at org.apache.maven.DefaultMaven.doExecute(DefaultMaven.java:320)
at org.apache.maven.DefaultMaven.execute(DefaultMaven.java:156)
at org.jvnet.hudson.maven3.launcher.Maven3Launcher.main(Maven3Launcher.java:79)
at sun.reflect.NativeMethodAccessorImpl.invoke0(Native Method)
at sun.reflect.NativeMethodAccessorImpl.invoke(NativeMethodAccessorImpl.java:39)
at sun.reflect.DelegatingMethodAccessorImpl.invoke(DelegatingMethodAccessorImpl.java:25)
at java.lang.reflect.Method.invoke(Method.java:597)
at org.codehaus.plexus.classworlds.launcher.Launcher.launchStandard(Launcher.java:329)
at org.codehaus.plexus.classworlds.launcher.Launcher.launch(Launcher.java:239)
at org.jvnet.hudson.maven3.agent.Maven3Main.launch(Maven3Main.java:158)
at hudson.maven.Maven3Builder.call(Maven3Builder.java:100)
at hudson.maven.Maven3Builder.call(Maven3Builder.java:66)
at hudson.remoting.UserRequest.perform(UserRequest.java:118)
at hudson.remoting.UserRequest.perform(UserRequest.java:48)
at hudson.remoting.Request$2.run(Request.java:326)
at hudson.remoting.InterceptingExecutorService$1.call(InterceptingExecutorService.java:72)
at java.util.concurrent.FutureTask$Sync.innerRun(FutureTask.java:303)
at java.util.concurrent.FutureTask.run(FutureTask.java:138)
at java.util.concurrent.ThreadPoolExecutor$Worker.runTask(ThreadPoolExecutor.java:895)
at java.util.concurrent.ThreadPoolExecutor$Worker.run(ThreadPoolExecutor.java:918)
at java.lang.Thread.run(Thread.java:662)
Caused by: org.apache.maven.plugin.MojoFailureException: There are test failures.
Please refer to <https://builds.apache.org/job/mahout-nightly/ws/trunk/core/target/surefire-reports> for the individual test results.
at org.apache.maven.plugin.surefire.SurefireHelper.reportExecution(SurefireHelper.java:82)
at org.apache.maven.plugin.surefire.SurefirePlugin.handleSummary(SurefirePlugin.java:169)
at org.apache.maven.plugin.surefire.AbstractSurefireMojo.executeAfterPreconditionsChecked(AbstractSurefireMojo.java:733)
at org.apache.maven.plugin.surefire.AbstractSurefireMojo.execute(AbstractSurefireMojo.java:631)
at org.apache.maven.plugin.DefaultBuildPluginManager.executeMojo(DefaultBuildPluginManager.java:101)
at org.apache.maven.lifecycle.internal.MojoExecutor.execute(MojoExecutor.java:209)
... 27 more
Sending e-mails to: dev@mahout.apache.org sslavic@gmail.com suneel.marthi@gmail.com
channel stopped
Build failed in Jenkins: mahout-nightly #1273
Posted by Apache Jenkins Server <je...@builds.apache.org>.
See <https://builds.apache.org/job/mahout-nightly/1273/changes>
Changes:
[smarthi] MAHOUT-1269: Cleanup deprecated Lucene 3.x API calls from lucene2seq utility unit tests
[smarthi] MAHOUT-1269: Cleanup deprecated Lucene 3.x API calls from lucene2seq utility unit tests
[smarthi] MAHOUT-833: Make conversion to sequence files map-reduce
[ssc] MAHOUT-1268 Wrong output directory for CVB
------------------------------------------
[...truncated 1928 lines...]
Running org.apache.mahout.cf.taste.impl.recommender.svd.FilePersistenceStrategyTest
parallel='classes', perCoreThreadCount=false, threadCount=1, useUnlimitedThreads=false
Tests run: 1, Failures: 0, Errors: 0, Skipped: 0, Time elapsed: 0.104 sec
parallel='classes', perCoreThreadCount=false, threadCount=1, useUnlimitedThreads=false
Running org.apache.mahout.cf.taste.impl.recommender.TreeClusteringRecommender2Test
Running org.apache.mahout.cf.taste.impl.recommender.TopItemsTest
Tests run: 7, Failures: 0, Errors: 0, Skipped: 0, Time elapsed: 0.035 sec
Tests run: 4, Failures: 0, Errors: 0, Skipped: 0, Time elapsed: 0.193 sec
parallel='classes', perCoreThreadCount=false, threadCount=1, useUnlimitedThreads=false
Tests run: 6, Failures: 0, Errors: 0, Skipped: 0, Time elapsed: 0.879 sec
Running org.apache.mahout.cf.taste.impl.recommender.TreeClusteringRecommenderTest
parallel='classes', perCoreThreadCount=false, threadCount=1, useUnlimitedThreads=false
parallel='classes', perCoreThreadCount=false, threadCount=1, useUnlimitedThreads=false
Tests run: 5, Failures: 0, Errors: 0, Skipped: 0, Time elapsed: 0.245 sec
Running org.apache.mahout.cf.taste.impl.recommender.NullRescorerTest
Tests run: 2, Failures: 0, Errors: 0, Skipped: 0, Time elapsed: 0.009 sec
Running org.apache.mahout.cf.taste.impl.recommender.GenericUserBasedRecommenderTest
parallel='classes', perCoreThreadCount=false, threadCount=1, useUnlimitedThreads=false
Tests run: 7, Failures: 0, Errors: 0, Skipped: 0, Time elapsed: 0.19 sec
Running org.apache.mahout.cf.taste.impl.recommender.knn.KnnItemBasedRecommenderTest
parallel='classes', perCoreThreadCount=false, threadCount=1, useUnlimitedThreads=false
parallel='classes', perCoreThreadCount=false, threadCount=1, useUnlimitedThreads=false
Tests run: 5, Failures: 0, Errors: 0, Skipped: 0, Time elapsed: 0.174 sec
Running org.apache.mahout.cf.taste.impl.recommender.RandomRecommenderTest
Running org.apache.mahout.cf.taste.impl.recommender.ItemUserAverageRecommenderTest
parallel='classes', perCoreThreadCount=false, threadCount=1, useUnlimitedThreads=false
Tests run: 1, Failures: 0, Errors: 0, Skipped: 0, Time elapsed: 0.138 sec
Tests run: 1, Failures: 0, Errors: 0, Skipped: 0, Time elapsed: 0.224 sec
Running org.apache.mahout.cf.taste.impl.recommender.AllUnknownItemsCandidateItemsStrategyTest
Tests run: 1, Failures: 0, Errors: 0, Skipped: 0, Time elapsed: 0.105 sec
parallel='classes', perCoreThreadCount=false, threadCount=1, useUnlimitedThreads=false
parallel='classes', perCoreThreadCount=false, threadCount=1, useUnlimitedThreads=false
Running org.apache.mahout.cf.taste.impl.recommender.slopeone.SlopeOneRecommenderTest
parallel='classes', perCoreThreadCount=false, threadCount=1, useUnlimitedThreads=false
Running org.apache.mahout.cf.taste.impl.recommender.slopeone.MemoryDiffStorageTest
Tests run: 6, Failures: 0, Errors: 0, Skipped: 0, Time elapsed: 0.233 sec
Running org.apache.mahout.cf.taste.impl.recommender.CachingRecommenderTest
Tests run: 9, Failures: 0, Errors: 0, Skipped: 0, Time elapsed: 0.328 sec
parallel='classes', perCoreThreadCount=false, threadCount=1, useUnlimitedThreads=false
Tests run: 1, Failures: 0, Errors: 0, Skipped: 0, Time elapsed: 0.163 sec
Running org.apache.mahout.cf.taste.impl.recommender.PreferredItemsNeighborhoodCandidateItemsStrategyTest
Tests run: 1, Failures: 0, Errors: 0, Skipped: 0, Time elapsed: 0.063 sec
parallel='classes', perCoreThreadCount=false, threadCount=1, useUnlimitedThreads=false
parallel='classes', perCoreThreadCount=false, threadCount=1, useUnlimitedThreads=false
Running org.apache.mahout.cf.taste.impl.neighborhood.NearestNNeighborhoodTest
parallel='classes', perCoreThreadCount=false, threadCount=1, useUnlimitedThreads=false
Tests run: 1, Failures: 0, Errors: 0, Skipped: 0, Time elapsed: 0.157 sec
Running org.apache.mahout.cf.taste.impl.neighborhood.ThresholdNeighborhoodTest
Tests run: 2, Failures: 0, Errors: 0, Skipped: 0, Time elapsed: 48.244 sec
Running org.apache.mahout.cf.taste.impl.similarity.AveragingPreferenceInferrerTest
parallel='classes', perCoreThreadCount=false, threadCount=1, useUnlimitedThreads=false
Tests run: 1, Failures: 0, Errors: 0, Skipped: 0, Time elapsed: 0.206 sec
Tests run: 1, Failures: 0, Errors: 0, Skipped: 0, Time elapsed: 0.151 sec
Running org.apache.mahout.cf.taste.impl.similarity.SpearmanCorrelationSimilarityTest
parallel='classes', perCoreThreadCount=false, threadCount=1, useUnlimitedThreads=false
Tests run: 5, Failures: 0, Errors: 0, Skipped: 0, Time elapsed: 0.216 sec
parallel='classes', perCoreThreadCount=false, threadCount=1, useUnlimitedThreads=false
parallel='classes', perCoreThreadCount=false, threadCount=1, useUnlimitedThreads=false
Running org.apache.mahout.cf.taste.impl.similarity.GenericItemSimilarityTest
Tests run: 4, Failures: 0, Errors: 0, Skipped: 0, Time elapsed: 0.108 sec
Running org.apache.mahout.cf.taste.impl.similarity.LogLikelihoodSimilarityTest
parallel='classes', perCoreThreadCount=false, threadCount=1, useUnlimitedThreads=false
Running org.apache.mahout.cf.taste.impl.similarity.PearsonCorrelationSimilarityTest
Tests run: 3, Failures: 0, Errors: 0, Skipped: 0, Time elapsed: 0.15 sec
Running org.apache.mahout.cf.taste.impl.similarity.file.FileItemSimilarityTest
Tests run: 18, Failures: 0, Errors: 0, Skipped: 0, Time elapsed: 0.12 sec
Tests run: 4, Failures: 0, Errors: 0, Skipped: 0, Time elapsed: 18.01 sec
parallel='classes', perCoreThreadCount=false, threadCount=1, useUnlimitedThreads=false
parallel='classes', perCoreThreadCount=false, threadCount=1, useUnlimitedThreads=false
Running org.apache.mahout.cf.taste.impl.similarity.EuclideanDistanceSimilarityTest
Running org.apache.mahout.cf.taste.impl.similarity.TanimotoCoefficientSimilarityTest
parallel='classes', perCoreThreadCount=false, threadCount=1, useUnlimitedThreads=false
Tests run: 17, Failures: 0, Errors: 0, Skipped: 0, Time elapsed: 0.152 sec
Tests run: 8, Failures: 0, Errors: 0, Skipped: 0, Time elapsed: 0.156 sec
parallel='classes', perCoreThreadCount=false, threadCount=1, useUnlimitedThreads=false
Running org.apache.mahout.cf.taste.impl.transforms.InverseUserFrequencyTest
parallel='classes', perCoreThreadCount=false, threadCount=1, useUnlimitedThreads=false
Running org.apache.mahout.cf.taste.impl.transforms.CaseAmplificationTest
Tests run: 2, Failures: 0, Errors: 0, Skipped: 0, Time elapsed: 0.014 sec
Tests run: 1, Failures: 0, Errors: 0, Skipped: 0, Time elapsed: 0.243 sec
Running org.apache.mahout.cf.taste.impl.transforms.ZScoreTest
parallel='classes', perCoreThreadCount=false, threadCount=1, useUnlimitedThreads=false
Tests run: 4, Failures: 0, Errors: 0, Skipped: 0, Time elapsed: 0.127 sec
Running org.apache.mahout.driver.MahoutDriverTest
parallel='classes', perCoreThreadCount=false, threadCount=1, useUnlimitedThreads=false
Running org.apache.mahout.clustering.canopy.TestCanopyCreation
parallel='classes', perCoreThreadCount=false, threadCount=1, useUnlimitedThreads=false
parallel='classes', perCoreThreadCount=false, threadCount=1, useUnlimitedThreads=false
parallel='classes', perCoreThreadCount=false, threadCount=1, useUnlimitedThreads=false
Tests run: 1, Failures: 0, Errors: 0, Skipped: 0, Time elapsed: 0.51 sec
Running org.apache.mahout.clustering.topdown.postprocessor.ClusterCountReaderTest
Running org.apache.mahout.clustering.topdown.postprocessor.ClusterOutputPostProcessorTest
Running org.apache.mahout.clustering.topdown.PathDirectoryTest
Tests run: 5, Failures: 0, Errors: 0, Skipped: 0, Time elapsed: 0.007 sec
parallel='classes', perCoreThreadCount=false, threadCount=1, useUnlimitedThreads=false
parallel='classes', perCoreThreadCount=false, threadCount=1, useUnlimitedThreads=false
Running org.apache.mahout.clustering.fuzzykmeans.TestFuzzyKmeansClustering
Running org.apache.mahout.clustering.minhash.TestMinHashClustering
Tests run: 1, Failures: 0, Errors: 0, Skipped: 0, Time elapsed: 1.954 sec
Tests run: 1, Failures: 0, Errors: 0, Skipped: 0, Time elapsed: 2.027 sec
Tests run: 6, Failures: 0, Errors: 0, Skipped: 0, Time elapsed: 4.165 sec
parallel='classes', perCoreThreadCount=false, threadCount=1, useUnlimitedThreads=false
parallel='classes', perCoreThreadCount=false, threadCount=1, useUnlimitedThreads=false
Running org.apache.mahout.clustering.spectral.common.TestAffinityMatrixInputJob
parallel='classes', perCoreThreadCount=false, threadCount=1, useUnlimitedThreads=false
Running org.apache.mahout.clustering.spectral.common.TestVectorMatrixMultiplicationJob
Running org.apache.mahout.clustering.spectral.common.TestUnitVectorizerJob
Tests run: 2, Failures: 0, Errors: 0, Skipped: 0, Time elapsed: 1.005 sec
Tests run: 1, Failures: 0, Errors: 0, Skipped: 0, Time elapsed: 0.804 sec
Tests run: 1, Failures: 0, Errors: 0, Skipped: 0, Time elapsed: 0.871 sec
parallel='classes', perCoreThreadCount=false, threadCount=1, useUnlimitedThreads=false
parallel='classes', perCoreThreadCount=false, threadCount=1, useUnlimitedThreads=false
Running org.apache.mahout.clustering.spectral.common.TestMatrixDiagonalizeJob
Running org.apache.mahout.clustering.spectral.common.TestVectorCache
parallel='classes', perCoreThreadCount=false, threadCount=1, useUnlimitedThreads=false
Running org.apache.mahout.clustering.spectral.eigencuts.TestEigencutsSensitivityJob
Tests run: 2, Failures: 0, Errors: 0, Skipped: 0, Time elapsed: 1.154 sec
Tests run: 2, Failures: 0, Errors: 0, Skipped: 0, Time elapsed: 1.024 sec
Tests run: 3, Failures: 0, Errors: 0, Skipped: 0, Time elapsed: 1.417 sec
Tests run: 3, Failures: 0, Errors: 0, Skipped: 0, Time elapsed: 42.408 sec
parallel='classes', perCoreThreadCount=false, threadCount=1, useUnlimitedThreads=false
Running org.apache.mahout.clustering.spectral.eigencuts.TestEigencutsAffinityCutsJob
parallel='classes', perCoreThreadCount=false, threadCount=1, useUnlimitedThreads=false
parallel='classes', perCoreThreadCount=false, threadCount=1, useUnlimitedThreads=false
parallel='classes', perCoreThreadCount=false, threadCount=1, useUnlimitedThreads=false
Running org.apache.mahout.clustering.iterator.TestClusterClassifier
Running org.apache.mahout.clustering.streaming.cluster.BallKMeansTest
Tests run: 3, Failures: 0, Errors: 0, Skipped: 0, Time elapsed: 1.188 sec
Running org.apache.mahout.clustering.streaming.cluster.StreamingKMeansTest
parallel='classes', perCoreThreadCount=false, threadCount=1, useUnlimitedThreads=false
Running org.apache.mahout.clustering.TestClusterInterface
Tests run: 12, Failures: 0, Errors: 0, Skipped: 0, Time elapsed: 0.166 sec
parallel='classes', perCoreThreadCount=false, threadCount=1, useUnlimitedThreads=false
Running org.apache.mahout.clustering.TestGaussianAccumulators
Tests run: 21, Failures: 0, Errors: 0, Skipped: 0, Time elapsed: 31.325 sec
parallel='classes', perCoreThreadCount=false, threadCount=1, useUnlimitedThreads=false
Running org.apache.mahout.clustering.meanshift.TestMeanShift
Tests run: 17, Failures: 0, Errors: 0, Skipped: 0, Time elapsed: 13.439 sec
Tests run: 6, Failures: 0, Errors: 0, Skipped: 0, Time elapsed: 3.538 sec
Tests run: 9, Failures: 0, Errors: 0, Skipped: 0, Time elapsed: 12.552 sec
parallel='classes', perCoreThreadCount=false, threadCount=1, useUnlimitedThreads=false
Running org.apache.mahout.clustering.lda.cvb.TestCVBModelTrainer
parallel='classes', perCoreThreadCount=false, threadCount=1, useUnlimitedThreads=false
Running org.apache.mahout.clustering.kmeans.TestRandomSeedGenerator
parallel='classes', perCoreThreadCount=false, threadCount=1, useUnlimitedThreads=false
Tests run: 15, Failures: 0, Errors: 0, Skipped: 0, Time elapsed: 7.742 sec
Running org.apache.mahout.clustering.kmeans.TestKmeansClustering
parallel='classes', perCoreThreadCount=false, threadCount=1, useUnlimitedThreads=false
Tests run: 1, Failures: 0, Errors: 0, Skipped: 0, Time elapsed: 1.295 sec
Running org.apache.mahout.clustering.dirichlet.TestDistributions
Tests run: 9, Failures: 0, Errors: 0, Skipped: 0, Time elapsed: 0.296 sec
parallel='classes', perCoreThreadCount=false, threadCount=1, useUnlimitedThreads=false
Running org.apache.mahout.clustering.dirichlet.TestDirichletClustering
parallel='classes', perCoreThreadCount=false, threadCount=1, useUnlimitedThreads=false
Running org.apache.mahout.clustering.dirichlet.TestMapReduce
Tests run: 2, Failures: 0, Errors: 0, Skipped: 0, Time elapsed: 65.956 sec
parallel='classes', perCoreThreadCount=false, threadCount=1, useUnlimitedThreads=false
Running org.apache.mahout.clustering.classify.ClusterClassificationDriverTest
Tests run: 2, Failures: 0, Errors: 0, Skipped: 0, Time elapsed: 4.568 sec
parallel='classes', perCoreThreadCount=false, threadCount=1, useUnlimitedThreads=false
Running org.apache.mahout.vectorizer.DictionaryVectorizerTest
Tests run: 3, Failures: 0, Errors: 0, Skipped: 0, Time elapsed: 4.234 sec
Tests run: 8, Failures: 0, Errors: 0, Skipped: 0, Time elapsed: 14.587 sec
parallel='classes', perCoreThreadCount=false, threadCount=1, useUnlimitedThreads=false
parallel='classes', perCoreThreadCount=false, threadCount=1, useUnlimitedThreads=false
Running org.apache.mahout.vectorizer.collocations.llr.GramKeyTest
Running org.apache.mahout.vectorizer.collocations.llr.CollocReducerTest
Tests run: 2, Failures: 0, Errors: 0, Skipped: 0, Time elapsed: 0.133 sec
parallel='classes', perCoreThreadCount=false, threadCount=1, useUnlimitedThreads=false
Tests run: 1, Failures: 0, Errors: 0, Skipped: 0, Time elapsed: 0.657 sec
Running org.apache.mahout.vectorizer.collocations.llr.LLRReducerTest
parallel='classes', perCoreThreadCount=false, threadCount=1, useUnlimitedThreads=false
Running org.apache.mahout.vectorizer.collocations.llr.CollocMapperTest
Tests run: 1, Failures: 0, Errors: 0, Skipped: 0, Time elapsed: 0.487 sec
parallel='classes', perCoreThreadCount=false, threadCount=1, useUnlimitedThreads=false
Tests run: 2, Failures: 0, Errors: 0, Skipped: 0, Time elapsed: 0.829 sec
Running org.apache.mahout.vectorizer.collocations.llr.GramKeyPartitionerTest
Tests run: 1, Failures: 0, Errors: 0, Skipped: 0, Time elapsed: 0.076 sec
parallel='classes', perCoreThreadCount=false, threadCount=1, useUnlimitedThreads=false
parallel='classes', perCoreThreadCount=false, threadCount=1, useUnlimitedThreads=false
Running org.apache.mahout.vectorizer.collocations.llr.GramTest
Tests run: 7, Failures: 0, Errors: 0, Skipped: 0, Time elapsed: 0.054 sec
Running org.apache.mahout.vectorizer.collocations.llr.GramKeyGroupComparatorTest
Tests run: 1, Failures: 0, Errors: 0, Skipped: 0, Time elapsed: 0.042 sec
parallel='classes', perCoreThreadCount=false, threadCount=1, useUnlimitedThreads=false
Running org.apache.mahout.vectorizer.encoders.WordLikeValueEncoderTest
parallel='classes', perCoreThreadCount=false, threadCount=1, useUnlimitedThreads=false
Tests run: 4, Failures: 0, Errors: 0, Skipped: 0, Time elapsed: 0.082 sec
Tests run: 18, Failures: 0, Errors: 0, Skipped: 0, Time elapsed: 68.555 sec
Running org.apache.mahout.vectorizer.encoders.InteractionValueEncoderTest
Tests run: 3, Failures: 0, Errors: 0, Skipped: 0, Time elapsed: 0.089 sec
parallel='classes', perCoreThreadCount=false, threadCount=1, useUnlimitedThreads=false
Running org.apache.mahout.vectorizer.encoders.ContinuousValueEncoderTest
parallel='classes', perCoreThreadCount=false, threadCount=1, useUnlimitedThreads=false
Tests run: 2, Failures: 0, Errors: 0, Skipped: 0, Time elapsed: 0.045 sec
parallel='classes', perCoreThreadCount=false, threadCount=1, useUnlimitedThreads=false
Running org.apache.mahout.vectorizer.encoders.TextValueEncoderTest
Running org.apache.mahout.vectorizer.encoders.ConstantValueEncoderTest
Tests run: 2, Failures: 0, Errors: 0, Skipped: 0, Time elapsed: 0.049 sec
parallel='classes', perCoreThreadCount=false, threadCount=1, useUnlimitedThreads=false
Tests run: 3, Failures: 0, Errors: 0, Skipped: 0, Time elapsed: 0.226 sec
Running org.apache.mahout.vectorizer.DocumentProcessorTest
parallel='classes', perCoreThreadCount=false, threadCount=1, useUnlimitedThreads=false
Running org.apache.mahout.vectorizer.EncodedVectorsFromSequenceFilesTest
parallel='classes', perCoreThreadCount=false, threadCount=1, useUnlimitedThreads=false
Running org.apache.mahout.vectorizer.HighDFWordsPrunerTest
Tests run: 2, Failures: 0, Errors: 0, Skipped: 0, Time elapsed: 1.614 sec
parallel='classes', perCoreThreadCount=false, threadCount=1, useUnlimitedThreads=false
Running org.apache.mahout.vectorizer.SparseVectorsFromSequenceFilesTest
Tests run: 1, Failures: 0, Errors: 0, Skipped: 0, Time elapsed: 2.796 sec
parallel='classes', perCoreThreadCount=false, threadCount=1, useUnlimitedThreads=false
Tests run: 3, Failures: 0, Errors: 0, Skipped: 0, Time elapsed: 20.187 sec
Running org.apache.mahout.fpm.pfpgrowth.PFPGrowthRetailDataTest
parallel='classes', perCoreThreadCount=false, threadCount=1, useUnlimitedThreads=false
Tests run: 2, Failures: 0, Errors: 0, Skipped: 0, Time elapsed: 35.216 sec
Running org.apache.mahout.fpm.pfpgrowth.PFPGrowthTest
parallel='classes', perCoreThreadCount=false, threadCount=1, useUnlimitedThreads=false
Running org.apache.mahout.fpm.pfpgrowth.fpgrowth.FrequentPatternMaxHeapTest
Tests run: 4, Failures: 0, Errors: 0, Skipped: 0, Time elapsed: 20.289 sec
Tests run: 1, Failures: 0, Errors: 0, Skipped: 0, Time elapsed: 0.226 sec
parallel='classes', perCoreThreadCount=false, threadCount=1, useUnlimitedThreads=false
parallel='classes', perCoreThreadCount=false, threadCount=1, useUnlimitedThreads=false
Running org.apache.mahout.fpm.pfpgrowth.FPGrowthTest
Running org.apache.mahout.fpm.pfpgrowth.FPGrowthRetailDataTest
Tests run: 4, Failures: 0, Errors: 0, Skipped: 0, Time elapsed: 6.831 sec
parallel='classes', perCoreThreadCount=false, threadCount=1, useUnlimitedThreads=false
Tests run: 4, Failures: 0, Errors: 0, Skipped: 0, Time elapsed: 1.334 sec
Running org.apache.mahout.fpm.pfpgrowth.TransactionTreeTest
parallel='classes', perCoreThreadCount=false, threadCount=1, useUnlimitedThreads=false
Running org.apache.mahout.fpm.pfpgrowth.FPGrowthSyntheticDataTest
Tests run: 1, Failures: 0, Errors: 0, Skipped: 0, Time elapsed: 3.683 sec
Tests run: 1, Failures: 0, Errors: 0, Skipped: 0, Time elapsed: 5.331 sec
Tests run: 2, Failures: 0, Errors: 0, Skipped: 0, Time elapsed: 9.795 sec
Tests run: 3, Failures: 0, Errors: 0, Skipped: 0, Time elapsed: 47.375 sec
Tests run: 4, Failures: 0, Errors: 0, Skipped: 0, Time elapsed: 36.513 sec
Tests run: 8, Failures: 0, Errors: 0, Skipped: 0, Time elapsed: 68.886 sec
Tests run: 6, Failures: 0, Errors: 0, Skipped: 0, Time elapsed: 105.752 sec
Tests run: 2, Failures: 0, Errors: 0, Skipped: 0, Time elapsed: 74.177 sec
Tests run: 6, Failures: 0, Errors: 0, Skipped: 0, Time elapsed: 66.503 sec
Tests run: 8, Failures: 0, Errors: 0, Skipped: 0, Time elapsed: 152.248 sec
Tests run: 2, Failures: 0, Errors: 0, Skipped: 0, Time elapsed: 116.275 sec
Tests run: 2, Failures: 0, Errors: 0, Skipped: 0, Time elapsed: 170.298 sec
Results :
Tests run: 834, Failures: 0, Errors: 0, Skipped: 0
ERROR: Maven JVM terminated unexpectedly with exit code 143
Build failed in Jenkins: mahout-nightly #1272
Posted by Apache Jenkins Server <je...@builds.apache.org>.
See <https://builds.apache.org/job/mahout-nightly/1272/changes>
Changes:
[smarthi] MAHOUT-944: lucene2seq - more code cleanup, removed unused imports
[smarthi] MAHOUT-833: Make conversion to sequence files map-reduce - fixed issue with not reading a directory list
[smarthi] MAHOUT-833: Make conversion to sequence files map-reduce - first round of Code cleanup based on feedback from code review
[smarthi] MAHOUT-944:lucene2seq - removed unused import
------------------------------------------
[...truncated 2088 lines...]
Uploading: https://repository.apache.org/content/repositories/snapshots/org/apache/mahout/mahout-core/maven-metadata.xml
Uploaded: https://repository.apache.org/content/repositories/snapshots/org/apache/mahout/mahout-core/maven-metadata.xml (344 B at 2.0 KB/sec)
Uploading: https://repository.apache.org/content/repositories/snapshots/org/apache/mahout/mahout-core/0.8-SNAPSHOT/mahout-core-0.8-20130624.230604-281-tests.jar
Uploaded: https://repository.apache.org/content/repositories/snapshots/org/apache/mahout/mahout-core/0.8-SNAPSHOT/mahout-core-0.8-20130624.230604-281-tests.jar (2436 KB at 9055.6 KB/sec)
Uploading: https://repository.apache.org/content/repositories/snapshots/org/apache/mahout/mahout-core/0.8-SNAPSHOT/maven-metadata.xml
Uploaded: https://repository.apache.org/content/repositories/snapshots/org/apache/mahout/mahout-core/0.8-SNAPSHOT/maven-metadata.xml (2 KB at 20.0 KB/sec)
Uploading: https://repository.apache.org/content/repositories/snapshots/org/apache/mahout/mahout-core/0.8-SNAPSHOT/mahout-core-0.8-20130624.230604-281-job.jar
Uploaded: https://repository.apache.org/content/repositories/snapshots/org/apache/mahout/mahout-core/0.8-SNAPSHOT/mahout-core-0.8-20130624.230604-281-job.jar (19450 KB at 22381.7 KB/sec)
Uploading: https://repository.apache.org/content/repositories/snapshots/org/apache/mahout/mahout-core/0.8-SNAPSHOT/maven-metadata.xml
Uploaded: https://repository.apache.org/content/repositories/snapshots/org/apache/mahout/mahout-core/0.8-SNAPSHOT/maven-metadata.xml (2 KB at 17.5 KB/sec)
Uploading: https://repository.apache.org/content/repositories/snapshots/org/apache/mahout/mahout-core/0.8-SNAPSHOT/mahout-core-0.8-20130624.230604-281-sources.jar
Uploaded: https://repository.apache.org/content/repositories/snapshots/org/apache/mahout/mahout-core/0.8-SNAPSHOT/mahout-core-0.8-20130624.230604-281-sources.jar (1149 KB at 3587.6 KB/sec)
Uploading: https://repository.apache.org/content/repositories/snapshots/org/apache/mahout/mahout-core/0.8-SNAPSHOT/maven-metadata.xml
Uploaded: https://repository.apache.org/content/repositories/snapshots/org/apache/mahout/mahout-core/0.8-SNAPSHOT/maven-metadata.xml (2 KB at 20.3 KB/sec)
[INFO]
[INFO] ------------------------------------------------------------------------
[INFO] Building Mahout Integration 0.8-SNAPSHOT
[INFO] ------------------------------------------------------------------------
[INFO] [INFO] Deleting <https://builds.apache.org/job/mahout-nightly/ws/trunk/integration/target>
[INFO] --- maven-clean-plugin:2.4.1:clean (default-clean) @ mahout-integration ---
[INFO] [INFO] Using 'UTF-8' encoding to copy filtered resources.
[INFO] --- maven-resources-plugin:2.6:resources (default-resources) @ mahout-integration ---
[INFO] Copying 0 resource
[INFO]
[INFO] --- maven-compiler-plugin:3.1:compile (default-compile) @ mahout-integration ---
[INFO] Changes detected - recompiling the module!
[INFO] Compiling 131 source files to <https://builds.apache.org/job/mahout-nightly/ws/trunk/integration/target/classes>
[WARNING] Note: Some input files use or override a deprecated API.
[WARNING] Note: Recompile with -Xlint:deprecation for details.
[WARNING] Note: <https://builds.apache.org/job/mahout-nightly/ws/trunk/integration/src/main/java/org/apache/mahout/cf/taste/impl/model/mongodb/MongoDBDataModel.java> uses unchecked or unsafe operations.
[WARNING] Note: Recompile with -Xlint:unchecked for details.
[INFO] [INFO] Using 'UTF-8' encoding to copy filtered resources.
[INFO] --- maven-resources-plugin:2.6:testResources (default-testResources) @ mahout-integration ---
[INFO] Copying 10 resources
[INFO]
[INFO] --- maven-compiler-plugin:3.1:testCompile (default-testCompile) @ mahout-integration ---
[INFO] Changes detected - recompiling the module!
[INFO] Compiling 39 source files to <https://builds.apache.org/job/mahout-nightly/ws/trunk/integration/target/test-classes>
[WARNING] Note: Some input files use or override a deprecated API.
[WARNING] Note: Recompile with -Xlint:deprecation for details.
[INFO]
[INFO] --- maven-surefire-plugin:2.14.1:test (default-test) @ mahout-integration ---
[INFO] Surefire report directory: <https://builds.apache.org/job/mahout-nightly/ws/trunk/integration/target/surefire-reports>
-------------------------------------------------------
T E S T S
-------------------------------------------------------
-------------------------------------------------------
T E S T S
-------------------------------------------------------
parallel='classes', perCoreThreadCount=false, threadCount=1, useUnlimitedThreads=false
parallel='classes', perCoreThreadCount=false, threadCount=1, useUnlimitedThreads=false
parallel='classes', perCoreThreadCount=false, threadCount=1, useUnlimitedThreads=false
parallel='classes', perCoreThreadCount=false, threadCount=1, useUnlimitedThreads=false
parallel='classes', perCoreThreadCount=false, threadCount=1, useUnlimitedThreads=false
parallel='classes', perCoreThreadCount=false, threadCount=1, useUnlimitedThreads=false
parallel='classes', perCoreThreadCount=false, threadCount=1, useUnlimitedThreads=false
parallel='classes', perCoreThreadCount=false, threadCount=1, useUnlimitedThreads=false
parallel='classes', perCoreThreadCount=false, threadCount=1, useUnlimitedThreads=false
parallel='classes', perCoreThreadCount=false, threadCount=1, useUnlimitedThreads=false
parallel='classes', perCoreThreadCount=false, threadCount=1, useUnlimitedThreads=false
parallel='classes', perCoreThreadCount=false, threadCount=1, useUnlimitedThreads=false
parallel='classes', perCoreThreadCount=false, threadCount=1, useUnlimitedThreads=false
parallel='classes', perCoreThreadCount=false, threadCount=1, useUnlimitedThreads=false
parallel='classes', perCoreThreadCount=false, threadCount=1, useUnlimitedThreads=false
parallel='classes', perCoreThreadCount=false, threadCount=1, useUnlimitedThreads=false
parallel='classes', perCoreThreadCount=false, threadCount=1, useUnlimitedThreads=false
parallel='classes', perCoreThreadCount=false, threadCount=1, useUnlimitedThreads=false
parallel='classes', perCoreThreadCount=false, threadCount=1, useUnlimitedThreads=false
Running org.apache.mahout.utils.nlp.collocations.llr.BloomTokenFilterTest
Running org.apache.mahout.utils.vectors.arff.ARFFTypeTest
parallel='classes', perCoreThreadCount=false, threadCount=1, useUnlimitedThreads=false
parallel='classes', perCoreThreadCount=false, threadCount=1, useUnlimitedThreads=false
Running org.apache.mahout.text.LuceneStorageConfigurationTest
parallel='classes', perCoreThreadCount=false, threadCount=1, useUnlimitedThreads=false
Tests run: 1, Failures: 0, Errors: 0, Skipped: 0, Time elapsed: 0.027 sec
parallel='classes', perCoreThreadCount=false, threadCount=1, useUnlimitedThreads=false
parallel='classes', perCoreThreadCount=false, threadCount=1, useUnlimitedThreads=false
parallel='classes', perCoreThreadCount=false, threadCount=1, useUnlimitedThreads=false
parallel='classes', perCoreThreadCount=false, threadCount=1, useUnlimitedThreads=false
parallel='classes', perCoreThreadCount=false, threadCount=1, useUnlimitedThreads=false
parallel='classes', perCoreThreadCount=false, threadCount=1, useUnlimitedThreads=false
parallel='classes', perCoreThreadCount=false, threadCount=1, useUnlimitedThreads=false
Running org.apache.mahout.utils.TestConcatenateVectorsJob
Running org.apache.mahout.utils.vectors.VectorHelperTest
Running org.apache.mahout.text.MailArchivesClusteringAnalyzerTest
Tests run: 5, Failures: 0, Errors: 0, Skipped: 0, Time elapsed: 0.133 sec
parallel='classes', perCoreThreadCount=false, threadCount=1, useUnlimitedThreads=false
parallel='classes', perCoreThreadCount=false, threadCount=1, useUnlimitedThreads=false
Running org.apache.mahout.utils.Bump125Test
parallel='classes', perCoreThreadCount=false, threadCount=1, useUnlimitedThreads=false
Tests run: 3, Failures: 0, Errors: 0, Skipped: 0, Time elapsed: 0.056 sec
Running org.apache.mahout.text.SequenceFilesFromLuceneStorageTest
Tests run: 1, Failures: 0, Errors: 0, Skipped: 0, Time elapsed: 0.031 sec
Running org.apache.mahout.utils.vectors.lucene.CachedTermInfoTest
Running org.apache.mahout.cf.taste.impl.similarity.jdbc.MySQLJDBCInMemoryItemSimilarityTest
Running org.apache.mahout.utils.email.MailProcessorTest
Running org.apache.mahout.utils.vectors.csv.CSVVectorIteratorTest
Running org.apache.mahout.text.LuceneSegmentInputFormatTest
Tests run: 1, Failures: 0, Errors: 0, Skipped: 0, Time elapsed: 0.13 sec
Running org.apache.mahout.text.SequenceFilesFromMailArchivesTest
Running org.apache.mahout.utils.vectors.arff.DriverTest
Running org.apache.mahout.text.SequenceFilesFromLuceneStorageMRJobTest
Running org.apache.mahout.text.TestSequenceFilesFromDirectory
Running org.apache.mahout.utils.vectors.lucene.LuceneIterableTest
Running org.apache.mahout.clustering.cdbw.TestCDbwEvaluator
Running org.apache.mahout.utils.vectors.arff.MapBackedARFFModelTest
Running org.apache.mahout.text.LuceneSegmentInputSplitTest
Running org.apache.mahout.utils.regex.RegexMapperTest
Running org.apache.mahout.clustering.dirichlet.TestL1ModelClustering
Running org.apache.mahout.utils.vectors.lucene.DriverTest
Running org.apache.mahout.utils.regex.RegexUtilsTest
Running org.apache.mahout.text.LuceneSegmentRecordReaderTest
Tests run: 1, Failures: 0, Errors: 0, Skipped: 0, Time elapsed: 0.076 sec
Running org.apache.mahout.utils.vectors.arff.ARFFVectorIterableTest
Tests run: 1, Failures: 0, Errors: 0, Skipped: 0, Time elapsed: 0.042 sec
Running org.apache.mahout.text.SequenceFilesFromLuceneStorageDriverTest
Running org.apache.mahout.utils.SplitInputTest
Tests run: 2, Failures: 0, Errors: 0, Skipped: 0, Time elapsed: 0.214 sec
Running org.apache.mahout.utils.vectors.io.VectorWriterTest
Running org.apache.mahout.clustering.TestClusterDumper
Running org.apache.mahout.clustering.TestClusterEvaluator
Tests run: 1, Failures: 0, Errors: 0, Skipped: 0, Time elapsed: 0.303 sec
Tests run: 8, Failures: 0, Errors: 0, Skipped: 0, Time elapsed: 0.134 sec
Tests run: 1, Failures: 0, Errors: 0, Skipped: 0, Time elapsed: 0.384 sec
Tests run: 2, Failures: 0, Errors: 0, Skipped: 0, Time elapsed: 0.486 sec
Tests run: 2, Failures: 0, Errors: 0, Skipped: 0, Time elapsed: 0.875 sec
Tests run: 1, Failures: 0, Errors: 0, Skipped: 0, Time elapsed: 0.824 sec
Tests run: 1, Failures: 0, Errors: 0, Skipped: 0, Time elapsed: 1.069 sec
Tests run: 3, Failures: 0, Errors: 0, Skipped: 0, Time elapsed: 1.033 sec
Tests run: 3, Failures: 0, Errors: 0, Skipped: 0, Time elapsed: 1.084 sec
Tests run: 2, Failures: 0, Errors: 0, Skipped: 0, Time elapsed: 1.091 sec
Tests run: 1, Failures: 0, Errors: 0, Skipped: 0, Time elapsed: 1.679 sec
Tests run: 2, Failures: 0, Errors: 0, Skipped: 0, Time elapsed: 1.689 sec
Tests run: 1, Failures: 0, Errors: 0, Skipped: 0, Time elapsed: 1.652 sec
Tests run: 4, Failures: 0, Errors: 0, Skipped: 0, Time elapsed: 1.71 sec
Tests run: 1, Failures: 0, Errors: 0, Skipped: 0, Time elapsed: 2.005 sec
Tests run: 2, Failures: 1, Errors: 0, Skipped: 0, Time elapsed: 2.611 sec <<< FAILURE!
testSequential(org.apache.mahout.text.SequenceFilesFromMailArchivesTest) Time elapsed: 1.268 sec <<< FAILURE!
org.junit.ComparisonFailure: expected:<TE...@example.com> but was:<TE...@example.com>
at org.junit.Assert.assertEquals(Assert.java:115)
at org.junit.Assert.assertEquals(Assert.java:144)
at org.apache.mahout.text.SequenceFilesFromMailArchivesTest.testSequential(SequenceFilesFromMailArchivesTest.java:108)
Tests run: 6, Failures: 0, Errors: 0, Skipped: 0, Time elapsed: 3.232 sec
Tests run: 1, Failures: 0, Errors: 0, Skipped: 0, Time elapsed: 3.551 sec
Tests run: 2, Failures: 0, Errors: 0, Skipped: 0, Time elapsed: 3.611 sec
Tests run: 5, Failures: 0, Errors: 0, Skipped: 0, Time elapsed: 4.292 sec
Tests run: 12, Failures: 0, Errors: 0, Skipped: 0, Time elapsed: 6.397 sec
Tests run: 12, Failures: 0, Errors: 0, Skipped: 0, Time elapsed: 6.856 sec
Tests run: 6, Failures: 0, Errors: 0, Skipped: 0, Time elapsed: 6.807 sec
Tests run: 12, Failures: 0, Errors: 0, Skipped: 0, Time elapsed: 14.679 sec
Results :
Failed tests:
SequenceFilesFromMailArchivesTest.testSequential:108->Assert.assertEquals:144->Assert.assertEquals:115 expected:<TE...@example.com> but was:<TE...@example.com>
Tests run: 106, Failures: 1, Errors: 0, Skipped: 0
[JENKINS] Recording test results
[INFO] ------------------------------------------------------------------------
[INFO] Reactor Summary:
[INFO]
[INFO] Apache Mahout ..................................... SUCCESS [6.804s]
[INFO] Mahout Build Tools ................................ SUCCESS [8.238s]
[INFO] Mahout Math ....................................... SUCCESS [41.418s]
[INFO] Mahout Core ....................................... SUCCESS [2:42.586s]
[INFO] Mahout Integration ................................ FAILURE [22.286s]
[INFO] Mahout Examples ................................... SKIPPED
[INFO] Mahout Release Package ............................ SKIPPED
[INFO] ------------------------------------------------------------------------
[INFO] BUILD FAILURE
[INFO] ------------------------------------------------------------------------
[INFO] Total time: 4:02.181s
[INFO] Finished at: Mon Jun 24 23:06:29 UTC 2013
[INFO] Final Memory: 39M/411M
[INFO] ------------------------------------------------------------------------
[JENKINS] Archiving <https://builds.apache.org/job/mahout-nightly/ws/trunk/buildtools/pom.xml> to /home/hudson/hudson/jobs/mahout-nightly/modules/org.apache.mahout$mahout-buildtools/builds/2013-06-24_23-02-22/archive/org.apache.mahout/mahout-buildtools/0.8-SNAPSHOT/mahout-buildtools-0.8-SNAPSHOT.pom
[JENKINS] Archiving <https://builds.apache.org/job/mahout-nightly/ws/trunk/buildtools/target/mahout-buildtools-0.8-SNAPSHOT.jar> to /home/hudson/hudson/jobs/mahout-nightly/modules/org.apache.mahout$mahout-buildtools/builds/2013-06-24_23-02-22/archive/org.apache.mahout/mahout-buildtools/0.8-20130624.230241-357/mahout-buildtools-0.8-20130624.230241-357.jar
[JENKINS] Archiving <https://builds.apache.org/job/mahout-nightly/ws/trunk/examples/pom.xml> to /home/hudson/hudson/jobs/mahout-nightly/modules/org.apache.mahout$mahout-examples/builds/2013-06-24_23-02-22/archive/org.apache.mahout/mahout-examples/0.8-SNAPSHOT/mahout-examples-0.8-SNAPSHOT.pom
[JENKINS] Archiving <https://builds.apache.org/job/mahout-nightly/ws/trunk/distribution/pom.xml> to /home/hudson/hudson/jobs/mahout-nightly/modules/org.apache.mahout$mahout-distribution/builds/2013-06-24_23-02-22/archive/org.apache.mahout/mahout-distribution/0.8-SNAPSHOT/mahout-distribution-0.8-SNAPSHOT.pom
[JENKINS] Archiving <https://builds.apache.org/job/mahout-nightly/ws/trunk/pom.xml> to /home/hudson/hudson/jobs/mahout-nightly/modules/org.apache.mahout$mahout/builds/2013-06-24_23-02-22/archive/org.apache.mahout/mahout/0.8-SNAPSHOT/mahout-0.8-SNAPSHOT.pom
[JENKINS] Archiving <https://builds.apache.org/job/mahout-nightly/ws/trunk/integration/pom.xml> to /home/hudson/hudson/jobs/mahout-nightly/modules/org.apache.mahout$mahout-integration/builds/2013-06-24_23-02-22/archive/org.apache.mahout/mahout-integration/0.8-SNAPSHOT/mahout-integration-0.8-SNAPSHOT.pom
[JENKINS] Archiving <https://builds.apache.org/job/mahout-nightly/ws/trunk/core/pom.xml> to /home/hudson/hudson/jobs/mahout-nightly/modules/org.apache.mahout$mahout-core/builds/2013-06-24_23-02-22/archive/org.apache.mahout/mahout-core/0.8-SNAPSHOT/mahout-core-0.8-SNAPSHOT.pom
[JENKINS] Archiving <https://builds.apache.org/job/mahout-nightly/ws/trunk/core/target/mahout-core-0.8-SNAPSHOT.jar> to /home/hudson/hudson/jobs/mahout-nightly/modules/org.apache.mahout$mahout-core/builds/2013-06-24_23-02-22/archive/org.apache.mahout/mahout-core/0.8-20130624.230604-281/mahout-core-0.8-20130624.230604-281.jar
[JENKINS] Archiving <https://builds.apache.org/job/mahout-nightly/ws/trunk/core/target/mahout-core-0.8-SNAPSHOT-tests.jar> to /home/hudson/hudson/jobs/mahout-nightly/modules/org.apache.mahout$mahout-core/builds/2013-06-24_23-02-22/archive/org.apache.mahout/mahout-core/0.8-20130624.230604-281/mahout-core-0.8-20130624.230604-281-tests.jar
[JENKINS] Archiving <https://builds.apache.org/job/mahout-nightly/ws/trunk/core/target/mahout-core-0.8-SNAPSHOT-job.jar> to /home/hudson/hudson/jobs/mahout-nightly/modules/org.apache.mahout$mahout-core/builds/2013-06-24_23-02-22/archive/org.apache.mahout/mahout-core/0.8-20130624.230604-281/mahout-core-0.8-20130624.230604-281-job.jar
[JENKINS] Archiving <https://builds.apache.org/job/mahout-nightly/ws/trunk/core/target/mahout-core-0.8-SNAPSHOT-sources.jar> to /home/hudson/hudson/jobs/mahout-nightly/modules/org.apache.mahout$mahout-core/builds/2013-06-24_23-02-22/archive/org.apache.mahout/mahout-core/0.8-20130624.230604-281/mahout-core-0.8-20130624.230604-281-sources.jar
[JENKINS] Archiving <https://builds.apache.org/job/mahout-nightly/ws/trunk/math/pom.xml> to /home/hudson/hudson/jobs/mahout-nightly/modules/org.apache.mahout$mahout-math/builds/2013-06-24_23-02-22/archive/org.apache.mahout/mahout-math/0.8-SNAPSHOT/mahout-math-0.8-SNAPSHOT.pom
[JENKINS] Archiving <https://builds.apache.org/job/mahout-nightly/ws/trunk/math/target/mahout-math-0.8-SNAPSHOT.jar> to /home/hudson/hudson/jobs/mahout-nightly/modules/org.apache.mahout$mahout-math/builds/2013-06-24_23-02-22/archive/org.apache.mahout/mahout-math/0.8-20130624.230323-336/mahout-math-0.8-20130624.230323-336.jar
[JENKINS] Archiving <https://builds.apache.org/job/mahout-nightly/ws/trunk/math/target/mahout-math-0.8-SNAPSHOT-tests.jar> to /home/hudson/hudson/jobs/mahout-nightly/modules/org.apache.mahout$mahout-math/builds/2013-06-24_23-02-22/archive/org.apache.mahout/mahout-math/0.8-20130624.230323-336/mahout-math-0.8-20130624.230323-336-tests.jar
[JENKINS] Archiving <https://builds.apache.org/job/mahout-nightly/ws/trunk/math/target/mahout-math-0.8-SNAPSHOT-sources.jar> to /home/hudson/hudson/jobs/mahout-nightly/modules/org.apache.mahout$mahout-math/builds/2013-06-24_23-02-22/archive/org.apache.mahout/mahout-math/0.8-20130624.230323-336/mahout-math-0.8-20130624.230323-336-sources.jar
Waiting for Jenkins to finish collecting data
mavenExecutionResult exceptions not empty
message : Failed to execute goal org.apache.maven.plugins:maven-surefire-plugin:2.14.1:test (default-test) on project mahout-integration: There are test failures.
Please refer to <https://builds.apache.org/job/mahout-nightly/ws/trunk/integration/target/surefire-reports> for the individual test results.
cause : There are test failures.
Please refer to <https://builds.apache.org/job/mahout-nightly/ws/trunk/integration/target/surefire-reports> for the individual test results.
Stack trace :
org.apache.maven.lifecycle.LifecycleExecutionException: Failed to execute goal org.apache.maven.plugins:maven-surefire-plugin:2.14.1:test (default-test) on project mahout-integration: There are test failures.
Please refer to <https://builds.apache.org/job/mahout-nightly/ws/trunk/integration/target/surefire-reports> for the individual test results.
at org.apache.maven.lifecycle.internal.MojoExecutor.execute(MojoExecutor.java:213)
at org.apache.maven.lifecycle.internal.MojoExecutor.execute(MojoExecutor.java:153)
at org.apache.maven.lifecycle.internal.MojoExecutor.execute(MojoExecutor.java:145)
at org.apache.maven.lifecycle.internal.LifecycleModuleBuilder.buildProject(LifecycleModuleBuilder.java:84)
at org.apache.maven.lifecycle.internal.LifecycleModuleBuilder.buildProject(LifecycleModuleBuilder.java:59)
at org.apache.maven.lifecycle.internal.LifecycleStarter.singleThreadedBuild(LifecycleStarter.java:183)
at org.apache.maven.lifecycle.internal.LifecycleStarter.execute(LifecycleStarter.java:161)
at org.apache.maven.DefaultMaven.doExecute(DefaultMaven.java:320)
at org.apache.maven.DefaultMaven.execute(DefaultMaven.java:156)
at org.jvnet.hudson.maven3.launcher.Maven3Launcher.main(Maven3Launcher.java:79)
at sun.reflect.NativeMethodAccessorImpl.invoke0(Native Method)
at sun.reflect.NativeMethodAccessorImpl.invoke(NativeMethodAccessorImpl.java:39)
at sun.reflect.DelegatingMethodAccessorImpl.invoke(DelegatingMethodAccessorImpl.java:25)
at java.lang.reflect.Method.invoke(Method.java:597)
at org.codehaus.plexus.classworlds.launcher.Launcher.launchStandard(Launcher.java:329)
at org.codehaus.plexus.classworlds.launcher.Launcher.launch(Launcher.java:239)
at org.jvnet.hudson.maven3.agent.Maven3Main.launch(Maven3Main.java:158)
at hudson.maven.Maven3Builder.call(Maven3Builder.java:100)
at hudson.maven.Maven3Builder.call(Maven3Builder.java:66)
at hudson.remoting.UserRequest.perform(UserRequest.java:118)
at hudson.remoting.UserRequest.perform(UserRequest.java:48)
at hudson.remoting.Request$2.run(Request.java:326)
at hudson.remoting.InterceptingExecutorService$1.call(InterceptingExecutorService.java:72)
at java.util.concurrent.FutureTask$Sync.innerRun(FutureTask.java:303)
at java.util.concurrent.FutureTask.run(FutureTask.java:138)
at java.util.concurrent.ThreadPoolExecutor$Worker.runTask(ThreadPoolExecutor.java:895)
at java.util.concurrent.ThreadPoolExecutor$Worker.run(ThreadPoolExecutor.java:918)
at java.lang.Thread.run(Thread.java:662)
Caused by: org.apache.maven.plugin.MojoFailureException: There are test failures.
Please refer to <https://builds.apache.org/job/mahout-nightly/ws/trunk/integration/target/surefire-reports> for the individual test results.
at org.apache.maven.plugin.surefire.SurefireHelper.reportExecution(SurefireHelper.java:82)
at org.apache.maven.plugin.surefire.SurefirePlugin.handleSummary(SurefirePlugin.java:169)
at org.apache.maven.plugin.surefire.AbstractSurefireMojo.executeAfterPreconditionsChecked(AbstractSurefireMojo.java:733)
at org.apache.maven.plugin.surefire.AbstractSurefireMojo.execute(AbstractSurefireMojo.java:631)
at org.apache.maven.plugin.DefaultBuildPluginManager.executeMojo(DefaultBuildPluginManager.java:101)
at org.apache.maven.lifecycle.internal.MojoExecutor.execute(MojoExecutor.java:209)
... 27 more
Sending e-mails to: dev@mahout.apache.org suneel.marthi@gmail.com
channel stopped
Build failed in Jenkins: mahout-nightly #1271
Posted by Apache Jenkins Server <je...@builds.apache.org>.
See <https://builds.apache.org/job/mahout-nightly/1271/changes>
Changes:
[smarthi] MAHOUT-833: Make conversion to sequence files map-reduce - Checking in, tests pass
------------------------------------------
[...truncated 2159 lines...]
Downloaded: http://repo.maven.apache.org/maven2/org/apache/lucene/lucene-facet/4.3.0/lucene-facet-4.3.0.pom (5 KB at 74.6 KB/sec)
Downloading: http://repo.maven.apache.org/maven2/org/apache/lucene/lucene-benchmark/4.3.0/lucene-benchmark-4.3.0.jar
Downloading: http://repo.maven.apache.org/maven2/org/apache/lucene/lucene-highlighter/4.3.0/lucene-highlighter-4.3.0.jar
Downloading: http://repo.maven.apache.org/maven2/org/apache/lucene/lucene-memory/4.3.0/lucene-memory-4.3.0.jar
Downloading: http://repo.maven.apache.org/maven2/org/apache/lucene/lucene-queries/4.3.0/lucene-queries-4.3.0.jar
Downloading: http://repo.maven.apache.org/maven2/org/apache/lucene/lucene-queryparser/4.3.0/lucene-queryparser-4.3.0.jar
Downloaded: http://repo.maven.apache.org/maven2/org/apache/lucene/lucene-memory/4.3.0/lucene-memory-4.3.0.jar (36 KB at 2337.3 KB/sec)
Downloading: http://repo.maven.apache.org/maven2/org/apache/lucene/lucene-sandbox/4.3.0/lucene-sandbox-4.3.0.jar
Downloaded: http://repo.maven.apache.org/maven2/org/apache/lucene/lucene-highlighter/4.3.0/lucene-highlighter-4.3.0.jar (121 KB at 4639.9 KB/sec)
Downloading: http://repo.maven.apache.org/maven2/org/apache/lucene/lucene-facet/4.3.0/lucene-facet-4.3.0.jar
Downloaded: http://repo.maven.apache.org/maven2/org/apache/lucene/lucene-queries/4.3.0/lucene-queries-4.3.0.jar (198 KB at 8599.7 KB/sec)
Downloaded: http://repo.maven.apache.org/maven2/org/apache/lucene/lucene-sandbox/4.3.0/lucene-sandbox-4.3.0.jar (45 KB at 4937.2 KB/sec)
Downloaded: http://repo.maven.apache.org/maven2/org/apache/lucene/lucene-queryparser/4.3.0/lucene-queryparser-4.3.0.jar (377 KB at 13946.8 KB/sec)
Downloaded: http://repo.maven.apache.org/maven2/org/apache/lucene/lucene-benchmark/4.3.0/lucene-benchmark-4.3.0.jar (257 KB at 2569.5 KB/sec)
Downloaded: http://repo.maven.apache.org/maven2/org/apache/lucene/lucene-facet/4.3.0/lucene-facet-4.3.0.jar (337 KB at 1709.8 KB/sec)
[INFO] [INFO] Deleting <https://builds.apache.org/job/mahout-nightly/ws/trunk/integration/target>
[INFO] --- maven-clean-plugin:2.4.1:clean (default-clean) @ mahout-integration ---
[INFO] [INFO] Using 'UTF-8' encoding to copy filtered resources.
[INFO] --- maven-resources-plugin:2.6:resources (default-resources) @ mahout-integration ---
[INFO] Copying 0 resource
[INFO]
[INFO] --- maven-compiler-plugin:3.1:compile (default-compile) @ mahout-integration ---
[INFO] Changes detected - recompiling the module!
[INFO] Compiling 131 source files to <https://builds.apache.org/job/mahout-nightly/ws/trunk/integration/target/classes>
[WARNING] Note: Some input files use or override a deprecated API.
[WARNING] Note: Recompile with -Xlint:deprecation for details.
[WARNING] Note: <https://builds.apache.org/job/mahout-nightly/ws/trunk/integration/src/main/java/org/apache/mahout/cf/taste/impl/model/mongodb/MongoDBDataModel.java> uses unchecked or unsafe operations.
[WARNING] Note: Recompile with -Xlint:unchecked for details.
[INFO] [INFO] Using 'UTF-8' encoding to copy filtered resources.
[INFO] Copying 10 resources
[INFO] --- maven-resources-plugin:2.6:testResources (default-testResources) @ mahout-integration ---
[INFO]
[INFO] --- maven-compiler-plugin:3.1:testCompile (default-testCompile) @ mahout-integration ---
[INFO] Changes detected - recompiling the module!
[INFO] Compiling 39 source files to <https://builds.apache.org/job/mahout-nightly/ws/trunk/integration/target/test-classes>
[WARNING] Note: Some input files use or override a deprecated API.
[WARNING] Note: Recompile with -Xlint:deprecation for details.
[INFO] [INFO] Surefire report directory: <https://builds.apache.org/job/mahout-nightly/ws/trunk/integration/target/surefire-reports>
-------------------------------------------------------
T E S T S
-------------------------------------------------------
-------------------------------------------------------
T E S T S
-------------------------------------------------------
[INFO] --- maven-surefire-plugin:2.14.1:test (default-test) @ mahout-integration ---
parallel='classes', perCoreThreadCount=false, threadCount=1, useUnlimitedThreads=false
parallel='classes', perCoreThreadCount=false, threadCount=1, useUnlimitedThreads=false
parallel='classes', perCoreThreadCount=false, threadCount=1, useUnlimitedThreads=false
parallel='classes', perCoreThreadCount=false, threadCount=1, useUnlimitedThreads=false
parallel='classes', perCoreThreadCount=false, threadCount=1, useUnlimitedThreads=false
parallel='classes', perCoreThreadCount=false, threadCount=1, useUnlimitedThreads=false
parallel='classes', perCoreThreadCount=false, threadCount=1, useUnlimitedThreads=false
Running org.apache.mahout.utils.vectors.csv.CSVVectorIteratorTest
parallel='classes', perCoreThreadCount=false, threadCount=1, useUnlimitedThreads=false
parallel='classes', perCoreThreadCount=false, threadCount=1, useUnlimitedThreads=false
Running org.apache.mahout.utils.nlp.collocations.llr.BloomTokenFilterTest
Tests run: 5, Failures: 0, Errors: 0, Skipped: 0, Time elapsed: 0.046 sec
Running org.apache.mahout.clustering.dirichlet.TestL1ModelClustering
parallel='classes', perCoreThreadCount=false, threadCount=1, useUnlimitedThreads=false
parallel='classes', perCoreThreadCount=false, threadCount=1, useUnlimitedThreads=false
parallel='classes', perCoreThreadCount=false, threadCount=1, useUnlimitedThreads=false
Running org.apache.mahout.clustering.TestClusterDumper
Running org.apache.mahout.utils.regex.RegexMapperTest
Running org.apache.mahout.utils.vectors.io.VectorWriterTest
Running org.apache.mahout.utils.regex.RegexUtilsTest
Running org.apache.mahout.clustering.cdbw.TestCDbwEvaluator
Tests run: 1, Failures: 0, Errors: 0, Skipped: 0, Time elapsed: 0.025 sec
Tests run: 1, Failures: 0, Errors: 0, Skipped: 0, Time elapsed: 0.422 sec
Running org.apache.mahout.clustering.TestClusterEvaluator
Running org.apache.mahout.utils.vectors.lucene.DriverTest
Running org.apache.mahout.utils.vectors.lucene.CachedTermInfoTest
Running org.apache.mahout.utils.email.MailProcessorTest
parallel='classes', perCoreThreadCount=false, threadCount=1, useUnlimitedThreads=false
parallel='classes', perCoreThreadCount=false, threadCount=1, useUnlimitedThreads=false
Tests run: 2, Failures: 0, Errors: 0, Skipped: 0, Time elapsed: 0.328 sec
Running org.apache.mahout.utils.vectors.VectorHelperTest
Tests run: 3, Failures: 0, Errors: 0, Skipped: 0, Time elapsed: 0.038 sec
Running org.apache.mahout.utils.vectors.lucene.LuceneIterableTest
parallel='classes', perCoreThreadCount=false, threadCount=1, useUnlimitedThreads=false
Tests run: 1, Failures: 0, Errors: 0, Skipped: 0, Time elapsed: 1.004 sec
parallel='classes', perCoreThreadCount=false, threadCount=1, useUnlimitedThreads=false
Tests run: 3, Failures: 0, Errors: 0, Skipped: 0, Time elapsed: 1.421 sec
Tests run: 2, Failures: 0, Errors: 0, Skipped: 0, Time elapsed: 1.455 sec
Running org.apache.mahout.utils.vectors.arff.ARFFTypeTest
Tests run: 1, Failures: 0, Errors: 0, Skipped: 0, Time elapsed: 0.007 sec
parallel='classes', perCoreThreadCount=false, threadCount=1, useUnlimitedThreads=false
Running org.apache.mahout.utils.vectors.arff.ARFFVectorIterableTest
Running org.apache.mahout.utils.vectors.arff.DriverTest
Tests run: 8, Failures: 0, Errors: 0, Skipped: 0, Time elapsed: 0.27 sec
parallel='classes', perCoreThreadCount=false, threadCount=1, useUnlimitedThreads=false
parallel='classes', perCoreThreadCount=false, threadCount=1, useUnlimitedThreads=false
parallel='classes', perCoreThreadCount=false, threadCount=1, useUnlimitedThreads=false
Running org.apache.mahout.utils.vectors.arff.MapBackedARFFModelTest
Tests run: 2, Failures: 0, Errors: 0, Skipped: 0, Time elapsed: 0.561 sec
Tests run: 3, Failures: 0, Errors: 0, Skipped: 0, Time elapsed: 1.402 sec
Tests run: 1, Failures: 0, Errors: 0, Skipped: 0, Time elapsed: 0.069 sec
Running org.apache.mahout.utils.SplitInputTest
parallel='classes', perCoreThreadCount=false, threadCount=1, useUnlimitedThreads=false
Running org.apache.mahout.utils.Bump125Test
Tests run: 1, Failures: 0, Errors: 0, Skipped: 0, Time elapsed: 0.013 sec
parallel='classes', perCoreThreadCount=false, threadCount=1, useUnlimitedThreads=false
Tests run: 1, Failures: 0, Errors: 0, Skipped: 0, Time elapsed: 2.577 sec
parallel='classes', perCoreThreadCount=false, threadCount=1, useUnlimitedThreads=false
Running org.apache.mahout.utils.TestConcatenateVectorsJob
Tests run: 4, Failures: 0, Errors: 0, Skipped: 0, Time elapsed: 3.215 sec
Running org.apache.mahout.cf.taste.impl.similarity.jdbc.MySQLJDBCInMemoryItemSimilarityTest
parallel='classes', perCoreThreadCount=false, threadCount=1, useUnlimitedThreads=false
parallel='classes', perCoreThreadCount=false, threadCount=1, useUnlimitedThreads=false
Running org.apache.mahout.text.SequenceFilesFromLuceneStorageTest
Running org.apache.mahout.text.LuceneStorageConfigurationTest
parallel='classes', perCoreThreadCount=false, threadCount=1, useUnlimitedThreads=false
Tests run: 1, Failures: 0, Errors: 0, Skipped: 0, Time elapsed: 0.544 sec
parallel='classes', perCoreThreadCount=false, threadCount=1, useUnlimitedThreads=false
Running org.apache.mahout.text.TestSequenceFilesFromDirectory
Running org.apache.mahout.text.LuceneSegmentInputFormatTest
parallel='classes', perCoreThreadCount=false, threadCount=1, useUnlimitedThreads=false
Tests run: 1, Failures: 0, Errors: 0, Skipped: 0, Time elapsed: 1.286 sec
Running org.apache.mahout.text.SequenceFilesFromMailArchivesTest
Running org.apache.mahout.text.MailArchivesClusteringAnalyzerTest
parallel='classes', perCoreThreadCount=false, threadCount=1, useUnlimitedThreads=false
Tests run: 1, Failures: 0, Errors: 0, Skipped: 0, Time elapsed: 0.148 sec
Tests run: 2, Failures: 0, Errors: 0, Skipped: 0, Time elapsed: 1.334 sec
Running org.apache.mahout.text.LuceneSegmentRecordReaderTest
parallel='classes', perCoreThreadCount=false, threadCount=1, useUnlimitedThreads=false
parallel='classes', perCoreThreadCount=false, threadCount=1, useUnlimitedThreads=false
Running org.apache.mahout.text.LuceneSegmentInputSplitTest
parallel='classes', perCoreThreadCount=false, threadCount=1, useUnlimitedThreads=false
Running org.apache.mahout.text.SequenceFilesFromLuceneStorageMRJobTest
Running org.apache.mahout.text.SequenceFilesFromLuceneStorageDriverTest
Tests run: 1, Failures: 0, Errors: 0, Skipped: 0, Time elapsed: 3.123 sec
Tests run: 2, Failures: 0, Errors: 0, Skipped: 0, Time elapsed: 2.864 sec
Tests run: 2, Failures: 0, Errors: 0, Skipped: 0, Time elapsed: 4.358 sec
Tests run: 1, Failures: 0, Errors: 0, Skipped: 0, Time elapsed: 4.02 sec
Tests run: 2, Failures: 0, Errors: 0, Skipped: 0, Time elapsed: 5.38 sec
Tests run: 6, Failures: 0, Errors: 0, Skipped: 0, Time elapsed: 7.112 sec
Tests run: 1, Failures: 1, Errors: 0, Skipped: 0, Time elapsed: 5.331 sec <<< FAILURE!
testRun(org.apache.mahout.text.SequenceFilesFromLuceneStorageMRJobTest) Time elapsed: 5.33 sec <<< FAILURE!
java.lang.AssertionError: expected:<2002> but was:<0>
at org.junit.Assert.fail(Assert.java:88)
at org.junit.Assert.failNotEquals(Assert.java:743)
at org.junit.Assert.assertEquals(Assert.java:118)
at org.junit.Assert.assertEquals(Assert.java:555)
at org.junit.Assert.assertEquals(Assert.java:542)
at org.apache.mahout.text.SequenceFilesFromLuceneStorageMRJobTest.testRun(SequenceFilesFromLuceneStorageMRJobTest.java:74)
Tests run: 12, Failures: 0, Errors: 0, Skipped: 0, Time elapsed: 9.259 sec
Tests run: 5, Failures: 0, Errors: 0, Skipped: 0, Time elapsed: 5.754 sec
Tests run: 6, Failures: 0, Errors: 0, Skipped: 0, Time elapsed: 12.954 sec
Tests run: 12, Failures: 0, Errors: 0, Skipped: 0, Time elapsed: 13.57 sec
Tests run: 12, Failures: 0, Errors: 0, Skipped: 0, Time elapsed: 22.27 sec
Results :
Failed tests:
SequenceFilesFromLuceneStorageMRJobTest.testRun:74->Assert.assertEquals:542->Assert.assertEquals:555->Assert.assertEquals:118->Assert.failNotEquals:743->Assert.fail:88 expected:<2002> but was:<0>
Tests run: 106, Failures: 1, Errors: 0, Skipped: 0
[JENKINS] Recording test results
[INFO] ------------------------------------------------------------------------
[INFO] Reactor Summary:
[INFO]
[INFO] Apache Mahout ..................................... SUCCESS [24.109s]
[INFO] Mahout Build Tools ................................ SUCCESS [6.097s]
[INFO] Mahout Math ....................................... SUCCESS [1:01.021s]
[INFO] Mahout Core ....................................... SUCCESS [6:00.884s]
[INFO] Mahout Integration ................................ FAILURE [35.484s]
[INFO] Mahout Examples ................................... SKIPPED
[INFO] Mahout Release Package ............................ SKIPPED
[INFO] ------------------------------------------------------------------------
[INFO] BUILD FAILURE
[INFO] ------------------------------------------------------------------------
[INFO] Total time: 8:10.712s
[INFO] Finished at: Sun Jun 23 23:10:18 UTC 2013
[INFO] Final Memory: 38M/351M
[INFO] ------------------------------------------------------------------------
[JENKINS] Archiving <https://builds.apache.org/job/mahout-nightly/ws/trunk/buildtools/pom.xml> to /home/hudson/hudson/jobs/mahout-nightly/modules/org.apache.mahout$mahout-buildtools/builds/2013-06-23_23-01-54/archive/org.apache.mahout/mahout-buildtools/0.8-SNAPSHOT/mahout-buildtools-0.8-SNAPSHOT.pom
[JENKINS] Archiving <https://builds.apache.org/job/mahout-nightly/ws/trunk/buildtools/target/mahout-buildtools-0.8-SNAPSHOT.jar> to /home/hudson/hudson/jobs/mahout-nightly/modules/org.apache.mahout$mahout-buildtools/builds/2013-06-23_23-01-54/archive/org.apache.mahout/mahout-buildtools/0.8-20130623.230238-356/mahout-buildtools-0.8-20130623.230238-356.jar
[JENKINS] Archiving <https://builds.apache.org/job/mahout-nightly/ws/trunk/examples/pom.xml> to /home/hudson/hudson/jobs/mahout-nightly/modules/org.apache.mahout$mahout-examples/builds/2013-06-23_23-01-54/archive/org.apache.mahout/mahout-examples/0.8-SNAPSHOT/mahout-examples-0.8-SNAPSHOT.pom
[JENKINS] Archiving <https://builds.apache.org/job/mahout-nightly/ws/trunk/distribution/pom.xml> to /home/hudson/hudson/jobs/mahout-nightly/modules/org.apache.mahout$mahout-distribution/builds/2013-06-23_23-01-54/archive/org.apache.mahout/mahout-distribution/0.8-SNAPSHOT/mahout-distribution-0.8-SNAPSHOT.pom
[JENKINS] Archiving <https://builds.apache.org/job/mahout-nightly/ws/trunk/pom.xml> to /home/hudson/hudson/jobs/mahout-nightly/modules/org.apache.mahout$mahout/builds/2013-06-23_23-01-53/archive/org.apache.mahout/mahout/0.8-SNAPSHOT/mahout-0.8-SNAPSHOT.pom
[JENKINS] Archiving <https://builds.apache.org/job/mahout-nightly/ws/trunk/integration/pom.xml> to /home/hudson/hudson/jobs/mahout-nightly/modules/org.apache.mahout$mahout-integration/builds/2013-06-23_23-01-54/archive/org.apache.mahout/mahout-integration/0.8-SNAPSHOT/mahout-integration-0.8-SNAPSHOT.pom
[JENKINS] Archiving <https://builds.apache.org/job/mahout-nightly/ws/trunk/core/pom.xml> to /home/hudson/hudson/jobs/mahout-nightly/modules/org.apache.mahout$mahout-core/builds/2013-06-23_23-01-54/archive/org.apache.mahout/mahout-core/0.8-SNAPSHOT/mahout-core-0.8-SNAPSHOT.pom
[JENKINS] Archiving <https://builds.apache.org/job/mahout-nightly/ws/trunk/core/target/mahout-core-0.8-SNAPSHOT.jar> to /home/hudson/hudson/jobs/mahout-nightly/modules/org.apache.mahout$mahout-core/builds/2013-06-23_23-01-54/archive/org.apache.mahout/mahout-core/0.8-20130623.230934-280/mahout-core-0.8-20130623.230934-280.jar
[JENKINS] Archiving <https://builds.apache.org/job/mahout-nightly/ws/trunk/core/target/mahout-core-0.8-SNAPSHOT-tests.jar> to /home/hudson/hudson/jobs/mahout-nightly/modules/org.apache.mahout$mahout-core/builds/2013-06-23_23-01-54/archive/org.apache.mahout/mahout-core/0.8-20130623.230934-280/mahout-core-0.8-20130623.230934-280-tests.jar
[JENKINS] Archiving <https://builds.apache.org/job/mahout-nightly/ws/trunk/core/target/mahout-core-0.8-SNAPSHOT-job.jar> to /home/hudson/hudson/jobs/mahout-nightly/modules/org.apache.mahout$mahout-core/builds/2013-06-23_23-01-54/archive/org.apache.mahout/mahout-core/0.8-20130623.230934-280/mahout-core-0.8-20130623.230934-280-job.jar
[JENKINS] Archiving <https://builds.apache.org/job/mahout-nightly/ws/trunk/core/target/mahout-core-0.8-SNAPSHOT-sources.jar> to /home/hudson/hudson/jobs/mahout-nightly/modules/org.apache.mahout$mahout-core/builds/2013-06-23_23-01-54/archive/org.apache.mahout/mahout-core/0.8-20130623.230934-280/mahout-core-0.8-20130623.230934-280-sources.jar
[JENKINS] Archiving <https://builds.apache.org/job/mahout-nightly/ws/trunk/math/pom.xml> to /home/hudson/hudson/jobs/mahout-nightly/modules/org.apache.mahout$mahout-math/builds/2013-06-23_23-01-54/archive/org.apache.mahout/mahout-math/0.8-SNAPSHOT/mahout-math-0.8-SNAPSHOT.pom
[JENKINS] Archiving <https://builds.apache.org/job/mahout-nightly/ws/trunk/math/target/mahout-math-0.8-SNAPSHOT.jar> to /home/hudson/hudson/jobs/mahout-nightly/modules/org.apache.mahout$mahout-math/builds/2013-06-23_23-01-54/archive/org.apache.mahout/mahout-math/0.8-20130623.230336-335/mahout-math-0.8-20130623.230336-335.jar
[JENKINS] Archiving <https://builds.apache.org/job/mahout-nightly/ws/trunk/math/target/mahout-math-0.8-SNAPSHOT-tests.jar> to /home/hudson/hudson/jobs/mahout-nightly/modules/org.apache.mahout$mahout-math/builds/2013-06-23_23-01-54/archive/org.apache.mahout/mahout-math/0.8-20130623.230336-335/mahout-math-0.8-20130623.230336-335-tests.jar
[JENKINS] Archiving <https://builds.apache.org/job/mahout-nightly/ws/trunk/math/target/mahout-math-0.8-SNAPSHOT-sources.jar> to /home/hudson/hudson/jobs/mahout-nightly/modules/org.apache.mahout$mahout-math/builds/2013-06-23_23-01-54/archive/org.apache.mahout/mahout-math/0.8-20130623.230336-335/mahout-math-0.8-20130623.230336-335-sources.jar
Waiting for Jenkins to finish collecting data
mavenExecutionResult exceptions not empty
message : Failed to execute goal org.apache.maven.plugins:maven-surefire-plugin:2.14.1:test (default-test) on project mahout-integration: There are test failures.
Please refer to <https://builds.apache.org/job/mahout-nightly/ws/trunk/integration/target/surefire-reports> for the individual test results.
cause : There are test failures.
Please refer to <https://builds.apache.org/job/mahout-nightly/ws/trunk/integration/target/surefire-reports> for the individual test results.
Stack trace :
org.apache.maven.lifecycle.LifecycleExecutionException: Failed to execute goal org.apache.maven.plugins:maven-surefire-plugin:2.14.1:test (default-test) on project mahout-integration: There are test failures.
Please refer to <https://builds.apache.org/job/mahout-nightly/ws/trunk/integration/target/surefire-reports> for the individual test results.
at org.apache.maven.lifecycle.internal.MojoExecutor.execute(MojoExecutor.java:213)
at org.apache.maven.lifecycle.internal.MojoExecutor.execute(MojoExecutor.java:153)
at org.apache.maven.lifecycle.internal.MojoExecutor.execute(MojoExecutor.java:145)
at org.apache.maven.lifecycle.internal.LifecycleModuleBuilder.buildProject(LifecycleModuleBuilder.java:84)
at org.apache.maven.lifecycle.internal.LifecycleModuleBuilder.buildProject(LifecycleModuleBuilder.java:59)
at org.apache.maven.lifecycle.internal.LifecycleStarter.singleThreadedBuild(LifecycleStarter.java:183)
at org.apache.maven.lifecycle.internal.LifecycleStarter.execute(LifecycleStarter.java:161)
at org.apache.maven.DefaultMaven.doExecute(DefaultMaven.java:320)
at org.apache.maven.DefaultMaven.execute(DefaultMaven.java:156)
at org.jvnet.hudson.maven3.launcher.Maven3Launcher.main(Maven3Launcher.java:79)
at sun.reflect.NativeMethodAccessorImpl.invoke0(Native Method)
at sun.reflect.NativeMethodAccessorImpl.invoke(NativeMethodAccessorImpl.java:39)
at sun.reflect.DelegatingMethodAccessorImpl.invoke(DelegatingMethodAccessorImpl.java:25)
at java.lang.reflect.Method.invoke(Method.java:597)
at org.codehaus.plexus.classworlds.launcher.Launcher.launchStandard(Launcher.java:329)
at org.codehaus.plexus.classworlds.launcher.Launcher.launch(Launcher.java:239)
at org.jvnet.hudson.maven3.agent.Maven3Main.launch(Maven3Main.java:158)
at hudson.maven.Maven3Builder.call(Maven3Builder.java:100)
at hudson.maven.Maven3Builder.call(Maven3Builder.java:66)
at hudson.remoting.UserRequest.perform(UserRequest.java:118)
at hudson.remoting.UserRequest.perform(UserRequest.java:48)
at hudson.remoting.Request$2.run(Request.java:326)
at hudson.remoting.InterceptingExecutorService$1.call(InterceptingExecutorService.java:72)
at java.util.concurrent.FutureTask$Sync.innerRun(FutureTask.java:303)
at java.util.concurrent.FutureTask.run(FutureTask.java:138)
at java.util.concurrent.ThreadPoolExecutor$Worker.runTask(ThreadPoolExecutor.java:895)
at java.util.concurrent.ThreadPoolExecutor$Worker.run(ThreadPoolExecutor.java:918)
at java.lang.Thread.run(Thread.java:662)
Caused by: org.apache.maven.plugin.MojoFailureException: There are test failures.
Please refer to <https://builds.apache.org/job/mahout-nightly/ws/trunk/integration/target/surefire-reports> for the individual test results.
at org.apache.maven.plugin.surefire.SurefireHelper.reportExecution(SurefireHelper.java:82)
at org.apache.maven.plugin.surefire.SurefirePlugin.handleSummary(SurefirePlugin.java:169)
at org.apache.maven.plugin.surefire.AbstractSurefireMojo.executeAfterPreconditionsChecked(AbstractSurefireMojo.java:733)
at org.apache.maven.plugin.surefire.AbstractSurefireMojo.execute(AbstractSurefireMojo.java:631)
at org.apache.maven.plugin.DefaultBuildPluginManager.executeMojo(DefaultBuildPluginManager.java:101)
at org.apache.maven.lifecycle.internal.MojoExecutor.execute(MojoExecutor.java:209)
... 27 more
Sending e-mails to: dev@mahout.apache.org suneel.marthi@gmail.com
channel stopped