You are viewing a plain text version of this content. The canonical link for it is here.
Posted to dev@kafka.apache.org by Apache Jenkins Server <je...@builds.apache.org> on 2020/05/21 19:25:25 UTC

Build failed in Jenkins: kafka-trunk-jdk11 #1486

See <https://builds.apache.org/job/kafka-trunk-jdk11/1486/display/redirect?page=changes>

Changes:

[github] MINOR: Deploy VerifiableClient in constructor to avoid test timeouts


------------------------------------------
[...truncated 3.10 MB...]
org.apache.kafka.streams.TestTopicsTest > testEmptyTopic PASSED

org.apache.kafka.streams.TestTopicsTest > testStartTimestamp STARTED

org.apache.kafka.streams.TestTopicsTest > testStartTimestamp PASSED

org.apache.kafka.streams.TestTopicsTest > testNegativeAdvance STARTED

org.apache.kafka.streams.TestTopicsTest > testNegativeAdvance PASSED

org.apache.kafka.streams.TestTopicsTest > shouldNotAllowToCreateWithNullDriver STARTED

org.apache.kafka.streams.TestTopicsTest > shouldNotAllowToCreateWithNullDriver PASSED

org.apache.kafka.streams.TestTopicsTest > testDuration STARTED

org.apache.kafka.streams.TestTopicsTest > testDuration PASSED

org.apache.kafka.streams.TestTopicsTest > testOutputToString STARTED

org.apache.kafka.streams.TestTopicsTest > testOutputToString PASSED

org.apache.kafka.streams.TestTopicsTest > testValue STARTED

org.apache.kafka.streams.TestTopicsTest > testValue PASSED

org.apache.kafka.streams.TestTopicsTest > testTimestampAutoAdvance STARTED

org.apache.kafka.streams.TestTopicsTest > testTimestampAutoAdvance PASSED

org.apache.kafka.streams.TestTopicsTest > testOutputWrongSerde STARTED

org.apache.kafka.streams.TestTopicsTest > testOutputWrongSerde PASSED

org.apache.kafka.streams.TestTopicsTest > shouldNotAllowToCreateOutputTopicWithNullTopicName STARTED

org.apache.kafka.streams.TestTopicsTest > shouldNotAllowToCreateOutputTopicWithNullTopicName PASSED

org.apache.kafka.streams.TestTopicsTest > testWrongSerde STARTED

org.apache.kafka.streams.TestTopicsTest > testWrongSerde PASSED

org.apache.kafka.streams.TestTopicsTest > testKeyValuesToMapWithNull STARTED

org.apache.kafka.streams.TestTopicsTest > testKeyValuesToMapWithNull PASSED

org.apache.kafka.streams.TestTopicsTest > testNonExistingOutputTopic STARTED

org.apache.kafka.streams.TestTopicsTest > testNonExistingOutputTopic PASSED

org.apache.kafka.streams.TestTopicsTest > testMultipleTopics STARTED

org.apache.kafka.streams.TestTopicsTest > testMultipleTopics PASSED

org.apache.kafka.streams.TestTopicsTest > testKeyValueList STARTED

org.apache.kafka.streams.TestTopicsTest > testKeyValueList PASSED

org.apache.kafka.streams.TestTopicsTest > shouldNotAllowToCreateOutputWithNullDriver STARTED

org.apache.kafka.streams.TestTopicsTest > shouldNotAllowToCreateOutputWithNullDriver PASSED

org.apache.kafka.streams.TestTopicsTest > testValueList STARTED

org.apache.kafka.streams.TestTopicsTest > testValueList PASSED

org.apache.kafka.streams.TestTopicsTest > testRecordList STARTED

org.apache.kafka.streams.TestTopicsTest > testRecordList PASSED

org.apache.kafka.streams.TestTopicsTest > testNonExistingInputTopic STARTED

org.apache.kafka.streams.TestTopicsTest > testNonExistingInputTopic PASSED

org.apache.kafka.streams.TestTopicsTest > testKeyValuesToMap STARTED

org.apache.kafka.streams.TestTopicsTest > testKeyValuesToMap PASSED

org.apache.kafka.streams.TestTopicsTest > testRecordsToList STARTED

org.apache.kafka.streams.TestTopicsTest > testRecordsToList PASSED

org.apache.kafka.streams.TestTopicsTest > testKeyValueListDuration STARTED

org.apache.kafka.streams.TestTopicsTest > testKeyValueListDuration PASSED

org.apache.kafka.streams.TestTopicsTest > testInputToString STARTED

org.apache.kafka.streams.TestTopicsTest > testInputToString PASSED

org.apache.kafka.streams.TestTopicsTest > testTimestamp STARTED

org.apache.kafka.streams.TestTopicsTest > testTimestamp PASSED

org.apache.kafka.streams.TestTopicsTest > testWithHeaders STARTED

org.apache.kafka.streams.TestTopicsTest > testWithHeaders PASSED

org.apache.kafka.streams.TestTopicsTest > testKeyValue STARTED

org.apache.kafka.streams.TestTopicsTest > testKeyValue PASSED

org.apache.kafka.streams.TestTopicsTest > shouldNotAllowToCreateTopicWithNullTopicName STARTED

org.apache.kafka.streams.TestTopicsTest > shouldNotAllowToCreateTopicWithNullTopicName PASSED

> Task :streams:upgrade-system-tests-0100:classes UP-TO-DATE
> Task :streams:upgrade-system-tests-0100:checkstyleMain NO-SOURCE
> Task :streams:upgrade-system-tests-0100:compileTestJava
> Task :streams:upgrade-system-tests-0100:processTestResources NO-SOURCE
> Task :streams:upgrade-system-tests-0100:testClasses
> Task :streams:upgrade-system-tests-0100:checkstyleTest
> Task :streams:upgrade-system-tests-0100:spotbugsMain NO-SOURCE
> Task :streams:upgrade-system-tests-0100:test
> Task :streams:upgrade-system-tests-0101:compileJava NO-SOURCE
> Task :streams:upgrade-system-tests-0101:processResources NO-SOURCE
> Task :streams:upgrade-system-tests-0101:classes UP-TO-DATE
> Task :streams:upgrade-system-tests-0101:checkstyleMain NO-SOURCE
> Task :streams:upgrade-system-tests-0101:compileTestJava
> Task :streams:upgrade-system-tests-0101:processTestResources NO-SOURCE
> Task :streams:upgrade-system-tests-0101:testClasses
> Task :streams:upgrade-system-tests-0101:checkstyleTest
> Task :streams:upgrade-system-tests-0101:spotbugsMain NO-SOURCE
> Task :streams:upgrade-system-tests-0101:test
> Task :streams:upgrade-system-tests-0102:compileJava NO-SOURCE
> Task :streams:upgrade-system-tests-0102:processResources NO-SOURCE
> Task :streams:upgrade-system-tests-0102:classes UP-TO-DATE
> Task :streams:upgrade-system-tests-0102:checkstyleMain NO-SOURCE
> Task :streams:upgrade-system-tests-0102:compileTestJava
> Task :streams:upgrade-system-tests-0102:processTestResources NO-SOURCE
> Task :streams:upgrade-system-tests-0102:testClasses
> Task :streams:upgrade-system-tests-0102:checkstyleTest
> Task :streams:upgrade-system-tests-0102:spotbugsMain NO-SOURCE
> Task :streams:upgrade-system-tests-0102:test
> Task :streams:upgrade-system-tests-0110:compileJava NO-SOURCE
> Task :streams:upgrade-system-tests-0110:processResources NO-SOURCE
> Task :streams:upgrade-system-tests-0110:classes UP-TO-DATE
> Task :streams:upgrade-system-tests-0110:checkstyleMain NO-SOURCE
> Task :streams:upgrade-system-tests-0110:compileTestJava
> Task :streams:upgrade-system-tests-0110:processTestResources NO-SOURCE
> Task :streams:upgrade-system-tests-0110:testClasses
> Task :streams:upgrade-system-tests-0110:checkstyleTest
> Task :streams:upgrade-system-tests-0110:spotbugsMain NO-SOURCE
> Task :streams:upgrade-system-tests-0110:test
> Task :streams:upgrade-system-tests-10:compileJava NO-SOURCE
> Task :streams:upgrade-system-tests-10:processResources NO-SOURCE
> Task :streams:upgrade-system-tests-10:classes UP-TO-DATE
> Task :streams:upgrade-system-tests-10:checkstyleMain NO-SOURCE
> Task :streams:upgrade-system-tests-10:compileTestJava
> Task :streams:upgrade-system-tests-10:processTestResources NO-SOURCE
> Task :streams:upgrade-system-tests-10:testClasses
> Task :streams:upgrade-system-tests-10:checkstyleTest
> Task :streams:upgrade-system-tests-10:spotbugsMain NO-SOURCE
> Task :streams:upgrade-system-tests-10:test
> Task :streams:upgrade-system-tests-11:compileJava NO-SOURCE
> Task :streams:upgrade-system-tests-11:processResources NO-SOURCE
> Task :streams:upgrade-system-tests-11:classes UP-TO-DATE
> Task :streams:upgrade-system-tests-11:checkstyleMain NO-SOURCE
> Task :streams:upgrade-system-tests-11:compileTestJava
> Task :streams:upgrade-system-tests-11:processTestResources NO-SOURCE
> Task :streams:upgrade-system-tests-11:testClasses
> Task :streams:upgrade-system-tests-11:checkstyleTest
> Task :streams:upgrade-system-tests-11:spotbugsMain NO-SOURCE
> Task :streams:upgrade-system-tests-11:test
> Task :streams:upgrade-system-tests-20:compileJava NO-SOURCE
> Task :streams:upgrade-system-tests-20:processResources NO-SOURCE
> Task :streams:upgrade-system-tests-20:classes UP-TO-DATE
> Task :streams:upgrade-system-tests-20:checkstyleMain NO-SOURCE
> Task :streams:upgrade-system-tests-20:compileTestJava
> Task :streams:upgrade-system-tests-20:processTestResources NO-SOURCE
> Task :streams:upgrade-system-tests-20:testClasses
> Task :streams:upgrade-system-tests-20:checkstyleTest
> Task :streams:upgrade-system-tests-20:spotbugsMain NO-SOURCE
> Task :streams:upgrade-system-tests-20:test
> Task :streams:upgrade-system-tests-21:compileJava NO-SOURCE
> Task :streams:upgrade-system-tests-21:processResources NO-SOURCE
> Task :streams:upgrade-system-tests-21:classes UP-TO-DATE
> Task :streams:upgrade-system-tests-21:checkstyleMain NO-SOURCE
> Task :streams:upgrade-system-tests-21:compileTestJava
> Task :streams:upgrade-system-tests-21:processTestResources NO-SOURCE
> Task :streams:upgrade-system-tests-21:testClasses
> Task :streams:upgrade-system-tests-21:checkstyleTest
> Task :streams:upgrade-system-tests-21:spotbugsMain NO-SOURCE
> Task :streams:upgrade-system-tests-21:test
> Task :streams:upgrade-system-tests-22:compileJava NO-SOURCE
> Task :streams:upgrade-system-tests-22:processResources NO-SOURCE
> Task :streams:upgrade-system-tests-22:classes UP-TO-DATE
> Task :streams:upgrade-system-tests-22:checkstyleMain NO-SOURCE
> Task :streams:upgrade-system-tests-22:compileTestJava
> Task :streams:upgrade-system-tests-22:processTestResources NO-SOURCE
> Task :streams:upgrade-system-tests-22:testClasses
> Task :streams:upgrade-system-tests-22:checkstyleTest
> Task :streams:upgrade-system-tests-22:spotbugsMain NO-SOURCE
> Task :streams:upgrade-system-tests-22:test
> Task :streams:upgrade-system-tests-23:compileJava NO-SOURCE
> Task :streams:upgrade-system-tests-23:processResources NO-SOURCE
> Task :streams:upgrade-system-tests-23:classes UP-TO-DATE
> Task :streams:upgrade-system-tests-23:checkstyleMain NO-SOURCE
> Task :streams:upgrade-system-tests-23:compileTestJava
> Task :streams:upgrade-system-tests-23:processTestResources NO-SOURCE
> Task :streams:upgrade-system-tests-23:testClasses
> Task :streams:upgrade-system-tests-23:checkstyleTest
> Task :streams:upgrade-system-tests-23:spotbugsMain NO-SOURCE
> Task :streams:upgrade-system-tests-23:test
> Task :streams:upgrade-system-tests-24:compileJava NO-SOURCE
> Task :streams:upgrade-system-tests-24:processResources NO-SOURCE
> Task :streams:upgrade-system-tests-24:classes UP-TO-DATE
> Task :streams:upgrade-system-tests-24:checkstyleMain NO-SOURCE
> Task :streams:upgrade-system-tests-24:compileTestJava
> Task :streams:upgrade-system-tests-24:processTestResources NO-SOURCE
> Task :streams:upgrade-system-tests-24:testClasses
> Task :streams:upgrade-system-tests-24:checkstyleTest
> Task :streams:upgrade-system-tests-24:spotbugsMain NO-SOURCE
> Task :streams:upgrade-system-tests-24:test
> Task :streams:upgrade-system-tests-25:compileJava NO-SOURCE
> Task :streams:upgrade-system-tests-25:processResources NO-SOURCE
> Task :streams:upgrade-system-tests-25:classes UP-TO-DATE
> Task :streams:upgrade-system-tests-25:checkstyleMain NO-SOURCE
> Task :streams:upgrade-system-tests-25:compileTestJava
> Task :streams:upgrade-system-tests-25:processTestResources NO-SOURCE
> Task :streams:upgrade-system-tests-25:testClasses
> Task :streams:upgrade-system-tests-25:checkstyleTest
> Task :streams:upgrade-system-tests-25:spotbugsMain NO-SOURCE
> Task :streams:upgrade-system-tests-25:test

FAILURE: Build failed with an exception.

* What went wrong:
Execution failed for task ':streams:test'.
> There were failing tests. See the report at: file://<https://builds.apache.org/job/kafka-trunk-jdk11/ws/streams/build/reports/tests/test/index.html>

* Try:
Run with --stacktrace option to get the stack trace. Run with --info or --debug option to get more log output. Run with --scan to get full insights.

* Get more help at https://help.gradle.org

Deprecated Gradle features were used in this build, making it incompatible with Gradle 7.0.
Use '--warning-mode all' to show the individual deprecation warnings.
See https://docs.gradle.org/6.4.1/userguide/command_line_interface.html#sec:command_line_warnings

BUILD FAILED in 1h 57m 24s
215 actionable tasks: 183 executed, 32 up-to-date
Build step 'Execute shell' marked build as failure
Recording test results
ERROR: No tool found matching GRADLE_4_10_2_HOME
Setting GRADLE_4_10_3_HOME=/home/jenkins/tools/gradle/4.10.3
ERROR: No tool found matching GRADLE_4_10_2_HOME
Setting GRADLE_4_10_3_HOME=/home/jenkins/tools/gradle/4.10.3
Not sending mail to unregistered user noreply@github.com

Jenkins build is back to normal : kafka-trunk-jdk11 #1488

Posted by Apache Jenkins Server <je...@builds.apache.org>.
See <https://builds.apache.org/job/kafka-trunk-jdk11/1488/display/redirect?page=changes>


Build failed in Jenkins: kafka-trunk-jdk11 #1487

Posted by Apache Jenkins Server <je...@builds.apache.org>.
See <https://builds.apache.org/job/kafka-trunk-jdk11/1487/display/redirect?page=changes>

Changes:

[github] KAFKA-9780: Deprecate commit records without record metadata (#8379)


------------------------------------------
[...truncated 2.11 MB...]
org.apache.kafka.streams.integration.RegexSourceIntegrationTest > testMultipleConsumersCanReadFromPartitionedTopic STARTED

org.apache.kafka.streams.integration.RegexSourceIntegrationTest > testMultipleConsumersCanReadFromPartitionedTopic PASSED

org.apache.kafka.streams.integration.RegexSourceIntegrationTest > testRegexMatchesTopicsAWhenDeleted STARTED

org.apache.kafka.streams.integration.RegexSourceIntegrationTest > testRegexMatchesTopicsAWhenDeleted PASSED

org.apache.kafka.streams.integration.RegexSourceIntegrationTest > testNoMessagesSentExceptionFromOverlappingPatterns STARTED

org.apache.kafka.streams.integration.RegexSourceIntegrationTest > testNoMessagesSentExceptionFromOverlappingPatterns PASSED

org.apache.kafka.streams.integration.RegexSourceIntegrationTest > shouldAddStateStoreToRegexDefinedSource STARTED

org.apache.kafka.streams.integration.RegexSourceIntegrationTest > shouldAddStateStoreToRegexDefinedSource PASSED

org.apache.kafka.streams.integration.InternalTopicIntegrationTest > shouldCompactTopicsForKeyValueStoreChangelogs STARTED

org.apache.kafka.streams.integration.InternalTopicIntegrationTest > shouldCompactTopicsForKeyValueStoreChangelogs PASSED

org.apache.kafka.streams.integration.InternalTopicIntegrationTest > shouldCompactAndDeleteTopicsForWindowStoreChangelogs STARTED

org.apache.kafka.streams.integration.InternalTopicIntegrationTest > shouldCompactAndDeleteTopicsForWindowStoreChangelogs PASSED

org.apache.kafka.streams.integration.EosBetaUpgradeIntegrationTest > shouldUpgradeFromEosAlphaToEosBeta[false] PASSED

org.apache.kafka.streams.integration.EosBetaUpgradeIntegrationTest > shouldUpgradeFromEosAlphaToEosBeta[true] STARTED

org.apache.kafka.streams.integration.SmokeTestDriverIntegrationTest > shouldWorkWithRebalance STARTED

Exception: java.lang.AssertionError thrown from the UncaughtExceptionHandler in thread "appDir2-StreamThread-1"

Exception: java.lang.AssertionError thrown from the UncaughtExceptionHandler in thread "appDir1-StreamThread-1"

Exception: java.lang.AssertionError thrown from the UncaughtExceptionHandler in thread "appDir2-StreamThread-1"

org.apache.kafka.streams.integration.SmokeTestDriverIntegrationTest > shouldWorkWithRebalance PASSED

org.apache.kafka.streams.integration.StreamStreamJoinIntegrationTest > testInnerRepartitioned[caching enabled = true] STARTED

org.apache.kafka.streams.integration.StreamStreamJoinIntegrationTest > testInnerRepartitioned[caching enabled = true] PASSED

org.apache.kafka.streams.integration.StreamStreamJoinIntegrationTest > testOuterRepartitioned[caching enabled = true] STARTED

org.apache.kafka.streams.integration.StreamStreamJoinIntegrationTest > testOuterRepartitioned[caching enabled = true] PASSED

org.apache.kafka.streams.integration.StreamStreamJoinIntegrationTest > shouldNotAccessJoinStoresWhenGivingName[caching enabled = true] STARTED

org.apache.kafka.streams.integration.StreamStreamJoinIntegrationTest > shouldNotAccessJoinStoresWhenGivingName[caching enabled = true] PASSED

org.apache.kafka.streams.integration.StreamStreamJoinIntegrationTest > testInner[caching enabled = true] STARTED

org.apache.kafka.streams.integration.StreamStreamJoinIntegrationTest > testInner[caching enabled = true] PASSED

org.apache.kafka.streams.integration.StreamStreamJoinIntegrationTest > testOuter[caching enabled = true] STARTED

org.apache.kafka.streams.integration.StreamStreamJoinIntegrationTest > testOuter[caching enabled = true] PASSED

org.apache.kafka.streams.integration.StreamStreamJoinIntegrationTest > testLeft[caching enabled = true] STARTED

org.apache.kafka.streams.integration.StreamStreamJoinIntegrationTest > testLeft[caching enabled = true] PASSED

org.apache.kafka.streams.integration.StreamStreamJoinIntegrationTest > testMultiInner[caching enabled = true] STARTED

org.apache.kafka.streams.integration.StreamStreamJoinIntegrationTest > testMultiInner[caching enabled = true] PASSED

org.apache.kafka.streams.integration.StreamStreamJoinIntegrationTest > testLeftRepartitioned[caching enabled = true] STARTED

org.apache.kafka.streams.integration.StreamStreamJoinIntegrationTest > testLeftRepartitioned[caching enabled = true] PASSED

org.apache.kafka.streams.integration.StreamStreamJoinIntegrationTest > testInnerRepartitioned[caching enabled = false] STARTED

org.apache.kafka.streams.integration.StreamStreamJoinIntegrationTest > testInnerRepartitioned[caching enabled = false] PASSED

org.apache.kafka.streams.integration.StreamStreamJoinIntegrationTest > testOuterRepartitioned[caching enabled = false] STARTED

org.apache.kafka.streams.integration.StreamStreamJoinIntegrationTest > testOuterRepartitioned[caching enabled = false] PASSED

org.apache.kafka.streams.integration.StreamStreamJoinIntegrationTest > shouldNotAccessJoinStoresWhenGivingName[caching enabled = false] STARTED

org.apache.kafka.streams.integration.StreamStreamJoinIntegrationTest > shouldNotAccessJoinStoresWhenGivingName[caching enabled = false] PASSED

org.apache.kafka.streams.integration.StreamStreamJoinIntegrationTest > testInner[caching enabled = false] STARTED
org.apache.kafka.streams.integration.EosBetaUpgradeIntegrationTest.shouldUpgradeFromEosAlphaToEosBeta[true] failed, log available in /home/jenkins/jenkins-slave/workspace/kafka-trunk-jdk11/streams/build/reports/testOutput/org.apache.kafka.streams.integration.EosBetaUpgradeIntegrationTest.shouldUpgradeFromEosAlphaToEosBeta[true].test.stdout

org.apache.kafka.streams.integration.EosBetaUpgradeIntegrationTest > shouldUpgradeFromEosAlphaToEosBeta[true] FAILED
    java.lang.AssertionError: Did not receive all 20 records from topic multiPartitionOutputTopic within 60000 ms
    Expected: is a value equal to or greater than <20>
         but: <0> was less than <20>
        at org.hamcrest.MatcherAssert.assertThat(MatcherAssert.java:20)
        at org.apache.kafka.streams.integration.utils.IntegrationTestUtils.lambda$waitUntilMinKeyValueRecordsReceived$1(IntegrationTestUtils.java:563)
        at org.apache.kafka.test.TestUtils.retryOnExceptionWithTimeout(TestUtils.java:429)
        at org.apache.kafka.test.TestUtils.retryOnExceptionWithTimeout(TestUtils.java:397)
        at org.apache.kafka.streams.integration.utils.IntegrationTestUtils.waitUntilMinKeyValueRecordsReceived(IntegrationTestUtils.java:559)
        at org.apache.kafka.streams.integration.utils.IntegrationTestUtils.waitUntilMinKeyValueRecordsReceived(IntegrationTestUtils.java:530)
        at org.apache.kafka.streams.integration.EosBetaUpgradeIntegrationTest.readResult(EosBetaUpgradeIntegrationTest.java:973)
        at org.apache.kafka.streams.integration.EosBetaUpgradeIntegrationTest.verifyCommitted(EosBetaUpgradeIntegrationTest.java:961)
        at org.apache.kafka.streams.integration.EosBetaUpgradeIntegrationTest.shouldUpgradeFromEosAlphaToEosBeta(EosBetaUpgradeIntegrationTest.java:759)

org.apache.kafka.streams.integration.StreamStreamJoinIntegrationTest > testInner[caching enabled = false] PASSED

org.apache.kafka.streams.integration.StreamStreamJoinIntegrationTest > testOuter[caching enabled = false] STARTED

org.apache.kafka.streams.integration.StreamStreamJoinIntegrationTest > testOuter[caching enabled = false] PASSED

org.apache.kafka.streams.integration.StreamStreamJoinIntegrationTest > testLeft[caching enabled = false] STARTED

org.apache.kafka.streams.integration.StreamStreamJoinIntegrationTest > testLeft[caching enabled = false] PASSED

org.apache.kafka.streams.integration.StreamStreamJoinIntegrationTest > testMultiInner[caching enabled = false] STARTED

org.apache.kafka.streams.integration.KStreamTransformIntegrationTest > shouldFlatTransform STARTED

org.apache.kafka.streams.integration.KStreamTransformIntegrationTest > shouldFlatTransform PASSED

org.apache.kafka.streams.integration.KStreamTransformIntegrationTest > shouldFlatTransformValuesWithValueTransformerWithoutKey STARTED

org.apache.kafka.streams.integration.StreamStreamJoinIntegrationTest > testMultiInner[caching enabled = false] PASSED

org.apache.kafka.streams.integration.StreamStreamJoinIntegrationTest > testLeftRepartitioned[caching enabled = false] STARTED

org.apache.kafka.streams.integration.KStreamTransformIntegrationTest > shouldFlatTransformValuesWithValueTransformerWithoutKey PASSED

org.apache.kafka.streams.integration.KStreamTransformIntegrationTest > shouldFlatTransformValuesWithKey STARTED

org.apache.kafka.streams.integration.KStreamTransformIntegrationTest > shouldFlatTransformValuesWithKey PASSED

org.apache.kafka.streams.integration.KStreamTransformIntegrationTest > shouldTransform STARTED

org.apache.kafka.streams.integration.KStreamTransformIntegrationTest > shouldTransform PASSED

org.apache.kafka.streams.integration.KStreamTransformIntegrationTest > shouldTransformValuesWithValueTransformerWithKey STARTED

org.apache.kafka.streams.integration.StreamStreamJoinIntegrationTest > testLeftRepartitioned[caching enabled = false] PASSED

org.apache.kafka.streams.integration.EOSUncleanShutdownIntegrationTest > shouldWorkWithUncleanShutdownWipeOutStateStore[exactly_once] STARTED

org.apache.kafka.streams.integration.KStreamTransformIntegrationTest > shouldTransformValuesWithValueTransformerWithKey PASSED

org.apache.kafka.streams.integration.KStreamTransformIntegrationTest > shouldTransformValuesWithValueTransformerWithoutKey STARTED

org.apache.kafka.streams.integration.KStreamTransformIntegrationTest > shouldTransformValuesWithValueTransformerWithoutKey PASSED

org.apache.kafka.streams.integration.FineGrainedAutoResetIntegrationTest > shouldOnlyReadRecordsWhereEarliestSpecifiedWithNoCommittedOffsetsWithGlobalAutoOffsetResetLatest STARTED

org.apache.kafka.streams.integration.FineGrainedAutoResetIntegrationTest > shouldOnlyReadRecordsWhereEarliestSpecifiedWithNoCommittedOffsetsWithGlobalAutoOffsetResetLatest PASSED

org.apache.kafka.streams.integration.FineGrainedAutoResetIntegrationTest > shouldThrowExceptionOverlappingPattern STARTED

org.apache.kafka.streams.integration.FineGrainedAutoResetIntegrationTest > shouldThrowExceptionOverlappingPattern PASSED

org.apache.kafka.streams.integration.FineGrainedAutoResetIntegrationTest > shouldThrowExceptionOverlappingTopic STARTED

org.apache.kafka.streams.integration.FineGrainedAutoResetIntegrationTest > shouldThrowExceptionOverlappingTopic PASSED

org.apache.kafka.streams.integration.FineGrainedAutoResetIntegrationTest > shouldOnlyReadRecordsWhereEarliestSpecifiedWithInvalidCommittedOffsets STARTED

org.apache.kafka.streams.integration.EOSUncleanShutdownIntegrationTest > shouldWorkWithUncleanShutdownWipeOutStateStore[exactly_once] PASSED

org.apache.kafka.streams.integration.EOSUncleanShutdownIntegrationTest > shouldWorkWithUncleanShutdownWipeOutStateStore[exactly_once_beta] STARTED

org.apache.kafka.streams.integration.EOSUncleanShutdownIntegrationTest > shouldWorkWithUncleanShutdownWipeOutStateStore[exactly_once_beta] PASSED

org.apache.kafka.streams.integration.FineGrainedAutoResetIntegrationTest > shouldOnlyReadRecordsWhereEarliestSpecifiedWithInvalidCommittedOffsets PASSED

org.apache.kafka.streams.integration.FineGrainedAutoResetIntegrationTest > shouldOnlyReadRecordsWhereEarliestSpecifiedWithNoCommittedOffsetsWithDefaultGlobalAutoOffsetResetEarliest STARTED

org.apache.kafka.streams.integration.GlobalKTableIntegrationTest > shouldGetToRunningWithOnlyGlobalTopology STARTED

org.apache.kafka.streams.integration.GlobalKTableIntegrationTest > shouldGetToRunningWithOnlyGlobalTopology PASSED

org.apache.kafka.streams.integration.GlobalKTableIntegrationTest > shouldKStreamGlobalKTableLeftJoin STARTED

org.apache.kafka.streams.integration.FineGrainedAutoResetIntegrationTest > shouldOnlyReadRecordsWhereEarliestSpecifiedWithNoCommittedOffsetsWithDefaultGlobalAutoOffsetResetEarliest PASSED

org.apache.kafka.streams.integration.FineGrainedAutoResetIntegrationTest > shouldThrowStreamsExceptionNoResetSpecified STARTED

org.apache.kafka.streams.integration.FineGrainedAutoResetIntegrationTest > shouldThrowStreamsExceptionNoResetSpecified PASSED

org.apache.kafka.streams.integration.GlobalKTableIntegrationTest > shouldKStreamGlobalKTableLeftJoin PASSED

org.apache.kafka.streams.integration.GlobalKTableIntegrationTest > shouldRestoreGlobalInMemoryKTableOnRestart STARTED
FATAL: command execution failed
java.io.EOFException
	at java.io.ObjectInputStream$PeekInputStream.readFully(ObjectInputStream.java:2681)
	at java.io.ObjectInputStream$BlockDataInputStream.readShort(ObjectInputStream.java:3156)
	at java.io.ObjectInputStream.readStreamHeader(ObjectInputStream.java:862)
	at java.io.ObjectInputStream.<init>(ObjectInputStream.java:358)
	at hudson.remoting.ObjectInputStreamEx.<init>(ObjectInputStreamEx.java:49)
	at hudson.remoting.Command.readFrom(Command.java:140)
	at hudson.remoting.Command.readFrom(Command.java:126)
	at hudson.remoting.AbstractSynchronousByteArrayCommandTransport.read(AbstractSynchronousByteArrayCommandTransport.java:36)
	at hudson.remoting.SynchronousCommandTransport$ReaderThread.run(SynchronousCommandTransport.java:63)
Caused: java.io.IOException: Unexpected termination of the channel
	at hudson.remoting.SynchronousCommandTransport$ReaderThread.run(SynchronousCommandTransport.java:77)
Caused: java.io.IOException: Backing channel 'H30' is disconnected.
	at hudson.remoting.RemoteInvocationHandler.channelOrFail(RemoteInvocationHandler.java:214)
	at hudson.remoting.RemoteInvocationHandler.invoke(RemoteInvocationHandler.java:283)
	at com.sun.proxy.$Proxy141.isAlive(Unknown Source)
	at hudson.Launcher$RemoteLauncher$ProcImpl.isAlive(Launcher.java:1150)
	at hudson.Launcher$RemoteLauncher$ProcImpl.join(Launcher.java:1142)
	at hudson.tasks.CommandInterpreter.join(CommandInterpreter.java:155)
	at hudson.tasks.CommandInterpreter.perform(CommandInterpreter.java:109)
	at hudson.tasks.CommandInterpreter.perform(CommandInterpreter.java:66)
	at hudson.tasks.BuildStepMonitor$1.perform(BuildStepMonitor.java:20)
	at hudson.model.AbstractBuild$AbstractBuildExecution.perform(AbstractBuild.java:741)
	at hudson.model.Build$BuildExecution.build(Build.java:206)
	at hudson.model.Build$BuildExecution.doRun(Build.java:163)
	at hudson.model.AbstractBuild$AbstractBuildExecution.run(AbstractBuild.java:504)
	at hudson.model.Run.execute(Run.java:1815)
	at hudson.model.FreeStyleBuild.run(FreeStyleBuild.java:43)
	at hudson.model.ResourceController.execute(ResourceController.java:97)
	at hudson.model.Executor.run(Executor.java:429)
FATAL: Unable to delete script file /tmp/jenkins6711273375852689163.sh
java.io.EOFException
	at java.io.ObjectInputStream$PeekInputStream.readFully(ObjectInputStream.java:2681)
	at java.io.ObjectInputStream$BlockDataInputStream.readShort(ObjectInputStream.java:3156)
	at java.io.ObjectInputStream.readStreamHeader(ObjectInputStream.java:862)
	at java.io.ObjectInputStream.<init>(ObjectInputStream.java:358)
	at hudson.remoting.ObjectInputStreamEx.<init>(ObjectInputStreamEx.java:49)
	at hudson.remoting.Command.readFrom(Command.java:140)
	at hudson.remoting.Command.readFrom(Command.java:126)
	at hudson.remoting.AbstractSynchronousByteArrayCommandTransport.read(AbstractSynchronousByteArrayCommandTransport.java:36)
	at hudson.remoting.SynchronousCommandTransport$ReaderThread.run(SynchronousCommandTransport.java:63)
Caused: java.io.IOException: Unexpected termination of the channel
	at hudson.remoting.SynchronousCommandTransport$ReaderThread.run(SynchronousCommandTransport.java:77)
Caused: hudson.remoting.ChannelClosedException: Channel "unknown": Remote call on H30 failed. The channel is closing down or has closed down
	at hudson.remoting.Channel.call(Channel.java:950)
	at hudson.FilePath.act(FilePath.java:1072)
	at hudson.FilePath.act(FilePath.java:1061)
	at hudson.FilePath.delete(FilePath.java:1542)
	at hudson.tasks.CommandInterpreter.perform(CommandInterpreter.java:123)
	at hudson.tasks.CommandInterpreter.perform(CommandInterpreter.java:66)
	at hudson.tasks.BuildStepMonitor$1.perform(BuildStepMonitor.java:20)
	at hudson.model.AbstractBuild$AbstractBuildExecution.perform(AbstractBuild.java:741)
	at hudson.model.Build$BuildExecution.build(Build.java:206)
	at hudson.model.Build$BuildExecution.doRun(Build.java:163)
	at hudson.model.AbstractBuild$AbstractBuildExecution.run(AbstractBuild.java:504)
	at hudson.model.Run.execute(Run.java:1815)
	at hudson.model.FreeStyleBuild.run(FreeStyleBuild.java:43)
	at hudson.model.ResourceController.execute(ResourceController.java:97)
	at hudson.model.Executor.run(Executor.java:429)
Build step 'Execute shell' marked build as failure
ERROR: Step ?Publish JUnit test result report? failed: no workspace for kafka-trunk-jdk11 #1487
ERROR: H30 is offline; cannot locate JDK 11 (latest)
ERROR: No tool found matching GRADLE_4_10_2_HOME
ERROR: H30 is offline; cannot locate Gradle 4.10.3
Setting GRADLE_4_10_3_HOME=/home/jenkins/tools/gradle/4.10.3
Not sending mail to unregistered user noreply@github.com