You are viewing a plain text version of this content. The canonical link for it is here.
Posted to dev@clerezza.apache.org by Apache Hudson Server <hu...@hudson.zones.apache.org> on 2010/02/10 22:06:53 UTC

Build failed in Hudson: clerezza-trunk-1.6 » Clerezza Ext - Jena TDB OSGi Bundle #94

See <http://hudson.zones.apache.org/hudson/job/clerezza-trunk-1.6/org.apache.clerezza.ext$com.hp.hpl.jena.tdb/94/>

------------------------------------------
[INFO] ------------------------------------------------------------------------
[INFO] Building Clerezza Ext - Jena TDB OSGi Bundle
[INFO]    task-segment: [clean, install]
[INFO] ------------------------------------------------------------------------
[INFO] [clean:clean]
[INFO] Deleting file set: <http://hudson.zones.apache.org/hudson/job/clerezza-trunk-1.6/org.apache.clerezza.ext$com.hp.hpl.jena.tdb/ws/target> (included: [**], excluded: [])
[INFO] [resources:resources]
[INFO] Using 'utf-8' encoding to copy filtered resources.
[INFO] Copying 0 resource to META-INF
[INFO] skip non existing resourceDirectory <http://hudson.zones.apache.org/hudson/job/clerezza-trunk-1.6/org.apache.clerezza.ext$com.hp.hpl.jena.tdb/ws/src/main/resources>
Downloading: http://repository.ops4j.org/mvn-snapshots//javax/jms/jms/1.1/jms-1.1.pom
Downloading: http://repository.apache.org/content/groups/snapshots-group/javax/jms/jms/1.1/jms-1.1.pom
Downloading: http://repo1.maven.org/maven2/javax/jms/jms/1.1/jms-1.1.pom
[WARNING] POM for 'com.sun.jdmk:jmxtools:pom:1.2.1:compile' is invalid. It will be ignored for artifact resolution. Reason: Not a v4.0.0 POM. for project com.sun.jdmk:jmxtools at /home/hudson/.m2/repository/com/sun/jdmk/jmxtools/1.2.1/jmxtools-1.2.1.pom
Downloading: http://repository.ops4j.org/mvn-snapshots//com/sun/jmx/jmxri/1.2.1/jmxri-1.2.1.pom
Downloading: http://repository.apache.org/content/groups/snapshots-group/com/sun/jmx/jmxri/1.2.1/jmxri-1.2.1.pom
Downloading: http://repo1.maven.org/maven2/com/sun/jmx/jmxri/1.2.1/jmxri-1.2.1.pom
Downloading: http://repository.ops4j.org/mvn-snapshots//javax/jms/jms/1.1/jms-1.1.jar
Downloading: http://repository.apache.org/content/groups/snapshots-group/javax/jms/jms/1.1/jms-1.1.jar
Downloading: https://maven-repository.dev.java.net/nonav/repository/javax.jms/jars/jms-1.1.jar
347b downloaded
[WARNING] *** CHECKSUM FAILED - Checksum failed on download: local = 'd0b7ce08d257e8fefdc6ad0f0f0368635bbeb3d0'; remote = '<!DOCTYPE' - RETRYING
Downloading: https://maven-repository.dev.java.net/nonav/repository/javax.jms/jars/jms-1.1.jar
347b downloaded
[WARNING] *** CHECKSUM FAILED - Checksum failed on download: local = 'd0b7ce08d257e8fefdc6ad0f0f0368635bbeb3d0'; remote = '<!DOCTYPE' - IGNORING
Downloading: http://repository.ops4j.org/mvn-snapshots//com/sun/jmx/jmxri/1.2.1/jmxri-1.2.1.jar
Downloading: http://repository.apache.org/content/groups/snapshots-group/com/sun/jmx/jmxri/1.2.1/jmxri-1.2.1.jar
Downloading: https://maven-repository.dev.java.net/nonav/repository/com.sun.jmx/jars/jmxri-1.2.1.jar
353b downloaded
[WARNING] *** CHECKSUM FAILED - Checksum failed on download: local = 'a55ce8e95c9bb027e78557acc9e2b973fe3c611e'; remote = '<!DOCTYPE' - RETRYING
Downloading: https://maven-repository.dev.java.net/nonav/repository/com.sun.jmx/jars/jmxri-1.2.1.jar
353b downloaded
[WARNING] *** CHECKSUM FAILED - Checksum failed on download: local = 'a55ce8e95c9bb027e78557acc9e2b973fe3c611e'; remote = '<!DOCTYPE' - IGNORING
[INFO] [compiler:compile]
[INFO] No sources to compile
[WARNING] POM for 'com.sun.jdmk:jmxtools:pom:1.2.1:compile' is invalid. It will be ignored for artifact resolution. Reason: Not a v4.0.0 POM. for project com.sun.jdmk:jmxtools at /home/hudson/.m2/repository/com/sun/jdmk/jmxtools/1.2.1/jmxtools-1.2.1.pom
[INFO] [scr:scr {execution: generate-scr-scrdescriptor}]
[INFO] [resources:testResources]
[INFO] Using 'utf-8' encoding to copy filtered resources.
[INFO] skip non existing resourceDirectory <http://hudson.zones.apache.org/hudson/job/clerezza-trunk-1.6/org.apache.clerezza.ext$com.hp.hpl.jena.tdb/ws/src/test/resources>
[WARNING] POM for 'com.sun.jdmk:jmxtools:pom:1.2.1:compile' is invalid. It will be ignored for artifact resolution. Reason: Not a v4.0.0 POM. for project com.sun.jdmk:jmxtools at /home/hudson/.m2/repository/com/sun/jdmk/jmxtools/1.2.1/jmxtools-1.2.1.pom
[INFO] [compiler:testCompile]
[INFO] No sources to compile
[WARNING] POM for 'com.sun.jdmk:jmxtools:pom:1.2.1:compile' is invalid. It will be ignored for artifact resolution. Reason: Not a v4.0.0 POM. for project com.sun.jdmk:jmxtools at /home/hudson/.m2/repository/com/sun/jdmk/jmxtools/1.2.1/jmxtools-1.2.1.pom
[INFO] [surefire:test]
[INFO] No tests to run.
[WARNING] POM for 'com.sun.jdmk:jmxtools:pom:1.2.1:compile' is invalid. It will be ignored for artifact resolution. Reason: Not a v4.0.0 POM. for project com.sun.jdmk:jmxtools at /home/hudson/.m2/repository/com/sun/jdmk/jmxtools/1.2.1/jmxtools-1.2.1.pom
[HUDSON] Recording test results[INFO] [bundle:bundle]

[HUDSON] Archiving <http://hudson.zones.apache.org/hudson/job/clerezza-trunk-1.6/org.apache.clerezza.ext$com.hp.hpl.jena.tdb/ws/pom.xml> to /export/home/hudson/hudson/jobs/clerezza-trunk-1.6/modules/org.apache.clerezza.ext$com.hp.hpl.jena.tdb/builds/2010-02-10_21-03-19/archive/org.apache.clerezza.ext/com.hp.hpl.jena.tdb/0.3-incubating-SNAPSHOT/pom.xml
[INFO] ------------------------------------------------------------------------
[ERROR] BUILD ERROR
[INFO] ------------------------------------------------------------------------
[INFO] Error calculating classpath for project MavenProject: org.apache.clerezza.ext:com.hp.hpl.jena.tdb:0.3-incubating-SNAPSHOT @ <http://hudson.zones.apache.org/hudson/job/clerezza-trunk-1.6/org.apache.clerezza.ext$com.hp.hpl.jena.tdb/ws/pom.xml>

Embedded error: error in opening zip file
[INFO] ------------------------------------------------------------------------
[INFO] For more information, run Maven with the -e switch
[INFO] ------------------------------------------------------------------------
[INFO] Total time: 3 minutes 6 seconds
[INFO] Finished at: Wed Feb 10 21:06:43 UTC 2010
[INFO] Final Memory: 83M/212M
[INFO] ------------------------------------------------------------------------
Waiting for Hudson to finish collecting data


Hudson build is back to normal : clerezza-trunk-1.6 » Clerezza Ext - Jena TDB OSGi Bundle #96

Posted by Apache Hudson Server <hu...@hudson.zones.apache.org>.
See <http://hudson.zones.apache.org/hudson/job/clerezza-trunk-1.6/org.apache.clerezza.ext$com.hp.hpl.jena.tdb/96/>



Build failed in Hudson: clerezza-trunk-1.6 » Clerezza Ext - Jena TDB OSGi Bundle #95

Posted by Apache Hudson Server <hu...@hudson.zones.apache.org>.
See <http://hudson.zones.apache.org/hudson/job/clerezza-trunk-1.6/org.apache.clerezza.ext$com.hp.hpl.jena.tdb/95/>

------------------------------------------
[INFO] ------------------------------------------------------------------------
[INFO] Building Clerezza Ext - Jena TDB OSGi Bundle
[INFO]    task-segment: [clean, install]
[INFO] ------------------------------------------------------------------------
[INFO] [clean:clean]
[INFO] Deleting file set: <http://hudson.zones.apache.org/hudson/job/clerezza-trunk-1.6/org.apache.clerezza.ext$com.hp.hpl.jena.tdb/ws/target> (included: [**], excluded: [])
[INFO] [resources:resources]
[INFO] Using 'utf-8' encoding to copy filtered resources.
[INFO] Copying 0 resource to META-INF
[INFO] skip non existing resourceDirectory <http://hudson.zones.apache.org/hudson/job/clerezza-trunk-1.6/org.apache.clerezza.ext$com.hp.hpl.jena.tdb/ws/src/main/resources>
[WARNING] POM for 'com.sun.jdmk:jmxtools:pom:1.2.1:compile' is invalid. It will be ignored for artifact resolution. Reason: Not a v4.0.0 POM. for project com.sun.jdmk:jmxtools at /home/hudson/.m2/repository/com/sun/jdmk/jmxtools/1.2.1/jmxtools-1.2.1.pom
[INFO] [compiler:compile]
[INFO] No sources to compile
[WARNING] POM for 'com.sun.jdmk:jmxtools:pom:1.2.1:compile' is invalid. It will be ignored for artifact resolution. Reason: Not a v4.0.0 POM. for project com.sun.jdmk:jmxtools at /home/hudson/.m2/repository/com/sun/jdmk/jmxtools/1.2.1/jmxtools-1.2.1.pom
[INFO] [scr:scr {execution: generate-scr-scrdescriptor}]
[INFO] [resources:testResources]
[INFO] Using 'utf-8' encoding to copy filtered resources.
[INFO] skip non existing resourceDirectory <http://hudson.zones.apache.org/hudson/job/clerezza-trunk-1.6/org.apache.clerezza.ext$com.hp.hpl.jena.tdb/ws/src/test/resources>
[WARNING] POM for 'com.sun.jdmk:jmxtools:pom:1.2.1:compile' is invalid. It will be ignored for artifact resolution. Reason: Not a v4.0.0 POM. for project com.sun.jdmk:jmxtools at /home/hudson/.m2/repository/com/sun/jdmk/jmxtools/1.2.1/jmxtools-1.2.1.pom
[INFO] [compiler:testCompile]
[INFO] No sources to compile
[WARNING] POM for 'com.sun.jdmk:jmxtools:pom:1.2.1:compile' is invalid. It will be ignored for artifact resolution. Reason: Not a v4.0.0 POM. for project com.sun.jdmk:jmxtools at /home/hudson/.m2/repository/com/sun/jdmk/jmxtools/1.2.1/jmxtools-1.2.1.pom
[INFO] [surefire:test]
[INFO] No tests to run.
[HUDSON] Recording test results[WARNING] POM for 'com.sun.jdmk:jmxtools:pom:1.2.1:compile' is invalid. It will be ignored for artifact resolution. Reason: Not a v4.0.0 POM. for project com.sun.jdmk:jmxtools at /home/hudson/.m2/repository/com/sun/jdmk/jmxtools/1.2.1/jmxtools-1.2.1.pom
[INFO] [bundle:bundle]

[HUDSON] Archiving <http://hudson.zones.apache.org/hudson/job/clerezza-trunk-1.6/org.apache.clerezza.ext$com.hp.hpl.jena.tdb/ws/pom.xml> to /export/home/hudson/hudson/jobs/clerezza-trunk-1.6/modules/org.apache.clerezza.ext$com.hp.hpl.jena.tdb/builds/2010-02-10_23-09-25/archive/org.apache.clerezza.ext/com.hp.hpl.jena.tdb/0.3-incubating-SNAPSHOT/pom.xml
[INFO] ------------------------------------------------------------------------
[ERROR] BUILD ERROR
[INFO] ------------------------------------------------------------------------
[INFO] Error calculating classpath for project MavenProject: org.apache.clerezza.ext:com.hp.hpl.jena.tdb:0.3-incubating-SNAPSHOT @ <http://hudson.zones.apache.org/hudson/job/clerezza-trunk-1.6/org.apache.clerezza.ext$com.hp.hpl.jena.tdb/ws/pom.xml>

Embedded error: error in opening zip file
[INFO] ------------------------------------------------------------------------
[INFO] For more information, run Maven with the -e switch
[INFO] ------------------------------------------------------------------------
[INFO] Total time: 3 minutes 3 seconds
[INFO] Finished at: Wed Feb 10 23:12:45 UTC 2010
[INFO] Final Memory: 84M/244M
[INFO] ------------------------------------------------------------------------
Waiting for Hudson to finish collecting data