You are viewing a plain text version of this content. The canonical link for it is here.
Posted to yarn-dev@hadoop.apache.org by Apache Jenkins Server <je...@builds.apache.org> on 2016/02/25 03:25:23 UTC

Build failed in Jenkins: Hadoop-Yarn-trunk #1816

See <https://builds.apache.org/job/Hadoop-Yarn-trunk/1816/changes>

Changes:

[jing9] HDFS-9837. BlockManager#countNodes should be able to detect duplicated

[cnauroth] HDFS-9843. Document distcp options required for copying between

------------------------------------------
[...truncated 9135 lines...]
Tests run: 8, Failures: 0, Errors: 0, Skipped: 0, Time elapsed: 4.599 sec - in org.apache.hadoop.yarn.server.resourcemanager.reservation.TestCapacityOverTimePolicy
Running org.apache.hadoop.yarn.server.resourcemanager.reservation.TestNoOverCommitPolicy
Tests run: 6, Failures: 0, Errors: 0, Skipped: 0, Time elapsed: 1.906 sec - in org.apache.hadoop.yarn.server.resourcemanager.reservation.TestNoOverCommitPolicy
Running org.apache.hadoop.yarn.server.resourcemanager.reservation.TestRLESparseResourceAllocation
Tests run: 12, Failures: 0, Errors: 0, Skipped: 1, Time elapsed: 0.622 sec - in org.apache.hadoop.yarn.server.resourcemanager.reservation.TestRLESparseResourceAllocation
Running org.apache.hadoop.yarn.server.resourcemanager.reservation.TestReservationSystem
Tests run: 4, Failures: 0, Errors: 0, Skipped: 0, Time elapsed: 3.203 sec - in org.apache.hadoop.yarn.server.resourcemanager.reservation.TestReservationSystem
Running org.apache.hadoop.yarn.server.resourcemanager.reservation.TestReservationInputValidator
Tests run: 28, Failures: 0, Errors: 0, Skipped: 0, Time elapsed: 1.112 sec - in org.apache.hadoop.yarn.server.resourcemanager.reservation.TestReservationInputValidator
Running org.apache.hadoop.yarn.server.resourcemanager.reservation.TestInMemoryPlan
Tests run: 14, Failures: 0, Errors: 0, Skipped: 0, Time elapsed: 1.074 sec - in org.apache.hadoop.yarn.server.resourcemanager.reservation.TestInMemoryPlan
Running org.apache.hadoop.yarn.server.resourcemanager.reservation.TestInMemoryReservationAllocation
Tests run: 5, Failures: 0, Errors: 0, Skipped: 0, Time elapsed: 0.682 sec - in org.apache.hadoop.yarn.server.resourcemanager.reservation.TestInMemoryReservationAllocation
Running org.apache.hadoop.yarn.server.resourcemanager.reservation.TestFairSchedulerPlanFollower
Tests run: 2, Failures: 0, Errors: 0, Skipped: 0, Time elapsed: 2.533 sec - in org.apache.hadoop.yarn.server.resourcemanager.reservation.TestFairSchedulerPlanFollower
Running org.apache.hadoop.yarn.server.resourcemanager.reservation.TestCapacitySchedulerPlanFollower
Tests run: 2, Failures: 0, Errors: 0, Skipped: 0, Time elapsed: 2.938 sec - in org.apache.hadoop.yarn.server.resourcemanager.reservation.TestCapacitySchedulerPlanFollower
Running org.apache.hadoop.yarn.server.resourcemanager.TestLeaderElectorService
Tests run: 6, Failures: 0, Errors: 0, Skipped: 0, Time elapsed: 37.226 sec - in org.apache.hadoop.yarn.server.resourcemanager.TestLeaderElectorService
Running org.apache.hadoop.yarn.server.resourcemanager.TestSignalContainer
Tests run: 1, Failures: 0, Errors: 0, Skipped: 0, Time elapsed: 9.337 sec - in org.apache.hadoop.yarn.server.resourcemanager.TestSignalContainer
Running org.apache.hadoop.yarn.server.resourcemanager.TestClientRMTokens
Tests run: 6, Failures: 0, Errors: 0, Skipped: 0, Time elapsed: 18.358 sec - in org.apache.hadoop.yarn.server.resourcemanager.TestClientRMTokens
Running org.apache.hadoop.yarn.server.resourcemanager.TestRMAdminService
Tests run: 22, Failures: 0, Errors: 0, Skipped: 0, Time elapsed: 17.049 sec - in org.apache.hadoop.yarn.server.resourcemanager.TestRMAdminService
Running org.apache.hadoop.yarn.server.resourcemanager.TestReservationSystemWithRMHA
Tests run: 8, Failures: 0, Errors: 0, Skipped: 0, Time elapsed: 13.124 sec - in org.apache.hadoop.yarn.server.resourcemanager.TestReservationSystemWithRMHA
Running org.apache.hadoop.yarn.server.resourcemanager.TestRMHAForNodeLabels
Tests run: 1, Failures: 0, Errors: 0, Skipped: 0, Time elapsed: 3.52 sec - in org.apache.hadoop.yarn.server.resourcemanager.TestRMHAForNodeLabels
Running org.apache.hadoop.yarn.server.resourcemanager.TestResourceManager
Tests run: 5, Failures: 0, Errors: 0, Skipped: 0, Time elapsed: 5.021 sec - in org.apache.hadoop.yarn.server.resourcemanager.TestResourceManager
Running org.apache.hadoop.yarn.server.resourcemanager.TestRMRestart
Tests run: 56, Failures: 0, Errors: 0, Skipped: 0, Time elapsed: 455.973 sec - in org.apache.hadoop.yarn.server.resourcemanager.TestRMRestart
Running org.apache.hadoop.yarn.server.resourcemanager.security.TestAMRMTokens
Tests run: 6, Failures: 0, Errors: 0, Skipped: 0, Time elapsed: 59.243 sec - in org.apache.hadoop.yarn.server.resourcemanager.security.TestAMRMTokens
Running org.apache.hadoop.yarn.server.resourcemanager.security.TestDelegationTokenRenewerLifecycle
Tests run: 1, Failures: 0, Errors: 0, Skipped: 0, Time elapsed: 0.862 sec - in org.apache.hadoop.yarn.server.resourcemanager.security.TestDelegationTokenRenewerLifecycle
Running org.apache.hadoop.yarn.server.resourcemanager.security.TestRMDelegationTokens
Tests run: 2, Failures: 0, Errors: 0, Skipped: 0, Time elapsed: 6.593 sec - in org.apache.hadoop.yarn.server.resourcemanager.security.TestRMDelegationTokens
Running org.apache.hadoop.yarn.server.resourcemanager.security.TestClientToAMTokens
Tests run: 4, Failures: 0, Errors: 0, Skipped: 0, Time elapsed: 14.574 sec - in org.apache.hadoop.yarn.server.resourcemanager.security.TestClientToAMTokens
Running org.apache.hadoop.yarn.server.resourcemanager.security.TestDelegationTokenRenewer
Tests run: 14, Failures: 0, Errors: 0, Skipped: 0, Time elapsed: 89.047 sec - in org.apache.hadoop.yarn.server.resourcemanager.security.TestDelegationTokenRenewer
Running org.apache.hadoop.yarn.server.resourcemanager.TestRM
Tests run: 22, Failures: 0, Errors: 0, Skipped: 0, Time elapsed: 187.505 sec - in org.apache.hadoop.yarn.server.resourcemanager.TestRM
Running org.apache.hadoop.yarn.server.resourcemanager.blacklist.TestBlacklistManager
Tests run: 3, Failures: 0, Errors: 0, Skipped: 0, Time elapsed: 0.239 sec - in org.apache.hadoop.yarn.server.resourcemanager.blacklist.TestBlacklistManager
Running org.apache.hadoop.yarn.server.resourcemanager.TestContainerResourceUsage
Tests run: 4, Failures: 0, Errors: 0, Skipped: 0, Time elapsed: 44.498 sec - in org.apache.hadoop.yarn.server.resourcemanager.TestContainerResourceUsage
Running org.apache.hadoop.yarn.server.resourcemanager.TestKillApplicationWithRMHA
Tests run: 4, Failures: 0, Errors: 0, Skipped: 0, Time elapsed: 25.73 sec - in org.apache.hadoop.yarn.server.resourcemanager.TestKillApplicationWithRMHA
Running org.apache.hadoop.yarn.server.resourcemanager.TestAppManager
Tests run: 15, Failures: 0, Errors: 0, Skipped: 0, Time elapsed: 6.221 sec - in org.apache.hadoop.yarn.server.resourcemanager.TestAppManager
Running org.apache.hadoop.yarn.server.resourcemanager.TestRMHA
Tests run: 9, Failures: 0, Errors: 0, Skipped: 0, Time elapsed: 39.202 sec - in org.apache.hadoop.yarn.server.resourcemanager.TestRMHA
Running org.apache.hadoop.yarn.server.resourcemanager.TestRMDispatcher
Tests run: 1, Failures: 0, Errors: 0, Skipped: 0, Time elapsed: 1.993 sec - in org.apache.hadoop.yarn.server.resourcemanager.TestRMDispatcher
Running org.apache.hadoop.yarn.server.resourcemanager.scheduler.fair.TestSchedulingUpdate
Tests run: 1, Failures: 0, Errors: 0, Skipped: 0, Time elapsed: 2.112 sec - in org.apache.hadoop.yarn.server.resourcemanager.scheduler.fair.TestSchedulingUpdate
Running org.apache.hadoop.yarn.server.resourcemanager.scheduler.fair.TestContinuousScheduling
Tests run: 1, Failures: 0, Errors: 0, Skipped: 0, Time elapsed: 2.438 sec - in org.apache.hadoop.yarn.server.resourcemanager.scheduler.fair.TestContinuousScheduling
Running org.apache.hadoop.yarn.server.resourcemanager.scheduler.fair.policies.TestDominantResourceFairnessPolicy
Tests run: 9, Failures: 0, Errors: 0, Skipped: 0, Time elapsed: 0.619 sec - in org.apache.hadoop.yarn.server.resourcemanager.scheduler.fair.policies.TestDominantResourceFairnessPolicy
Running org.apache.hadoop.yarn.server.resourcemanager.scheduler.fair.policies.TestEmptyQueues
Tests run: 3, Failures: 0, Errors: 0, Skipped: 0, Time elapsed: 0.627 sec - in org.apache.hadoop.yarn.server.resourcemanager.scheduler.fair.policies.TestEmptyQueues
Running org.apache.hadoop.yarn.server.resourcemanager.scheduler.fair.TestAppRunnability
Tests run: 8, Failures: 0, Errors: 0, Skipped: 0, Time elapsed: 4.042 sec - in org.apache.hadoop.yarn.server.resourcemanager.scheduler.fair.TestAppRunnability
Running org.apache.hadoop.yarn.server.resourcemanager.scheduler.fair.TestFairScheduler
Tests run: 84, Failures: 1, Errors: 0, Skipped: 0, Time elapsed: 17.398 sec <<< FAILURE! - in org.apache.hadoop.yarn.server.resourcemanager.scheduler.fair.TestFairScheduler
testContinuousScheduling(org.apache.hadoop.yarn.server.resourcemanager.scheduler.fair.TestFairScheduler)  Time elapsed: 1.629 sec  <<< FAILURE!
java.lang.AssertionError: expected:<2> but was:<1>
	at org.junit.Assert.fail(Assert.java:88)
	at org.junit.Assert.failNotEquals(Assert.java:743)
	at org.junit.Assert.assertEquals(Assert.java:118)
	at org.junit.Assert.assertEquals(Assert.java:555)
	at org.junit.Assert.assertEquals(Assert.java:542)
	at org.apache.hadoop.yarn.server.resourcemanager.scheduler.fair.TestFairScheduler.testContinuousScheduling(TestFairScheduler.java:3816)

Running org.apache.hadoop.yarn.server.resourcemanager.scheduler.fair.TestAllocationFileLoaderService
Tests run: 10, Failures: 0, Errors: 0, Skipped: 0, Time elapsed: 1.146 sec - in org.apache.hadoop.yarn.server.resourcemanager.scheduler.fair.TestAllocationFileLoaderService
Running org.apache.hadoop.yarn.server.resourcemanager.scheduler.fair.TestMaxRunningAppsEnforcer
Tests run: 6, Failures: 0, Errors: 0, Skipped: 0, Time elapsed: 1.928 sec - in org.apache.hadoop.yarn.server.resourcemanager.scheduler.fair.TestMaxRunningAppsEnforcer
Running org.apache.hadoop.yarn.server.resourcemanager.scheduler.fair.TestFairSchedulerQueueACLs
Tests run: 1, Failures: 0, Errors: 0, Skipped: 0, Time elapsed: 17.217 sec - in org.apache.hadoop.yarn.server.resourcemanager.scheduler.fair.TestFairSchedulerQueueACLs
Running org.apache.hadoop.yarn.server.resourcemanager.scheduler.fair.TestQueuePlacementPolicy
Tests run: 17, Failures: 0, Errors: 0, Skipped: 0, Time elapsed: 0.809 sec - in org.apache.hadoop.yarn.server.resourcemanager.scheduler.fair.TestQueuePlacementPolicy
Running org.apache.hadoop.yarn.server.resourcemanager.scheduler.fair.TestFairSchedulerConfiguration
Tests run: 5, Failures: 0, Errors: 0, Skipped: 0, Time elapsed: 0.632 sec - in org.apache.hadoop.yarn.server.resourcemanager.scheduler.fair.TestFairSchedulerConfiguration
Running org.apache.hadoop.yarn.server.resourcemanager.scheduler.fair.TestFairSchedulerFairShare
Tests run: 6, Failures: 0, Errors: 0, Skipped: 0, Time elapsed: 4.655 sec - in org.apache.hadoop.yarn.server.resourcemanager.scheduler.fair.TestFairSchedulerFairShare
Running org.apache.hadoop.yarn.server.resourcemanager.scheduler.fair.TestSchedulingPolicy
Tests run: 2, Failures: 0, Errors: 0, Skipped: 0, Time elapsed: 0.847 sec - in org.apache.hadoop.yarn.server.resourcemanager.scheduler.fair.TestSchedulingPolicy
Running org.apache.hadoop.yarn.server.resourcemanager.scheduler.fair.TestFSAppAttempt
Tests run: 5, Failures: 0, Errors: 0, Skipped: 0, Time elapsed: 3.219 sec - in org.apache.hadoop.yarn.server.resourcemanager.scheduler.fair.TestFSAppAttempt
Running org.apache.hadoop.yarn.server.resourcemanager.scheduler.fair.TestQueueManager
Tests run: 3, Failures: 0, Errors: 0, Skipped: 0, Time elapsed: 1.423 sec - in org.apache.hadoop.yarn.server.resourcemanager.scheduler.fair.TestQueueManager
Running org.apache.hadoop.yarn.server.resourcemanager.scheduler.fair.TestFSLeafQueue
Tests run: 5, Failures: 0, Errors: 0, Skipped: 0, Time elapsed: 3.858 sec - in org.apache.hadoop.yarn.server.resourcemanager.scheduler.fair.TestFSLeafQueue
Running org.apache.hadoop.yarn.server.resourcemanager.scheduler.fair.TestFairSchedulerPreemption
Tests run: 10, Failures: 0, Errors: 0, Skipped: 0, Time elapsed: 6.36 sec - in org.apache.hadoop.yarn.server.resourcemanager.scheduler.fair.TestFairSchedulerPreemption
Running org.apache.hadoop.yarn.server.resourcemanager.scheduler.fair.TestFSParentQueue
Tests run: 1, Failures: 0, Errors: 0, Skipped: 0, Time elapsed: 1.183 sec - in org.apache.hadoop.yarn.server.resourcemanager.scheduler.fair.TestFSParentQueue
Running org.apache.hadoop.yarn.server.resourcemanager.scheduler.fair.TestFairSchedulerEventLog
Tests run: 1, Failures: 0, Errors: 0, Skipped: 0, Time elapsed: 1.964 sec - in org.apache.hadoop.yarn.server.resourcemanager.scheduler.fair.TestFairSchedulerEventLog
Running org.apache.hadoop.yarn.server.resourcemanager.scheduler.fair.TestComputeFairShares
Tests run: 9, Failures: 0, Errors: 0, Skipped: 0, Time elapsed: 0.562 sec - in org.apache.hadoop.yarn.server.resourcemanager.scheduler.fair.TestComputeFairShares
Running org.apache.hadoop.yarn.server.resourcemanager.scheduler.TestSchedulerHealth
Tests run: 5, Failures: 0, Errors: 0, Skipped: 0, Time elapsed: 2.8 sec - in org.apache.hadoop.yarn.server.resourcemanager.scheduler.TestSchedulerHealth
Running org.apache.hadoop.yarn.server.resourcemanager.scheduler.fifo.TestFifoScheduler
Tests run: 17, Failures: 0, Errors: 0, Skipped: 0, Time elapsed: 30.711 sec - in org.apache.hadoop.yarn.server.resourcemanager.scheduler.fifo.TestFifoScheduler
Running org.apache.hadoop.yarn.server.resourcemanager.scheduler.TestSchedulerApplicationAttempt
Tests run: 4, Failures: 0, Errors: 0, Skipped: 0, Time elapsed: 1.305 sec - in org.apache.hadoop.yarn.server.resourcemanager.scheduler.TestSchedulerApplicationAttempt
Running org.apache.hadoop.yarn.server.resourcemanager.scheduler.TestAppSchedulingInfo
Tests run: 1, Failures: 0, Errors: 0, Skipped: 0, Time elapsed: 0.722 sec - in org.apache.hadoop.yarn.server.resourcemanager.scheduler.TestAppSchedulingInfo
Running org.apache.hadoop.yarn.server.resourcemanager.scheduler.TestResourceUsage
Tests run: 7, Failures: 0, Errors: 0, Skipped: 0, Time elapsed: 0.541 sec - in org.apache.hadoop.yarn.server.resourcemanager.scheduler.TestResourceUsage
Running org.apache.hadoop.yarn.server.resourcemanager.scheduler.policy.TestFairOrderingPolicy
Tests run: 4, Failures: 0, Errors: 0, Skipped: 0, Time elapsed: 8.456 sec - in org.apache.hadoop.yarn.server.resourcemanager.scheduler.policy.TestFairOrderingPolicy
Running org.apache.hadoop.yarn.server.resourcemanager.scheduler.policy.TestFifoOrderingPolicy
Tests run: 3, Failures: 0, Errors: 0, Skipped: 0, Time elapsed: 0.532 sec - in org.apache.hadoop.yarn.server.resourcemanager.scheduler.policy.TestFifoOrderingPolicy
Running org.apache.hadoop.yarn.server.resourcemanager.scheduler.policy.TestFifoOrderingPolicyForPendingApps
Tests run: 2, Failures: 0, Errors: 0, Skipped: 0, Time elapsed: 0.549 sec - in org.apache.hadoop.yarn.server.resourcemanager.scheduler.policy.TestFifoOrderingPolicyForPendingApps
Running org.apache.hadoop.yarn.server.resourcemanager.scheduler.capacity.TestCapacitySchedulerDynamicBehavior
Tests run: 4, Failures: 0, Errors: 0, Skipped: 0, Time elapsed: 6.834 sec - in org.apache.hadoop.yarn.server.resourcemanager.scheduler.capacity.TestCapacitySchedulerDynamicBehavior
Running org.apache.hadoop.yarn.server.resourcemanager.scheduler.capacity.TestApplicationLimits
Tests run: 5, Failures: 0, Errors: 0, Skipped: 0, Time elapsed: 3.655 sec - in org.apache.hadoop.yarn.server.resourcemanager.scheduler.capacity.TestApplicationLimits
Running org.apache.hadoop.yarn.server.resourcemanager.scheduler.capacity.TestReservationQueue
Tests run: 1, Failures: 0, Errors: 0, Skipped: 0, Time elapsed: 1.869 sec - in org.apache.hadoop.yarn.server.resourcemanager.scheduler.capacity.TestReservationQueue
Running org.apache.hadoop.yarn.server.resourcemanager.scheduler.capacity.TestQueueParsing
Tests run: 17, Failures: 0, Errors: 0, Skipped: 0, Time elapsed: 4.633 sec - in org.apache.hadoop.yarn.server.resourcemanager.scheduler.capacity.TestQueueParsing
Running org.apache.hadoop.yarn.server.resourcemanager.scheduler.capacity.TestContainerResizing
Tests run: 11, Failures: 0, Errors: 0, Skipped: 0, Time elapsed: 78.01 sec - in org.apache.hadoop.yarn.server.resourcemanager.scheduler.capacity.TestContainerResizing
Running org.apache.hadoop.yarn.server.resourcemanager.scheduler.capacity.TestQueueCapacities
Tests run: 7, Failures: 0, Errors: 0, Skipped: 0, Time elapsed: 0.235 sec - in org.apache.hadoop.yarn.server.resourcemanager.scheduler.capacity.TestQueueCapacities
Running org.apache.hadoop.yarn.server.resourcemanager.scheduler.capacity.TestParentQueue
Tests run: 9, Failures: 0, Errors: 0, Skipped: 0, Time elapsed: 4.688 sec - in org.apache.hadoop.yarn.server.resourcemanager.scheduler.capacity.TestParentQueue
Running org.apache.hadoop.yarn.server.resourcemanager.scheduler.capacity.TestNodeLabelContainerAllocation
Tests run: 15, Failures: 0, Errors: 0, Skipped: 0, Time elapsed: 300.774 sec - in org.apache.hadoop.yarn.server.resourcemanager.scheduler.capacity.TestNodeLabelContainerAllocation
Running org.apache.hadoop.yarn.server.resourcemanager.scheduler.capacity.TestCapacitySchedulerNodeLabelUpdate
Tests run: 4, Failures: 0, Errors: 0, Skipped: 0, Time elapsed: 34.472 sec - in org.apache.hadoop.yarn.server.resourcemanager.scheduler.capacity.TestCapacitySchedulerNodeLabelUpdate
Running org.apache.hadoop.yarn.server.resourcemanager.scheduler.capacity.TestCapacitySchedulerQueueACLs
Tests run: 1, Failures: 0, Errors: 0, Skipped: 0, Time elapsed: 16.857 sec - in org.apache.hadoop.yarn.server.resourcemanager.scheduler.capacity.TestCapacitySchedulerQueueACLs
Running org.apache.hadoop.yarn.server.resourcemanager.scheduler.capacity.TestLeafQueue
Tests run: 30, Failures: 0, Errors: 0, Skipped: 0, Time elapsed: 25.854 sec - in org.apache.hadoop.yarn.server.resourcemanager.scheduler.capacity.TestLeafQueue
Running org.apache.hadoop.yarn.server.resourcemanager.scheduler.capacity.TestChildQueueOrder
Tests run: 1, Failures: 0, Errors: 0, Skipped: 0, Time elapsed: 3.108 sec - in org.apache.hadoop.yarn.server.resourcemanager.scheduler.capacity.TestChildQueueOrder
Running org.apache.hadoop.yarn.server.resourcemanager.scheduler.capacity.TestQueueMappings
Tests run: 3, Failures: 0, Errors: 0, Skipped: 0, Time elapsed: 2.729 sec - in org.apache.hadoop.yarn.server.resourcemanager.scheduler.capacity.TestQueueMappings
Running org.apache.hadoop.yarn.server.resourcemanager.scheduler.capacity.TestApplicationPriority
Tests run: 9, Failures: 0, Errors: 0, Skipped: 0, Time elapsed: 79.201 sec - in org.apache.hadoop.yarn.server.resourcemanager.scheduler.capacity.TestApplicationPriority
Running org.apache.hadoop.yarn.server.resourcemanager.scheduler.capacity.TestApplicationLimitsByPartition
Tests run: 5, Failures: 0, Errors: 0, Skipped: 0, Time elapsed: 81.439 sec - in org.apache.hadoop.yarn.server.resourcemanager.scheduler.capacity.TestApplicationLimitsByPartition
Running org.apache.hadoop.yarn.server.resourcemanager.scheduler.capacity.TestWorkPreservingRMRestartForNodeLabel
Tests run: 1, Failures: 0, Errors: 0, Skipped: 0, Time elapsed: 21.382 sec - in org.apache.hadoop.yarn.server.resourcemanager.scheduler.capacity.TestWorkPreservingRMRestartForNodeLabel
Running org.apache.hadoop.yarn.server.resourcemanager.scheduler.capacity.TestCapacityScheduler
Tests run: 47, Failures: 0, Errors: 0, Skipped: 0, Time elapsed: 130.061 sec - in org.apache.hadoop.yarn.server.resourcemanager.scheduler.capacity.TestCapacityScheduler
Running org.apache.hadoop.yarn.server.resourcemanager.scheduler.capacity.TestReservations
Tests run: 10, Failures: 0, Errors: 0, Skipped: 0, Time elapsed: 6.253 sec - in org.apache.hadoop.yarn.server.resourcemanager.scheduler.capacity.TestReservations
Running org.apache.hadoop.yarn.server.resourcemanager.scheduler.capacity.TestIncreaseAllocationExpirer
Tests run: 4, Failures: 0, Errors: 0, Skipped: 0, Time elapsed: 72.456 sec - in org.apache.hadoop.yarn.server.resourcemanager.scheduler.capacity.TestIncreaseAllocationExpirer
Running org.apache.hadoop.yarn.server.resourcemanager.scheduler.capacity.TestContainerAllocation
Tests run: 6, Failures: 0, Errors: 0, Skipped: 0, Time elapsed: 63.218 sec - in org.apache.hadoop.yarn.server.resourcemanager.scheduler.capacity.TestContainerAllocation
Running org.apache.hadoop.yarn.server.resourcemanager.scheduler.TestSchedulerUtils
Tests run: 9, Failures: 0, Errors: 0, Skipped: 0, Time elapsed: 5.777 sec - in org.apache.hadoop.yarn.server.resourcemanager.scheduler.TestSchedulerUtils
Running org.apache.hadoop.yarn.server.resourcemanager.scheduler.TestAbstractYarnScheduler
Tests run: 14, Failures: 0, Errors: 0, Skipped: 0, Time elapsed: 48.621 sec - in org.apache.hadoop.yarn.server.resourcemanager.scheduler.TestAbstractYarnScheduler
Running org.apache.hadoop.yarn.server.resourcemanager.scheduler.TestQueueMetrics
Tests run: 8, Failures: 0, Errors: 0, Skipped: 0, Time elapsed: 3.705 sec - in org.apache.hadoop.yarn.server.resourcemanager.scheduler.TestQueueMetrics
Running org.apache.hadoop.yarn.server.resourcemanager.TestApplicationMasterService
Tests run: 8, Failures: 0, Errors: 0, Skipped: 0, Time elapsed: 51.156 sec - in org.apache.hadoop.yarn.server.resourcemanager.TestApplicationMasterService
Running org.apache.hadoop.yarn.server.resourcemanager.TestRMProxyUsersConf
Tests run: 3, Failures: 0, Errors: 0, Skipped: 0, Time elapsed: 32.754 sec - in org.apache.hadoop.yarn.server.resourcemanager.TestRMProxyUsersConf
Running org.apache.hadoop.yarn.server.resourcemanager.resourcetracker.TestRMNMRPCResponseId
Tests run: 1, Failures: 0, Errors: 0, Skipped: 0, Time elapsed: 1.783 sec - in org.apache.hadoop.yarn.server.resourcemanager.resourcetracker.TestRMNMRPCResponseId
Running org.apache.hadoop.yarn.server.resourcemanager.resourcetracker.TestNMReconnect
Tests run: 3, Failures: 0, Errors: 0, Skipped: 0, Time elapsed: 2.515 sec - in org.apache.hadoop.yarn.server.resourcemanager.resourcetracker.TestNMReconnect
Running org.apache.hadoop.yarn.server.resourcemanager.resourcetracker.TestNMExpiry
Tests run: 1, Failures: 0, Errors: 0, Skipped: 0, Time elapsed: 3.021 sec - in org.apache.hadoop.yarn.server.resourcemanager.resourcetracker.TestNMExpiry
Running org.apache.hadoop.yarn.server.resourcemanager.TestApplicationACLs
Tests run: 1, Failures: 0, Errors: 0, Skipped: 0, Time elapsed: 9.179 sec - in org.apache.hadoop.yarn.server.resourcemanager.TestApplicationACLs
Running org.apache.hadoop.yarn.server.resourcemanager.TestClientRMService
Tests run: 19, Failures: 0, Errors: 0, Skipped: 0, Time elapsed: 13.159 sec - in org.apache.hadoop.yarn.server.resourcemanager.TestClientRMService
Running org.apache.hadoop.yarn.server.resourcemanager.metrics.TestSystemMetricsPublisher
Tests run: 4, Failures: 0, Errors: 0, Skipped: 0, Time elapsed: 6.941 sec - in org.apache.hadoop.yarn.server.resourcemanager.metrics.TestSystemMetricsPublisher
Running org.apache.hadoop.yarn.server.resourcemanager.TestTokenClientRMService
Tests run: 6, Failures: 0, Errors: 0, Skipped: 0, Time elapsed: 1.575 sec - in org.apache.hadoop.yarn.server.resourcemanager.TestTokenClientRMService
Running org.apache.hadoop.yarn.server.resourcemanager.applicationsmanager.TestAMRMRPCResponseId
Tests run: 1, Failures: 0, Errors: 0, Skipped: 0, Time elapsed: 5.863 sec - in org.apache.hadoop.yarn.server.resourcemanager.applicationsmanager.TestAMRMRPCResponseId
Running org.apache.hadoop.yarn.server.resourcemanager.applicationsmanager.TestAMRMRPCNodeUpdates
Tests run: 1, Failures: 0, Errors: 0, Skipped: 0, Time elapsed: 9.555 sec - in org.apache.hadoop.yarn.server.resourcemanager.applicationsmanager.TestAMRMRPCNodeUpdates
Running org.apache.hadoop.yarn.server.resourcemanager.applicationsmanager.TestAMRestart
Tests run: 9, Failures: 0, Errors: 0, Skipped: 0, Time elapsed: 172.87 sec - in org.apache.hadoop.yarn.server.resourcemanager.applicationsmanager.TestAMRestart
Running org.apache.hadoop.yarn.server.resourcemanager.TestRMAuditLogger
Tests run: 3, Failures: 0, Errors: 0, Skipped: 0, Time elapsed: 1.442 sec - in org.apache.hadoop.yarn.server.resourcemanager.TestRMAuditLogger
Running org.apache.hadoop.yarn.server.resourcemanager.TestAMAuthorization
Tests run: 4, Failures: 0, Errors: 0, Skipped: 0, Time elapsed: 13.852 sec - in org.apache.hadoop.yarn.server.resourcemanager.TestAMAuthorization

Results :

Failed tests: 
  TestFairScheduler.testContinuousScheduling:3816 expected:<2> but was:<1>

Tests run: 1418, Failures: 1, Errors: 0, Skipped: 2

[INFO] ------------------------------------------------------------------------
[INFO] Reactor Summary:
[INFO] 
[INFO] Apache Hadoop YARN ................................ SUCCESS [  3.529 s]
[INFO] Apache Hadoop YARN API ............................ SUCCESS [04:24 min]
[INFO] Apache Hadoop YARN Common ......................... SUCCESS [03:08 min]
[INFO] Apache Hadoop YARN Server ......................... SUCCESS [  0.100 s]
[INFO] Apache Hadoop YARN Server Common .................. SUCCESS [ 47.375 s]
[INFO] Apache Hadoop YARN NodeManager .................... SUCCESS [10:01 min]
[INFO] Apache Hadoop YARN Web Proxy ...................... SUCCESS [ 28.105 s]
[INFO] Apache Hadoop YARN ApplicationHistoryService ...... SUCCESS [03:27 min]
[INFO] Apache Hadoop YARN ResourceManager ................ FAILURE [  01:08 h]
[INFO] Apache Hadoop YARN Server Tests ................... SKIPPED
[INFO] Apache Hadoop YARN Client ......................... SKIPPED
[INFO] Apache Hadoop YARN SharedCacheManager ............. SKIPPED
[INFO] Apache Hadoop YARN Timeline Plugin Storage ........ SKIPPED
[INFO] Apache Hadoop YARN Applications ................... SKIPPED
[INFO] Apache Hadoop YARN DistributedShell ............... SKIPPED
[INFO] Apache Hadoop YARN Unmanaged Am Launcher .......... SKIPPED
[INFO] Apache Hadoop YARN Site ........................... SKIPPED
[INFO] Apache Hadoop YARN Registry ....................... SKIPPED
[INFO] Apache Hadoop YARN Project ........................ SKIPPED
[INFO] ------------------------------------------------------------------------
[INFO] BUILD FAILURE
[INFO] ------------------------------------------------------------------------
[INFO] Total time: 01:31 h
[INFO] Finished at: 2016-02-25T02:25:20+00:00
[INFO] Final Memory: 60M/494M
[INFO] ------------------------------------------------------------------------
[ERROR] Failed to execute goal org.apache.maven.plugins:maven-surefire-plugin:2.17:test (default-test) on project hadoop-yarn-server-resourcemanager: There are test failures.
[ERROR] 
[ERROR] Please refer to <https://builds.apache.org/job/Hadoop-Yarn-trunk/ws/hadoop-yarn-project/hadoop-yarn/hadoop-yarn-server/hadoop-yarn-server-resourcemanager/target/surefire-reports> for the individual test results.
[ERROR] -> [Help 1]
[ERROR] 
[ERROR] To see the full stack trace of the errors, re-run Maven with the -e switch.
[ERROR] Re-run Maven using the -X switch to enable full debug logging.
[ERROR] 
[ERROR] For more information about the errors and possible solutions, please read the following articles:
[ERROR] [Help 1] http://cwiki.apache.org/confluence/display/MAVEN/MojoFailureException
[ERROR] 
[ERROR] After correcting the problems, you can resume the build with the command
[ERROR]   mvn <goals> -rf :hadoop-yarn-server-resourcemanager
Build step 'Execute shell' marked build as failure
Archiving artifacts
Recording test results

Jenkins build is back to normal : Hadoop-Yarn-trunk #1818

Posted by Apache Jenkins Server <je...@builds.apache.org>.
See <https://builds.apache.org/job/Hadoop-Yarn-trunk/1818/changes>


Build failed in Jenkins: Hadoop-Yarn-trunk #1817

Posted by Apache Jenkins Server <je...@builds.apache.org>.
See <https://builds.apache.org/job/Hadoop-Yarn-trunk/1817/changes>

Changes:

[kasha] YARN-4729. SchedulerApplicationAttempt#getTotalRequiredResources can

------------------------------------------
[...truncated 8514 lines...]

main:
    [mkdir] Created dir: <https://builds.apache.org/job/Hadoop-Yarn-trunk/ws/hadoop-yarn-project/hadoop-yarn/hadoop-yarn-server/hadoop-yarn-server-web-proxy/target/test-dir>
[INFO] Executed tasks
[INFO] 
[INFO] --- maven-resources-plugin:2.6:resources (default-resources) @ hadoop-yarn-server-web-proxy ---
[INFO] Using 'UTF-8' encoding to copy filtered resources.
[INFO] skip non existing resourceDirectory <https://builds.apache.org/job/Hadoop-Yarn-trunk/ws/hadoop-yarn-project/hadoop-yarn/hadoop-yarn-server/hadoop-yarn-server-web-proxy/src/main/resources>
[INFO] 
[INFO] --- maven-compiler-plugin:3.1:compile (default-compile) @ hadoop-yarn-server-web-proxy ---
[INFO] Compiling 10 source files to <https://builds.apache.org/job/Hadoop-Yarn-trunk/ws/hadoop-yarn-project/hadoop-yarn/hadoop-yarn-server/hadoop-yarn-server-web-proxy/target/classes>
[INFO] 
[INFO] --- maven-resources-plugin:2.6:testResources (default-testResources) @ hadoop-yarn-server-web-proxy ---
[INFO] Using 'UTF-8' encoding to copy filtered resources.
[INFO] skip non existing resourceDirectory <https://builds.apache.org/job/Hadoop-Yarn-trunk/ws/hadoop-yarn-project/hadoop-yarn/hadoop-yarn-server/hadoop-yarn-server-web-proxy/src/test/resources>
[INFO] 
[INFO] --- maven-compiler-plugin:3.1:testCompile (default-testCompile) @ hadoop-yarn-server-web-proxy ---
[INFO] Compiling 6 source files to <https://builds.apache.org/job/Hadoop-Yarn-trunk/ws/hadoop-yarn-project/hadoop-yarn/hadoop-yarn-server/hadoop-yarn-server-web-proxy/target/test-classes>
[INFO] 
[INFO] --- maven-jar-plugin:2.5:test-jar (default) @ hadoop-yarn-server-web-proxy ---
[INFO] Building jar: <https://builds.apache.org/job/Hadoop-Yarn-trunk/ws/hadoop-yarn-project/hadoop-yarn/hadoop-yarn-server/hadoop-yarn-server-web-proxy/target/hadoop-yarn-server-web-proxy-3.0.0-SNAPSHOT-tests.jar>
[INFO] 
[INFO] --- maven-surefire-plugin:2.17:test (default-test) @ hadoop-yarn-server-web-proxy ---
[INFO] Surefire report directory: <https://builds.apache.org/job/Hadoop-Yarn-trunk/ws/hadoop-yarn-project/hadoop-yarn/hadoop-yarn-server/hadoop-yarn-server-web-proxy/target/surefire-reports>

-------------------------------------------------------
 T E S T S
-------------------------------------------------------

-------------------------------------------------------
 T E S T S
-------------------------------------------------------
Running org.apache.hadoop.yarn.server.webproxy.TestWebAppProxyServlet
Tests run: 4, Failures: 0, Errors: 0, Skipped: 0, Time elapsed: 5 sec - in org.apache.hadoop.yarn.server.webproxy.TestWebAppProxyServlet
Running org.apache.hadoop.yarn.server.webproxy.TestWebAppProxyServer
Tests run: 2, Failures: 0, Errors: 0, Skipped: 0, Time elapsed: 2.918 sec - in org.apache.hadoop.yarn.server.webproxy.TestWebAppProxyServer
Running org.apache.hadoop.yarn.server.webproxy.TestAppReportFetcher
Tests run: 2, Failures: 0, Errors: 0, Skipped: 0, Time elapsed: 0.981 sec - in org.apache.hadoop.yarn.server.webproxy.TestAppReportFetcher
Running org.apache.hadoop.yarn.server.webproxy.TestProxyUriUtils
Tests run: 8, Failures: 0, Errors: 0, Skipped: 0, Time elapsed: 0.68 sec - in org.apache.hadoop.yarn.server.webproxy.TestProxyUriUtils
Running org.apache.hadoop.yarn.server.webproxy.amfilter.TestAmFilter
Tests run: 2, Failures: 0, Errors: 0, Skipped: 0, Time elapsed: 0.705 sec - in org.apache.hadoop.yarn.server.webproxy.amfilter.TestAmFilter
Running org.apache.hadoop.yarn.server.webproxy.amfilter.TestAmFilterInitializer
Tests run: 2, Failures: 0, Errors: 0, Skipped: 0, Time elapsed: 0.638 sec - in org.apache.hadoop.yarn.server.webproxy.amfilter.TestAmFilterInitializer

Results :

Tests run: 20, Failures: 0, Errors: 0, Skipped: 0

[INFO] 
[INFO] --- maven-jar-plugin:2.5:jar (default-jar) @ hadoop-yarn-server-web-proxy ---
[INFO] Building jar: <https://builds.apache.org/job/Hadoop-Yarn-trunk/ws/hadoop-yarn-project/hadoop-yarn/hadoop-yarn-server/hadoop-yarn-server-web-proxy/target/hadoop-yarn-server-web-proxy-3.0.0-SNAPSHOT.jar>
[INFO] 
[INFO] --- maven-source-plugin:2.3:jar-no-fork (hadoop-java-sources) @ hadoop-yarn-server-web-proxy ---
[INFO] Building jar: <https://builds.apache.org/job/Hadoop-Yarn-trunk/ws/hadoop-yarn-project/hadoop-yarn/hadoop-yarn-server/hadoop-yarn-server-web-proxy/target/hadoop-yarn-server-web-proxy-3.0.0-SNAPSHOT-sources.jar>
[INFO] 
[INFO] --- maven-source-plugin:2.3:test-jar-no-fork (hadoop-java-sources) @ hadoop-yarn-server-web-proxy ---
[INFO] Building jar: <https://builds.apache.org/job/Hadoop-Yarn-trunk/ws/hadoop-yarn-project/hadoop-yarn/hadoop-yarn-server/hadoop-yarn-server-web-proxy/target/hadoop-yarn-server-web-proxy-3.0.0-SNAPSHOT-test-sources.jar>
[INFO] 
[INFO] --- maven-enforcer-plugin:1.3.1:enforce (dist-enforce) @ hadoop-yarn-server-web-proxy ---
[INFO] 
[INFO] --- maven-site-plugin:3.4:attach-descriptor (attach-descriptor) @ hadoop-yarn-server-web-proxy ---
[INFO] 
[INFO] --- maven-javadoc-plugin:2.8.1:jar (module-javadocs) @ hadoop-yarn-server-web-proxy ---
[INFO] 
Loading source files for package org.apache.hadoop.yarn.server.webproxy...
Loading source files for package org.apache.hadoop.yarn.server.webproxy.amfilter...
Constructing Javadoc information...
Standard Doclet version 1.7.0_55
Building tree for all the packages and classes...
Generating <https://builds.apache.org/job/Hadoop-Yarn-trunk/ws/hadoop-yarn-project/hadoop-yarn/hadoop-yarn-server/hadoop-yarn-server-web-proxy/target/org/apache/hadoop/yarn/server/webproxy/AppReportFetcher.html...>
Generating <https://builds.apache.org/job/Hadoop-Yarn-trunk/ws/hadoop-yarn-project/hadoop-yarn/hadoop-yarn-server/hadoop-yarn-server-web-proxy/target/org/apache/hadoop/yarn/server/webproxy/ProxyUriUtils.html...>
Generating <https://builds.apache.org/job/Hadoop-Yarn-trunk/ws/hadoop-yarn-project/hadoop-yarn/hadoop-yarn-server/hadoop-yarn-server-web-proxy/target/org/apache/hadoop/yarn/server/webproxy/ProxyUtils.html...>
Generating <https://builds.apache.org/job/Hadoop-Yarn-trunk/ws/hadoop-yarn-project/hadoop-yarn/hadoop-yarn-server/hadoop-yarn-server-web-proxy/target/org/apache/hadoop/yarn/server/webproxy/ProxyUtils._.html...>
Generating <https://builds.apache.org/job/Hadoop-Yarn-trunk/ws/hadoop-yarn-project/hadoop-yarn/hadoop-yarn-server/hadoop-yarn-server-web-proxy/target/org/apache/hadoop/yarn/server/webproxy/ProxyUtils.Page.html...>
Generating <https://builds.apache.org/job/Hadoop-Yarn-trunk/ws/hadoop-yarn-project/hadoop-yarn/hadoop-yarn-server/hadoop-yarn-server-web-proxy/target/org/apache/hadoop/yarn/server/webproxy/WebAppProxy.html...>
Generating <https://builds.apache.org/job/Hadoop-Yarn-trunk/ws/hadoop-yarn-project/hadoop-yarn/hadoop-yarn-server/hadoop-yarn-server-web-proxy/target/org/apache/hadoop/yarn/server/webproxy/WebAppProxyServer.html...>
Generating <https://builds.apache.org/job/Hadoop-Yarn-trunk/ws/hadoop-yarn-project/hadoop-yarn/hadoop-yarn-server/hadoop-yarn-server-web-proxy/target/org/apache/hadoop/yarn/server/webproxy/WebAppProxyServlet.html...>
Generating <https://builds.apache.org/job/Hadoop-Yarn-trunk/ws/hadoop-yarn-project/hadoop-yarn/hadoop-yarn-server/hadoop-yarn-server-web-proxy/target/org/apache/hadoop/yarn/server/webproxy/amfilter/AmFilterInitializer.html...>
Generating <https://builds.apache.org/job/Hadoop-Yarn-trunk/ws/hadoop-yarn-project/hadoop-yarn/hadoop-yarn-server/hadoop-yarn-server-web-proxy/target/org/apache/hadoop/yarn/server/webproxy/amfilter/AmIpFilter.html...>
Generating <https://builds.apache.org/job/Hadoop-Yarn-trunk/ws/hadoop-yarn-project/hadoop-yarn/hadoop-yarn-server/hadoop-yarn-server-web-proxy/target/org/apache/hadoop/yarn/server/webproxy/amfilter/AmIpPrincipal.html...>
Generating <https://builds.apache.org/job/Hadoop-Yarn-trunk/ws/hadoop-yarn-project/hadoop-yarn/hadoop-yarn-server/hadoop-yarn-server-web-proxy/target/org/apache/hadoop/yarn/server/webproxy/amfilter/AmIpServletRequestWrapper.html...>
Generating <https://builds.apache.org/job/Hadoop-Yarn-trunk/ws/hadoop-yarn-project/hadoop-yarn/hadoop-yarn-server/hadoop-yarn-server-web-proxy/target/overview-frame.html...>
Generating <https://builds.apache.org/job/Hadoop-Yarn-trunk/ws/hadoop-yarn-project/hadoop-yarn/hadoop-yarn-server/hadoop-yarn-server-web-proxy/target/org/apache/hadoop/yarn/server/webproxy/package-frame.html...>
Generating <https://builds.apache.org/job/Hadoop-Yarn-trunk/ws/hadoop-yarn-project/hadoop-yarn/hadoop-yarn-server/hadoop-yarn-server-web-proxy/target/org/apache/hadoop/yarn/server/webproxy/package-summary.html...>
Generating <https://builds.apache.org/job/Hadoop-Yarn-trunk/ws/hadoop-yarn-project/hadoop-yarn/hadoop-yarn-server/hadoop-yarn-server-web-proxy/target/org/apache/hadoop/yarn/server/webproxy/package-tree.html...>
Generating <https://builds.apache.org/job/Hadoop-Yarn-trunk/ws/hadoop-yarn-project/hadoop-yarn/hadoop-yarn-server/hadoop-yarn-server-web-proxy/target/org/apache/hadoop/yarn/server/webproxy/amfilter/package-frame.html...>
Generating <https://builds.apache.org/job/Hadoop-Yarn-trunk/ws/hadoop-yarn-project/hadoop-yarn/hadoop-yarn-server/hadoop-yarn-server-web-proxy/target/org/apache/hadoop/yarn/server/webproxy/amfilter/package-summary.html...>
Generating <https://builds.apache.org/job/Hadoop-Yarn-trunk/ws/hadoop-yarn-project/hadoop-yarn/hadoop-yarn-server/hadoop-yarn-server-web-proxy/target/org/apache/hadoop/yarn/server/webproxy/amfilter/package-tree.html...>
Generating <https://builds.apache.org/job/Hadoop-Yarn-trunk/ws/hadoop-yarn-project/hadoop-yarn/hadoop-yarn-server/hadoop-yarn-server-web-proxy/target/constant-values.html...>
Generating <https://builds.apache.org/job/Hadoop-Yarn-trunk/ws/hadoop-yarn-project/hadoop-yarn/hadoop-yarn-server/hadoop-yarn-server-web-proxy/target/serialized-form.html...>
Generating <https://builds.apache.org/job/Hadoop-Yarn-trunk/ws/hadoop-yarn-project/hadoop-yarn/hadoop-yarn-server/hadoop-yarn-server-web-proxy/target/org/apache/hadoop/yarn/server/webproxy/class-use/WebAppProxyServlet.html...>
Generating <https://builds.apache.org/job/Hadoop-Yarn-trunk/ws/hadoop-yarn-project/hadoop-yarn/hadoop-yarn-server/hadoop-yarn-server-web-proxy/target/org/apache/hadoop/yarn/server/webproxy/class-use/WebAppProxy.html...>
Generating <https://builds.apache.org/job/Hadoop-Yarn-trunk/ws/hadoop-yarn-project/hadoop-yarn/hadoop-yarn-server/hadoop-yarn-server-web-proxy/target/org/apache/hadoop/yarn/server/webproxy/class-use/ProxyUtils.html...>
Generating <https://builds.apache.org/job/Hadoop-Yarn-trunk/ws/hadoop-yarn-project/hadoop-yarn/hadoop-yarn-server/hadoop-yarn-server-web-proxy/target/org/apache/hadoop/yarn/server/webproxy/class-use/ProxyUtils._.html...>
Generating <https://builds.apache.org/job/Hadoop-Yarn-trunk/ws/hadoop-yarn-project/hadoop-yarn/hadoop-yarn-server/hadoop-yarn-server-web-proxy/target/org/apache/hadoop/yarn/server/webproxy/class-use/ProxyUtils.Page.html...>
Generating <https://builds.apache.org/job/Hadoop-Yarn-trunk/ws/hadoop-yarn-project/hadoop-yarn/hadoop-yarn-server/hadoop-yarn-server-web-proxy/target/org/apache/hadoop/yarn/server/webproxy/class-use/ProxyUriUtils.html...>
Generating <https://builds.apache.org/job/Hadoop-Yarn-trunk/ws/hadoop-yarn-project/hadoop-yarn/hadoop-yarn-server/hadoop-yarn-server-web-proxy/target/org/apache/hadoop/yarn/server/webproxy/class-use/WebAppProxyServer.html...>
Generating <https://builds.apache.org/job/Hadoop-Yarn-trunk/ws/hadoop-yarn-project/hadoop-yarn/hadoop-yarn-server/hadoop-yarn-server-web-proxy/target/org/apache/hadoop/yarn/server/webproxy/class-use/AppReportFetcher.html...>
Generating <https://builds.apache.org/job/Hadoop-Yarn-trunk/ws/hadoop-yarn-project/hadoop-yarn/hadoop-yarn-server/hadoop-yarn-server-web-proxy/target/org/apache/hadoop/yarn/server/webproxy/amfilter/class-use/AmIpPrincipal.html...>
Generating <https://builds.apache.org/job/Hadoop-Yarn-trunk/ws/hadoop-yarn-project/hadoop-yarn/hadoop-yarn-server/hadoop-yarn-server-web-proxy/target/org/apache/hadoop/yarn/server/webproxy/amfilter/class-use/AmFilterInitializer.html...>
Generating <https://builds.apache.org/job/Hadoop-Yarn-trunk/ws/hadoop-yarn-project/hadoop-yarn/hadoop-yarn-server/hadoop-yarn-server-web-proxy/target/org/apache/hadoop/yarn/server/webproxy/amfilter/class-use/AmIpFilter.html...>
Generating <https://builds.apache.org/job/Hadoop-Yarn-trunk/ws/hadoop-yarn-project/hadoop-yarn/hadoop-yarn-server/hadoop-yarn-server-web-proxy/target/org/apache/hadoop/yarn/server/webproxy/amfilter/class-use/AmIpServletRequestWrapper.html...>
Generating <https://builds.apache.org/job/Hadoop-Yarn-trunk/ws/hadoop-yarn-project/hadoop-yarn/hadoop-yarn-server/hadoop-yarn-server-web-proxy/target/org/apache/hadoop/yarn/server/webproxy/package-use.html...>
Generating <https://builds.apache.org/job/Hadoop-Yarn-trunk/ws/hadoop-yarn-project/hadoop-yarn/hadoop-yarn-server/hadoop-yarn-server-web-proxy/target/org/apache/hadoop/yarn/server/webproxy/amfilter/package-use.html...>
Building index for all the packages and classes...
Generating <https://builds.apache.org/job/Hadoop-Yarn-trunk/ws/hadoop-yarn-project/hadoop-yarn/hadoop-yarn-server/hadoop-yarn-server-web-proxy/target/overview-tree.html...>
Generating <https://builds.apache.org/job/Hadoop-Yarn-trunk/ws/hadoop-yarn-project/hadoop-yarn/hadoop-yarn-server/hadoop-yarn-server-web-proxy/target/index-all.html...>
Generating <https://builds.apache.org/job/Hadoop-Yarn-trunk/ws/hadoop-yarn-project/hadoop-yarn/hadoop-yarn-server/hadoop-yarn-server-web-proxy/target/deprecated-list.html...>
Building index for all classes...
Generating <https://builds.apache.org/job/Hadoop-Yarn-trunk/ws/hadoop-yarn-project/hadoop-yarn/hadoop-yarn-server/hadoop-yarn-server-web-proxy/target/allclasses-frame.html...>
Generating <https://builds.apache.org/job/Hadoop-Yarn-trunk/ws/hadoop-yarn-project/hadoop-yarn/hadoop-yarn-server/hadoop-yarn-server-web-proxy/target/allclasses-noframe.html...>
Generating <https://builds.apache.org/job/Hadoop-Yarn-trunk/ws/hadoop-yarn-project/hadoop-yarn/hadoop-yarn-server/hadoop-yarn-server-web-proxy/target/index.html...>
Generating <https://builds.apache.org/job/Hadoop-Yarn-trunk/ws/hadoop-yarn-project/hadoop-yarn/hadoop-yarn-server/hadoop-yarn-server-web-proxy/target/overview-summary.html...>
Generating <https://builds.apache.org/job/Hadoop-Yarn-trunk/ws/hadoop-yarn-project/hadoop-yarn/hadoop-yarn-server/hadoop-yarn-server-web-proxy/target/help-doc.html...>
[WARNING] Javadoc Warnings
[WARNING] com.sun.tools.javac.jvm.ClassReader$BadClassFile: bad class file: /home/jenkins/.m2/repository/org/apache/hadoop/hadoop-common/3.0.0-SNAPSHOT/hadoop-common-3.0.0-SNAPSHOT.jar(org/apache/hadoop/service/ServiceStateChangeListener.class)
[WARNING] unable to access file: corrupted zip file
[WARNING] Please remove or make sure it appears in the correct subdirectory of the classpath.
[WARNING] at com.sun.tools.javac.jvm.ClassReader.badClassFile(ClassReader.java:325)
[WARNING] at com.sun.tools.javac.jvm.ClassReader.fillIn(ClassReader.java:2240)
[WARNING] at com.sun.tools.javac.jvm.ClassReader.complete(ClassReader.java:2139)
[WARNING] at com.sun.tools.javac.code.Symbol.complete(Symbol.java:421)
[WARNING] at com.sun.tools.javac.code.Symbol$ClassSymbol.complete(Symbol.java:821)
[WARNING] at com.sun.tools.javac.code.Type$ClassType.complete(Type.java:723)
[WARNING] at com.sun.tools.javac.code.Type$ClassType.getTypeArguments(Type.java:651)
[WARNING] at com.sun.tools.javac.code.Type$ClassType.allparams(Type.java:672)
[WARNING] at com.sun.tools.javadoc.ClassDocImpl.isGeneric(ClassDocImpl.java:430)
[WARNING] at com.sun.tools.javadoc.TypeMaker.getType(TypeMaker.java:59)
[WARNING] at com.sun.tools.javadoc.ParameterImpl.<init>(ParameterImpl.java:54)
[WARNING] at com.sun.tools.javadoc.ExecutableMemberDocImpl.parameters(ExecutableMemberDocImpl.java:190)
[WARNING] at com.sun.tools.doclets.internal.toolkit.util.Util.executableMembersEqual(Util.java:157)
[WARNING] at com.sun.tools.doclets.internal.toolkit.util.VisibleMemberMap$ClassMember.isEqual(VisibleMemberMap.java:271)
[WARNING] at com.sun.tools.doclets.internal.toolkit.util.VisibleMemberMap.getClassMember(VisibleMemberMap.java:740)
[WARNING] at com.sun.tools.doclets.internal.toolkit.util.VisibleMemberMap.getMemberKey(VisibleMemberMap.java:754)
[WARNING] at com.sun.tools.doclets.internal.toolkit.util.VisibleMemberMap.fillMemberLevelMap(VisibleMemberMap.java:232)
[WARNING] at com.sun.tools.doclets.internal.toolkit.util.VisibleMemberMap.access$700(VisibleMemberMap.java:47)
[WARNING] at com.sun.tools.doclets.internal.toolkit.util.VisibleMemberMap$ClassMembers.addMembers(VisibleMemberMap.java:380)
[WARNING] at com.sun.tools.doclets.internal.toolkit.util.VisibleMemberMap$ClassMembers.mapClass(VisibleMemberMap.java:339)
[WARNING] at com.sun.tools.doclets.internal.toolkit.util.VisibleMemberMap$ClassMembers.mapClass(VisibleMemberMap.java:351)
[WARNING] at com.sun.tools.doclets.internal.toolkit.util.VisibleMemberMap$ClassMembers.build(VisibleMemberMap.java:334)
[WARNING] at com.sun.tools.doclets.internal.toolkit.util.VisibleMemberMap$ClassMembers.access$100(VisibleMemberMap.java:284)
[WARNING] at com.sun.tools.doclets.internal.toolkit.util.VisibleMemberMap.<init>(VisibleMemberMap.java:120)
[WARNING] at com.sun.tools.doclets.internal.toolkit.builders.MemberSummaryBuilder.init(MemberSummaryBuilder.java:107)
[WARNING] at com.sun.tools.doclets.internal.toolkit.builders.MemberSummaryBuilder.getInstance(MemberSummaryBuilder.java:83)
[WARNING] at com.sun.tools.doclets.internal.toolkit.builders.BuilderFactory.getMemberSummaryBuilder(BuilderFactory.java:222)
[WARNING] at com.sun.tools.doclets.formats.html.ClassWriterImpl.getNavSummaryLinks(ClassWriterImpl.java:594)
[WARNING] at com.sun.tools.doclets.formats.html.ClassWriterImpl.addSummaryDetailLinks(ClassWriterImpl.java:576)
[WARNING] at com.sun.tools.doclets.formats.html.HtmlDocletWriter.addNavLinks(HtmlDocletWriter.java:747)
[WARNING] at com.sun.tools.doclets.formats.html.ClassWriterImpl.getHeader(ClassWriterImpl.java:158)
[WARNING] at com.sun.tools.doclets.internal.toolkit.builders.ClassBuilder.buildClassDoc(ClassBuilder.java:142)
[WARNING] at sun.reflect.NativeMethodAccessorImpl.invoke0(Native Method)
[WARNING] at sun.reflect.NativeMethodAccessorImpl.invoke(NativeMethodAccessorImpl.java:57)
[WARNING] at sun.reflect.DelegatingMethodAccessorImpl.invoke(DelegatingMethodAccessorImpl.java:43)
[WARNING] at java.lang.reflect.Method.invoke(Method.java:606)
[WARNING] at com.sun.tools.doclets.internal.toolkit.builders.AbstractBuilder.invokeMethod(AbstractBuilder.java:148)
[WARNING] at com.sun.tools.doclets.internal.toolkit.builders.AbstractBuilder.build(AbstractBuilder.java:103)
[WARNING] at com.sun.tools.doclets.internal.toolkit.builders.ClassBuilder.build(ClassBuilder.java:117)
[WARNING] at com.sun.tools.doclets.formats.html.HtmlDoclet.generateClassFiles(HtmlDoclet.java:186)
[WARNING] at com.sun.tools.doclets.internal.toolkit.AbstractDoclet.generateClassFiles(AbstractDoclet.java:183)
[WARNING] at com.sun.tools.doclets.internal.toolkit.AbstractDoclet.startGeneration(AbstractDoclet.java:125)
[WARNING] at com.sun.tools.doclets.internal.toolkit.AbstractDoclet.start(AbstractDoclet.java:83)
[WARNING] at com.sun.tools.doclets.formats.html.HtmlDoclet.start(HtmlDoclet.java:63)
[WARNING] at com.sun.tools.doclets.standard.Standard.start(Standard.java:39)
[WARNING] at sun.reflect.NativeMethodAccessorImpl.invoke0(Native Method)
[WARNING] at sun.reflect.NativeMethodAccessorImpl.invoke(NativeMethodAccessorImpl.java:57)
[WARNING] at sun.reflect.DelegatingMethodAccessorImpl.invoke(DelegatingMethodAccessorImpl.java:43)
[WARNING] at java.lang.reflect.Method.invoke(Method.java:606)
[WARNING] at com.sun.tools.javadoc.DocletInvoker.invoke(DocletInvoker.java:280)
[WARNING] at com.sun.tools.javadoc.DocletInvoker.start(DocletInvoker.java:160)
[WARNING] at com.sun.tools.javadoc.Start.parseAndExecute(Start.java:397)
[WARNING] at com.sun.tools.javadoc.Start.begin(Start.java:167)
[WARNING] at com.sun.tools.javadoc.Main.execute(Main.java:59)
[WARNING] at com.sun.tools.javadoc.Main.main(Main.java:49)
[WARNING] com.sun.tools.doclets.internal.toolkit.util.DocletAbortException
[WARNING] at com.sun.tools.doclets.formats.html.ClassWriterImpl.addSummaryDetailLinks(ClassWriterImpl.java:581)
[WARNING] at com.sun.tools.doclets.formats.html.HtmlDocletWriter.addNavLinks(HtmlDocletWriter.java:747)
[WARNING] at com.sun.tools.doclets.formats.html.ClassWriterImpl.getHeader(ClassWriterImpl.java:158)
[WARNING] at com.sun.tools.doclets.internal.toolkit.builders.ClassBuilder.buildClassDoc(ClassBuilder.java:142)
[WARNING] at sun.reflect.NativeMethodAccessorImpl.invoke0(Native Method)
[WARNING] at sun.reflect.NativeMethodAccessorImpl.invoke(NativeMethodAccessorImpl.java:57)
[WARNING] at sun.reflect.DelegatingMethodAccessorImpl.invoke(DelegatingMethodAccessorImpl.java:43)
[WARNING] at java.lang.reflect.Method.invoke(Method.java:606)
[WARNING] at com.sun.tools.doclets.internal.toolkit.builders.AbstractBuilder.invokeMethod(AbstractBuilder.java:148)
[WARNING] at com.sun.tools.doclets.internal.toolkit.builders.AbstractBuilder.build(AbstractBuilder.java:103)
[WARNING] at com.sun.tools.doclets.internal.toolkit.builders.ClassBuilder.build(ClassBuilder.java:117)
[WARNING] at com.sun.tools.doclets.formats.html.HtmlDoclet.generateClassFiles(HtmlDoclet.java:186)
[WARNING] at com.sun.tools.doclets.internal.toolkit.AbstractDoclet.generateClassFiles(AbstractDoclet.java:183)
[WARNING] at com.sun.tools.doclets.internal.toolkit.AbstractDoclet.startGeneration(AbstractDoclet.java:125)
[WARNING] at com.sun.tools.doclets.internal.toolkit.AbstractDoclet.start(AbstractDoclet.java:83)
[WARNING] at com.sun.tools.doclets.formats.html.HtmlDoclet.start(HtmlDoclet.java:63)
[WARNING] at com.sun.tools.doclets.standard.Standard.start(Standard.java:39)
[WARNING] at sun.reflect.NativeMethodAccessorImpl.invoke0(Native Method)
[WARNING] at sun.reflect.NativeMethodAccessorImpl.invoke(NativeMethodAccessorImpl.java:57)
[WARNING] at sun.reflect.DelegatingMethodAccessorImpl.invoke(DelegatingMethodAccessorImpl.java:43)
[WARNING] at java.lang.reflect.Method.invoke(Method.java:606)
[WARNING] at com.sun.tools.javadoc.DocletInvoker.invoke(DocletInvoker.java:280)
[WARNING] at com.sun.tools.javadoc.DocletInvoker.start(DocletInvoker.java:160)
[WARNING] at com.sun.tools.javadoc.Start.parseAndExecute(Start.java:397)
[WARNING] at com.sun.tools.javadoc.Start.begin(Start.java:167)
[WARNING] at com.sun.tools.javadoc.Main.execute(Main.java:59)
[WARNING] at com.sun.tools.javadoc.Main.main(Main.java:49)
[INFO] Building jar: <https://builds.apache.org/job/Hadoop-Yarn-trunk/ws/hadoop-yarn-project/hadoop-yarn/hadoop-yarn-server/hadoop-yarn-server-web-proxy/target/hadoop-yarn-server-web-proxy-3.0.0-SNAPSHOT-javadoc.jar>
[INFO] 
[INFO] --- maven-enforcer-plugin:1.3.1:enforce (depcheck) @ hadoop-yarn-server-web-proxy ---
[INFO] 
[INFO] --- maven-checkstyle-plugin:2.15:checkstyle (default-cli) @ hadoop-yarn-server-web-proxy ---
[INFO] ------------------------------------------------------------------------
[INFO] Reactor Summary:
[INFO] 
[INFO] Apache Hadoop YARN ................................ SUCCESS [  4.515 s]
[INFO] Apache Hadoop YARN API ............................ SUCCESS [05:50 min]
[INFO] Apache Hadoop YARN Common ......................... SUCCESS [04:20 min]
[INFO] Apache Hadoop YARN Server ......................... SUCCESS [  0.166 s]
[INFO] Apache Hadoop YARN Server Common .................. SUCCESS [01:30 min]
[INFO] Apache Hadoop YARN NodeManager .................... SUCCESS [11:19 min]
[INFO] Apache Hadoop YARN Web Proxy ...................... FAILURE [ 19.120 s]
[INFO] Apache Hadoop YARN ApplicationHistoryService ...... SKIPPED
[INFO] Apache Hadoop YARN ResourceManager ................ SKIPPED
[INFO] Apache Hadoop YARN Server Tests ................... SKIPPED
[INFO] Apache Hadoop YARN Client ......................... SKIPPED
[INFO] Apache Hadoop YARN SharedCacheManager ............. SKIPPED
[INFO] Apache Hadoop YARN Timeline Plugin Storage ........ SKIPPED
[INFO] Apache Hadoop YARN Applications ................... SKIPPED
[INFO] Apache Hadoop YARN DistributedShell ............... SKIPPED
[INFO] Apache Hadoop YARN Unmanaged Am Launcher .......... SKIPPED
[INFO] Apache Hadoop YARN Site ........................... SKIPPED
[INFO] Apache Hadoop YARN Registry ....................... SKIPPED
[INFO] Apache Hadoop YARN Project ........................ SKIPPED
[INFO] ------------------------------------------------------------------------
[INFO] BUILD FAILURE
[INFO] ------------------------------------------------------------------------
[INFO] Total time: 23:26 min
[INFO] Finished at: 2016-02-25T03:55:57+00:00
[INFO] Final Memory: 85M/958M
[INFO] ------------------------------------------------------------------------
[ERROR] Failed to execute goal org.apache.maven.plugins:maven-checkstyle-plugin:2.15:checkstyle (default-cli) on project hadoop-yarn-server-web-proxy: An error has occurred in Checkstyle report generation. Failed during checkstyle execution: Unable to process configuration file at location: checkstyle/checkstyle.xml: Cannot create file-based resource:invalid block type -> [Help 1]
[ERROR] 
[ERROR] To see the full stack trace of the errors, re-run Maven with the -e switch.
[ERROR] Re-run Maven using the -X switch to enable full debug logging.
[ERROR] 
[ERROR] For more information about the errors and possible solutions, please read the following articles:
[ERROR] [Help 1] http://cwiki.apache.org/confluence/display/MAVEN/MojoExecutionException
[ERROR] 
[ERROR] After correcting the problems, you can resume the build with the command
[ERROR]   mvn <goals> -rf :hadoop-yarn-server-web-proxy
Build step 'Execute shell' marked build as failure
Archiving artifacts
Recording test results

Hadoop-Yarn-trunk - Build # 1817 - Still Failing

Posted by Apache Jenkins Server <je...@builds.apache.org>.
See https://builds.apache.org/job/Hadoop-Yarn-trunk/1817/

###################################################################################
########################## LAST 60 LINES OF THE CONSOLE ###########################
[...truncated 8707 lines...]
[WARNING] at sun.reflect.NativeMethodAccessorImpl.invoke(NativeMethodAccessorImpl.java:57)
[WARNING] at sun.reflect.DelegatingMethodAccessorImpl.invoke(DelegatingMethodAccessorImpl.java:43)
[WARNING] at java.lang.reflect.Method.invoke(Method.java:606)
[WARNING] at com.sun.tools.javadoc.DocletInvoker.invoke(DocletInvoker.java:280)
[WARNING] at com.sun.tools.javadoc.DocletInvoker.start(DocletInvoker.java:160)
[WARNING] at com.sun.tools.javadoc.Start.parseAndExecute(Start.java:397)
[WARNING] at com.sun.tools.javadoc.Start.begin(Start.java:167)
[WARNING] at com.sun.tools.javadoc.Main.execute(Main.java:59)
[WARNING] at com.sun.tools.javadoc.Main.main(Main.java:49)
[INFO] Building jar: /home/jenkins/jenkins-slave/workspace/Hadoop-Yarn-trunk/hadoop-yarn-project/hadoop-yarn/hadoop-yarn-server/hadoop-yarn-server-web-proxy/target/hadoop-yarn-server-web-proxy-3.0.0-SNAPSHOT-javadoc.jar
[INFO] 
[INFO] --- maven-enforcer-plugin:1.3.1:enforce (depcheck) @ hadoop-yarn-server-web-proxy ---
[INFO] 
[INFO] --- maven-checkstyle-plugin:2.15:checkstyle (default-cli) @ hadoop-yarn-server-web-proxy ---
[INFO] ------------------------------------------------------------------------
[INFO] Reactor Summary:
[INFO] 
[INFO] Apache Hadoop YARN ................................ SUCCESS [  4.515 s]
[INFO] Apache Hadoop YARN API ............................ SUCCESS [05:50 min]
[INFO] Apache Hadoop YARN Common ......................... SUCCESS [04:20 min]
[INFO] Apache Hadoop YARN Server ......................... SUCCESS [  0.166 s]
[INFO] Apache Hadoop YARN Server Common .................. SUCCESS [01:30 min]
[INFO] Apache Hadoop YARN NodeManager .................... SUCCESS [11:19 min]
[INFO] Apache Hadoop YARN Web Proxy ...................... FAILURE [ 19.120 s]
[INFO] Apache Hadoop YARN ApplicationHistoryService ...... SKIPPED
[INFO] Apache Hadoop YARN ResourceManager ................ SKIPPED
[INFO] Apache Hadoop YARN Server Tests ................... SKIPPED
[INFO] Apache Hadoop YARN Client ......................... SKIPPED
[INFO] Apache Hadoop YARN SharedCacheManager ............. SKIPPED
[INFO] Apache Hadoop YARN Timeline Plugin Storage ........ SKIPPED
[INFO] Apache Hadoop YARN Applications ................... SKIPPED
[INFO] Apache Hadoop YARN DistributedShell ............... SKIPPED
[INFO] Apache Hadoop YARN Unmanaged Am Launcher .......... SKIPPED
[INFO] Apache Hadoop YARN Site ........................... SKIPPED
[INFO] Apache Hadoop YARN Registry ....................... SKIPPED
[INFO] Apache Hadoop YARN Project ........................ SKIPPED
[INFO] ------------------------------------------------------------------------
[INFO] BUILD FAILURE
[INFO] ------------------------------------------------------------------------
[INFO] Total time: 23:26 min
[INFO] Finished at: 2016-02-25T03:55:57+00:00
[INFO] Final Memory: 85M/958M
[INFO] ------------------------------------------------------------------------
[ERROR] Failed to execute goal org.apache.maven.plugins:maven-checkstyle-plugin:2.15:checkstyle (default-cli) on project hadoop-yarn-server-web-proxy: An error has occurred in Checkstyle report generation. Failed during checkstyle execution: Unable to process configuration file at location: checkstyle/checkstyle.xml: Cannot create file-based resource:invalid block type -> [Help 1]
[ERROR] 
[ERROR] To see the full stack trace of the errors, re-run Maven with the -e switch.
[ERROR] Re-run Maven using the -X switch to enable full debug logging.
[ERROR] 
[ERROR] For more information about the errors and possible solutions, please read the following articles:
[ERROR] [Help 1] http://cwiki.apache.org/confluence/display/MAVEN/MojoExecutionException
[ERROR] 
[ERROR] After correcting the problems, you can resume the build with the command
[ERROR]   mvn <goals> -rf :hadoop-yarn-server-web-proxy
Build step 'Execute shell' marked build as failure
Archiving artifacts
Recording test results
Sending e-mails to: yarn-dev@hadoop.apache.org
Email was triggered for: Failure - Any
Sending email for trigger: Failure - Any



###################################################################################
############################## FAILED TESTS (if any) ##############################
All tests passed