You are viewing a plain text version of this content. The canonical link for it is here.
Posted to notifications@directory.apache.org by Apache Hudson Server <hu...@hudson.apache.org> on 2011/04/01 06:09:42 UTC
Build failed in Jenkins: dir-studio-jdk16-win #202
See <https://hudson.apache.org/hudson/job/dir-studio-jdk16-win/202/changes>
Changes:
[elecharny] o Renamed the DefaultEntryAttribute interface to DefaultAttribute
[elecharny] o Renamed the EntryAttribute interface to Attribute
[pamarcelot] Fixed an NPE in case where the returning attributes is a 'null' object.
[pamarcelot] Removed sysout.
------------------------------------------
[...truncated 3139 lines...]
[INFO] --- maven-clean-plugin:2.4.1:clean (default-clean) @ valueeditors ---
[INFO]
[INFO] --- maven-remote-resources-plugin:1.2:process (default) @ valueeditors ---
[debug] execute contextualize
[INFO]
[INFO] --- maven-resources-plugin:2.5:resources (default-resources) @ valueeditors ---
[INFO] Using 'UTF-8' encoding to copy filtered resources.
[INFO] Copying 4 resources
[INFO] Copying 17 resources to resources
[INFO] Copying 30 resources
[INFO] Copying 3 resources
[WARNING] The artifact org.slf4j:jcl104-over-slf4j:jar:1.5.6 has been relocated to org.slf4j:jcl-over-slf4j:jar:1.5.6
[INFO]
[INFO] --- studio-maven-plugin:1.0.4:prepare-jar-package (default) @ valueeditors ---
[INFO]
[INFO] --- maven-compiler-plugin:2.3.2:compile (default-compile) @ valueeditors ---
[INFO] Compiling 33 source files to C:\hudson\hudson-slave\workspace\dir-studio-jdk16-win\trunk\plugins\valueeditors\target\classes
[INFO]
[INFO] --- maven-bundle-plugin:2.2.0:manifest (default) @ valueeditors ---
[WARNING] Embed-Dependency: clause "*;scope=compile|runtime" did not match any dependencies
[WARNING] Warning in manifest for org.apache.directory.studio:valueeditors:jar:2.0.0-SNAPSHOT : Superfluous export-package instructions: [org.apache.directory.studio.valueeditors.integer.*, org.apache.directory.studio.valueeditors.time.*, org.apache.directory.studio.valueeditors.dn.*, org.apache.directory.studio.valueeditors.image.*, org.apache.directory.studio.valueeditors.objectclass.*, org.apache.directory.studio.valueeditors.password.*, org.apache.directory.studio.valueeditors.address.*]
[WARNING] Warning in manifest for org.apache.directory.studio:valueeditors:jar:2.0.0-SNAPSHOT : Did not find matching referal for !
[INFO] [debug] execute contextualize
[INFO] Using 'UTF-8' encoding to copy filtered resources.
[INFO] --- maven-resources-plugin:2.5:testResources (default-testResources) @ valueeditors ---[INFO] skip non existing resourceDirectory C:\hudson\hudson-slave\workspace\dir-studio-jdk16-win\trunk\plugins\valueeditors\src\test\resources
[INFO] Copying 3 resources
[INFO]
[INFO] --- maven-compiler-plugin:2.3.2:testCompile (default-testCompile) @ valueeditors ---
[INFO] Compiling 3 source files to C:\hudson\hudson-slave\workspace\dir-studio-jdk16-win\trunk\plugins\valueeditors\target\test-classes
[INFO]
[INFO] --- maven-surefire-plugin:2.7.2:test (default-test) @ valueeditors ---
[INFO] Tests are skipped.
[INFO]
[INFO] --- maven-jar-plugin:2.3.1:jar (default-jar) @ valueeditors ---
[INFO] Building jar: C:\hudson\hudson-slave\workspace\dir-studio-jdk16-win\trunk\plugins\valueeditors\target\valueeditors-2.0.0-SNAPSHOT.jar
[INFO]
[INFO] --- tools-maven-plugin:1.4:verify-legal-files (verify-legal-files) @ valueeditors ---
[INFO] Checking legal files in: valueeditors-2.0.0-SNAPSHOT.jar
[INFO]
[INFO] --- apache-rat-plugin:0.7:check (default) @ valueeditors ---
[INFO] Exclude: **/target/**/*
[INFO] Exclude: **/cobertura.ser
[INFO] Exclude: **/.classpath
[INFO] Exclude: **/.project
[INFO] Exclude: **/.settings/**/*
[INFO] Exclude: **/*.iml
[INFO] Exclude: **/*.ipr
[INFO] Exclude: **/*.iws
[INFO] Exclude: **/MANIFEST.MF
[INFO] Exclude: **/dependency-reduced-pom.xml
[INFO] Exclude: **/.gitignore
[INFO] Exclude: **/about.ini
[INFO] Exclude: **/about_files/*
[INFO] Exclude: **/*.log
[INFO] Exclude: **/*.vm
[INFO] Exclude: apacheds.configuration/src/main/resources/org/apache/directory/studio/apacheds/configuration/spring-beans.dtd
[INFO] Exclude: apacheds.configuration.v2/src/main/resources/org/apache/directory/studio/apacheds/configuration/v2/config.ldif
[INFO] Exclude: common.ui/src/main/java/org/apache/directory/studio/common/ui/filesystem/PathEditorInput.java
[INFO] Exclude: ldapbrowser.core/src/main/resources/default_schema.ldif
[INFO] Exclude: rcp/resources/icons/linux/studio.xpm
[INFO] Exclude: schemaeditor/resources/schemas/openldap/*.xml
[INFO]
[INFO] --- maven-install-plugin:2.3.1:install (default-install) @ valueeditors ---[INFO] Installing C:\hudson\hudson-slave\workspace\dir-studio-jdk16-win\trunk\plugins\valueeditors\target\valueeditors-2.0.0-SNAPSHOT.jar to C:\Users\hudson\.m2\repository\org\apache\directory\studio\valueeditors\2.0.0-SNAPSHOT\valueeditors-2.0.0-SNAPSHOT.jar
[INFO] Installing C:\hudson\hudson-slave\workspace\dir-studio-jdk16-win\trunk\plugins\valueeditors\pom.xml to C:\Users\hudson\.m2\repository\org\apache\directory\studio\valueeditors\2.0.0-SNAPSHOT\valueeditors-2.0.0-SNAPSHOT.pom
projectSucceeded org.apache.directory.studio:valueeditors:2.0.0-SNAPSHOT
[JENKINS] Archiving disabled - not archiving C:\hudson\hudson-slave\workspace\dir-studio-jdk16-win\trunk\plugins\valueeditors\pom.xml
[JENKINS] Archiving disabled - not archiving C:\hudson\hudson-slave\workspace\dir-studio-jdk16-win\trunk\plugins\valueeditors\target\valueeditors-2.0.0-SNAPSHOT.jar
[INFO]
[INFO] ------------------------------------------------------------------------
[INFO] Building Apache Directory Studio ACI Item Editor 2.0.0-SNAPSHOT
[INFO] ------------------------------------------------------------------------
[INFO] [INFO] Deleting C:\hudson\hudson-slave\workspace\dir-studio-jdk16-win\trunk\plugins\aciitemeditor\target
[INFO] --- maven-clean-plugin:2.4.1:clean (default-clean) @ aciitemeditor ---
[INFO]
[INFO] --- maven-remote-resources-plugin:1.2:process (default) @ aciitemeditor ---
[INFO] [debug] execute contextualize
[INFO] Using 'UTF-8' encoding to copy filtered resources.
[INFO] Copying 4 resources
[INFO] --- maven-resources-plugin:2.5:resources (default-resources) @ aciitemeditor ---
[INFO] Copying 10 resources to resources
[INFO] Copying 12 resources
[INFO] Copying 3 resources
[WARNING] The artifact org.slf4j:jcl104-over-slf4j:jar:1.5.6 has been relocated to org.slf4j:jcl-over-slf4j:jar:1.5.6
[INFO]
[INFO] --- studio-maven-plugin:1.0.4:prepare-jar-package (default) @ aciitemeditor ---
[INFO] Copying C:\Users\hudson\.m2\repository\antlr\antlr\2.7.7\antlr-2.7.7.jar to
C:\hudson\hudson-slave\workspace\dir-studio-jdk16-win\trunk\plugins\aciitemeditor\target\classes\lib\antlr-2.7.7.jar
[INFO] Copying C:\Users\hudson\.m2\repository\commons-collections\commons-collections\3.2.1\commons-collections-3.2.1.jar to
C:\hudson\hudson-slave\workspace\dir-studio-jdk16-win\trunk\plugins\aciitemeditor\target\classes\lib\commons-collections-3.2.1.jar
[INFO] Copying C:\Users\hudson\.m2\repository\commons-lang\commons-lang\2.6\commons-lang-2.6.jar to
C:\hudson\hudson-slave\workspace\dir-studio-jdk16-win\trunk\plugins\aciitemeditor\target\classes\lib\commons-lang-2.6.jar
[INFO] Copying C:\Users\hudson\.m2\repository\org\apache\mina\mina-core\2.0.2\mina-core-2.0.2.jar to
C:\hudson\hudson-slave\workspace\dir-studio-jdk16-win\trunk\plugins\aciitemeditor\target\classes\lib\mina-core-2.0.2.jar
[INFO] Copying C:\Users\hudson\.m2\repository\org\apache\directory\shared\shared-asn1-api\1.0.0-M3-SNAPSHOT\shared-asn1-api-1.0.0-M3-SNAPSHOT.jar to
C:\hudson\hudson-slave\workspace\dir-studio-jdk16-win\trunk\plugins\aciitemeditor\target\classes\lib\shared-asn1-api-1.0.0-M3-SNAPSHOT.jar
[INFO] Copying C:\Users\hudson\.m2\repository\org\apache\directory\shared\shared-asn1-ber\1.0.0-M3-SNAPSHOT\shared-asn1-ber-1.0.0-M3-SNAPSHOT.jar to
C:\hudson\hudson-slave\workspace\dir-studio-jdk16-win\trunk\plugins\aciitemeditor\target\classes\lib\shared-asn1-ber-1.0.0-M3-SNAPSHOT.jar
[INFO] Copying C:\Users\hudson\.m2\repository\org\apache\directory\shared\shared-i18n\1.0.0-M3-SNAPSHOT\shared-i18n-1.0.0-M3-SNAPSHOT.jar to
C:\hudson\hudson-slave\workspace\dir-studio-jdk16-win\trunk\plugins\aciitemeditor\target\classes\lib\shared-i18n-1.0.0-M3-SNAPSHOT.jar
[INFO] Copying C:\Users\hudson\.m2\repository\org\apache\directory\shared\shared-ldap-extras-aci\1.0.0-M3-SNAPSHOT\shared-ldap-extras-aci-1.0.0-M3-SNAPSHOT.jar to
C:\hudson\hudson-slave\workspace\dir-studio-jdk16-win\trunk\plugins\aciitemeditor\target\classes\lib\shared-ldap-extras-aci-1.0.0-M3-SNAPSHOT.jar
[INFO] Copying C:\Users\hudson\.m2\repository\org\apache\directory\shared\shared-ldap-model\1.0.0-M3-SNAPSHOT\shared-ldap-model-1.0.0-M3-SNAPSHOT.jar to
C:\hudson\hudson-slave\workspace\dir-studio-jdk16-win\trunk\plugins\aciitemeditor\target\classes\lib\shared-ldap-model-1.0.0-M3-SNAPSHOT.jar
[INFO] Copying C:\Users\hudson\.m2\repository\org\apache\directory\shared\shared-util\1.0.0-M3-SNAPSHOT\shared-util-1.0.0-M3-SNAPSHOT.jar to
C:\hudson\hudson-slave\workspace\dir-studio-jdk16-win\trunk\plugins\aciitemeditor\target\classes\lib\shared-util-1.0.0-M3-SNAPSHOT.jar
[INFO] Copying C:\Users\hudson\.m2\repository\org\slf4j\slf4j-api\1.6.1\slf4j-api-1.6.1.jar to
C:\hudson\hudson-slave\workspace\dir-studio-jdk16-win\trunk\plugins\aciitemeditor\target\classes\lib\slf4j-api-1.6.1.jar
[INFO] [INFO] Compiling 49 source files to C:\hudson\hudson-slave\workspace\dir-studio-jdk16-win\trunk\plugins\aciitemeditor\target\classes
[INFO] --- maven-compiler-plugin:2.3.2:compile (default-compile) @ aciitemeditor ---
[INFO] -------------------------------------------------------------
[ERROR] COMPILATION ERROR :
[INFO] -------------------------------------------------------------
[ERROR] \hudson\hudson-slave\workspace\dir-studio-jdk16-win\trunk\plugins\aciitemeditor\src\main\java\org\apache\directory\studio\aciitemeditor\model\ProtectedItemWrapper.java:[227,54] incompatible types
found : java.util.Iterator<org.apache.directory.shared.ldap.model.entry.EntryAttribute>
required: java.util.Iterator<org.apache.directory.shared.ldap.model.entry.Attribute>
[INFO] 1 error
[INFO] -------------------------------------------------------------
mojoFailed org.apache.maven.plugins:maven-compiler-plugin:2.3.2(default-compile)
projectFailed org.apache.directory.studio:aciitemeditor:2.0.0-SNAPSHOT
[JENKINS] Archiving disabled - not archiving C:\hudson\hudson-slave\workspace\dir-studio-jdk16-win\trunk\plugins\aciitemeditor\pom.xml
sessionEnded
[INFO] ------------------------------------------------------------------------
[INFO] Reactor Summary:
[INFO]
[INFO] Apache Directory Studio ........................... SUCCESS [1:13.084s]
[INFO] Apache Directory Studio Repository ................ SUCCESS [4.303s]
[INFO] Apache Directory Studio Libraries Plugins ......... SUCCESS [1.012s]
[INFO] SLF4J API Module (for Apache Directory Studio) .... SUCCESS [23.457s]
[INFO] Ehcache Core (for Apache Directory Studio) ........ SUCCESS [1.965s]
[INFO] AntLR Parser Generator (for Apache Directory Studio) SUCCESS [1.245s]
[INFO] Apache Commons Codec (for Apache Directory Studio) SUCCESS [1.272s]
[INFO] Apache Commons Collections (for Apache Directory Studio) SUCCESS [5.083s]
[INFO] Apache Commons IO (for Apache Directory Studio) ... SUCCESS [0.888s]
[INFO] Apache Commons Lang (for Apache Directory Studio) . SUCCESS [0.926s]
[INFO] Apache Commons Logging (for Apache Directory Studio) SUCCESS [0.881s]
[INFO] Apache Commons Pool (for Apache Directory Studio) . SUCCESS [0.970s]
[INFO] ApacheDS Core Constants (for Apache Directory Studio) SUCCESS [1.282s]
[INFO] ApacheDS I18n (for Apache Directory Studio) ....... SUCCESS [0.810s]
[INFO] ApacheDS Core API (for Apache Directory Studio) ... SUCCESS [4.838s]
[INFO] ApacheDS Core AVL (for Apache Directory Studio) ... SUCCESS [1.068s]
[INFO] ApacheDS Generalized (X) DBM Partition (for Apache Directory Studio) SUCCESS [1.261s]
[INFO] ApacheDS Server Config (for Apache Directory Studio) SUCCESS [1.028s]
[INFO] Legion of the Bouncy Castle Java Cryptography APIs (for Apache Directory Studio) SUCCESS [1.201s]
[INFO] ApacheDS Core (for Apache Directory Studio) ....... SUCCESS [4.631s]
[INFO] ApacheDS LDIF Partition (for Apache Directory Studio) SUCCESS [1.123s]
[INFO] Apache HttpComponents Core (for Apache Directory Studio) SUCCESS [1.049s]
[INFO] Apache HttpComponents Client (for Apache Directory Studio) SUCCESS [0.913s]
[INFO] Log4j (for Apache Directory Studio) ............... SUCCESS [0.783s]
[INFO] Apache MINA Core (for Apache Directory Studio) .... SUCCESS [0.790s]
[INFO] dom4j (for Apache Directory Studio) ............... SUCCESS [4.048s]
[INFO] SLF4J LOG4J-12 Binding (for Apache Directory Studio) SUCCESS [0.828s]
[INFO] XPP3 (for Apache Directory Studio) ................ SUCCESS [0.696s]
[INFO] Apache Directory Studio Plugins ................... SUCCESS [4.200s]
[INFO] Apache Directory Studio Common UI ................. SUCCESS [3.726s]
[INFO] Apache Directory Studio Common Core ............... SUCCESS [1.571s]
[INFO] Apache Directory Studio LDIF Parser ............... SUCCESS [4.419s]
[INFO] Apache Directory Studio Connection Core ........... SUCCESS [7.504s]
[INFO] Apache Directory Studio Connection UI ............. SUCCESS [7.507s]
[INFO] Apache Directory Studio LDAP Browser Core ......... SUCCESS [8.776s]
[INFO] Apache Directory Studio LDAP Browser Common ....... SUCCESS [9.322s]
[INFO] Apache Directory Studio Value Editors ............. SUCCESS [6.528s]
[INFO] Apache Directory Studio ACI Item Editor ........... FAILURE [3.168s]
[INFO] Apache Directory Studio Apache DS Configuration ... SKIPPED
[INFO] Apache Directory Studio Apache DS ................. SKIPPED
[INFO] Apache Directory Studio Apache DS Launcher ........ SKIPPED
[INFO] Apache Directory Studio Apache DS 2.0 Configuration SKIPPED
[INFO] Apache Directory Studio LDIF Editor ............... SKIPPED
[INFO] Apache Directory Studio LDAP Browser UI ........... SKIPPED
[INFO] Apache Directory Studio LDAP Servers .............. SKIPPED
[INFO] Apache Directory Studio ApacheDS 1.5.3 LDAP Server Adapter SKIPPED
[INFO] Apache Directory Studio ApacheDS 1.5.4 LDAP Server Adapter SKIPPED
[INFO] Apache Directory Studio ApacheDS 1.5.5 LDAP Server Adapter SKIPPED
[INFO] Apache Directory Studio ApacheDS 1.5.6 LDAP Server Adapter SKIPPED
[INFO] Apache Directory Studio ApacheDS 1.5.7 LDAP Server Adapter SKIPPED
[INFO] Apache Directory Studio RCP ....................... SKIPPED
[INFO] Apache Directory Studio Schema Editor ............. SKIPPED
[INFO] Apache Directory Studio Apache DS Help ............ SKIPPED
[INFO] Apache Directory Studio Apache DS Configuration Help SKIPPED
[INFO] Apache Directory Studio LDAP Browser Help ......... SKIPPED
[INFO] Apache Directory Studio LDIF Editor Help .......... SKIPPED
[INFO] Apache Directory Studio RCP Help .................. SKIPPED
[INFO] Apache Directory Studio Schema Editor Help ........ SKIPPED
[INFO] Apache Directory Studio Help Plugins .............. SKIPPED
[INFO] Apache Directory Studio Feature Plugins ........... SKIPPED
[INFO] Apache Directory Studio Apache DS Configuration Feature SKIPPED
[INFO] Apache Directory Studio Apache DS Feature ......... SKIPPED
[INFO] Apache Directory Studio LDAP Browser Feature ...... SKIPPED
[INFO] Apache Directory Studio LDIF Editor Feature ....... SKIPPED
[INFO] Apache Directory Studio RCP Feature ............... SKIPPED
[INFO] Apache Directory Studio Schema Editor Feature ..... SKIPPED
[INFO] ------------------------------------------------------------------------
[INFO] BUILD FAILURE
[INFO] ------------------------------------------------------------------------
[INFO] Total time: 3:23.482s
[INFO] Finished at: Fri Apr 01 05:09:37 BST 2011
[INFO] Final Memory: 158M/287M
[INFO] ------------------------------------------------------------------------
mavenExecutionResult exceptions not empty
org.apache.maven.lifecycle.LifecycleExecutionException: Failed to execute goal org.apache.maven.plugins:maven-compiler-plugin:2.3.2:compile (default-compile) on project aciitemeditor: Compilation failure
\hudson\hudson-slave\workspace\dir-studio-jdk16-win\trunk\plugins\aciitemeditor\src\main\java\org\apache\directory\studio\aciitemeditor\model\ProtectedItemWrapper.java:[227,54] incompatible types
found : java.util.Iterator<org.apache.directory.shared.ldap.model.entry.EntryAttribute>
required: java.util.Iterator<org.apache.directory.shared.ldap.model.entry.Attribute>
at org.apache.maven.lifecycle.internal.MojoExecutor.execute(MojoExecutor.java:213)
at org.apache.maven.lifecycle.internal.MojoExecutor.execute(MojoExecutor.java:153)
at org.apache.maven.lifecycle.internal.MojoExecutor.execute(MojoExecutor.java:145)
at org.apache.maven.lifecycle.internal.LifecycleModuleBuilder.buildProject(LifecycleModuleBuilder.java:84)
at org.apache.maven.lifecycle.internal.LifecycleModuleBuilder.buildProject(LifecycleModuleBuilder.java:59)
at org.apache.maven.lifecycle.internal.LifecycleStarter.singleThreadedBuild(LifecycleStarter.java:183)
at org.apache.maven.lifecycle.internal.LifecycleStarter.execute(LifecycleStarter.java:161)
at org.apache.maven.DefaultMaven.doExecute(DefaultMaven.java:319)
at org.apache.maven.DefaultMaven.execute(DefaultMaven.java:156)
at org.jvnet.hudson.maven3.launcher.Maven3Launcher.main(Maven3Launcher.java:79)
at sun.reflect.NativeMethodAccessorImpl.invoke0(Native Method)
at sun.reflect.NativeMethodAccessorImpl.invoke(NativeMethodAccessorImpl.java:39)
at sun.reflect.DelegatingMethodAccessorImpl.invoke(DelegatingMethodAccessorImpl.java:25)
at java.lang.reflect.Method.invoke(Method.java:597)
at org.codehaus.plexus.classworlds.launcher.Launcher.launchStandard(Launcher.java:329)
at org.codehaus.plexus.classworlds.launcher.Launcher.launch(Launcher.java:239)
at org.jvnet.hudson.maven3.agent.Maven3Main.launch(Maven3Main.java:146)
at hudson.maven.Maven3Builder.call(Maven3Builder.java:124)
at hudson.maven.Maven3Builder.call(Maven3Builder.java:71)
at hudson.remoting.UserRequest.perform(UserRequest.java:114)
at hudson.remoting.UserRequest.perform(UserRequest.java:48)
at hudson.remoting.Request$2.run(Request.java:270)
at java.util.concurrent.Executors$RunnableAdapter.call(Executors.java:441)
at java.util.concurrent.FutureTask$Sync.innerRun(FutureTask.java:303)
at java.util.concurrent.FutureTask.run(FutureTask.java:138)
at java.util.concurrent.ThreadPoolExecutor$Worker.runTask(ThreadPoolExecutor.java:886)
at java.util.concurrent.ThreadPoolExecutor$Worker.run(ThreadPoolExecutor.java:908)
at java.lang.Thread.run(Thread.java:619)
Caused by: org.apache.maven.plugin.CompilationFailureException: Compilation failure
\hudson\hudson-slave\workspace\dir-studio-jdk16-win\trunk\plugins\aciitemeditor\src\main\java\org\apache\directory\studio\aciitemeditor\model\ProtectedItemWrapper.java:[227,54] incompatible types
found : java.util.Iterator<org.apache.directory.shared.ldap.model.entry.EntryAttribute>
required: java.util.Iterator<org.apache.directory.shared.ldap.model.entry.Attribute>
at org.apache.maven.plugin.AbstractCompilerMojo.execute(AbstractCompilerMojo.java:656)
at org.apache.maven.plugin.CompilerMojo.execute(CompilerMojo.java:128)
at org.apache.maven.plugin.DefaultBuildPluginManager.executeMojo(DefaultBuildPluginManager.java:107)
at org.apache.maven.lifecycle.internal.MojoExecutor.execute(MojoExecutor.java:209)
... 27 more
Sending e-mails to: notifications@directory.apache.org
channel stopped
Jenkins build is back to normal : dir-studio-jdk16-win #203
Posted by Apache Hudson Server <hu...@hudson.apache.org>.
See <https://hudson.apache.org/hudson/job/dir-studio-jdk16-win/203/>