You are viewing a plain text version of this content. The canonical link for it is here.
Posted to dev@zookeeper.apache.org by Apache Jenkins Server <je...@builds.apache.org> on 2016/05/03 02:08:54 UTC

ZooKeeper_branch35_jdk8 - Build # 69 - Still Failing

See https://builds.apache.org/job/ZooKeeper_branch35_jdk8/69/

###################################################################################
########################## LAST 60 LINES OF THE CONSOLE ###########################
[...truncated 386113 lines...]
    [junit] 2016-05-03 00:08:53,936 [myid:] - INFO  [main:ClientBase@460] - STARTING server
    [junit] 2016-05-03 00:08:53,936 [myid:] - INFO  [main:ClientBase@380] - CREATING server instance 127.0.0.1:11222
    [junit] 2016-05-03 00:08:53,937 [myid:] - INFO  [main:NIOServerCnxnFactory@673] - Configuring NIO connection handler with 10s sessionless connection timeout, 3 selector thread(s), 48 worker threads, and 64 kB direct buffers.
    [junit] 2016-05-03 00:08:53,937 [myid:] - INFO  [main:NIOServerCnxnFactory@686] - binding to port 0.0.0.0/0.0.0.0:11222
    [junit] 2016-05-03 00:08:53,938 [myid:] - INFO  [main:ClientBase@355] - STARTING server instance 127.0.0.1:11222
    [junit] 2016-05-03 00:08:53,938 [myid:] - INFO  [main:ZooKeeperServer@858] - minSessionTimeout set to 6000
    [junit] 2016-05-03 00:08:53,938 [myid:] - INFO  [main:ZooKeeperServer@867] - maxSessionTimeout set to 60000
    [junit] 2016-05-03 00:08:53,938 [myid:] - INFO  [main:ZooKeeperServer@156] - Created server with tickTime 3000 minSessionTimeout 6000 maxSessionTimeout 60000 datadir /x1/jenkins/jenkins-slave/workspace/ZooKeeper_branch35_jdk8/branch-3.5/build/test/tmp/test3891226717827575646.junit.dir/version-2 snapdir /x1/jenkins/jenkins-slave/workspace/ZooKeeper_branch35_jdk8/branch-3.5/build/test/tmp/test3891226717827575646.junit.dir/version-2
    [junit] 2016-05-03 00:08:53,940 [myid:] - INFO  [main:FileSnap@83] - Reading snapshot /x1/jenkins/jenkins-slave/workspace/ZooKeeper_branch35_jdk8/branch-3.5/build/test/tmp/test3891226717827575646.junit.dir/version-2/snapshot.b
    [junit] 2016-05-03 00:08:53,942 [myid:] - INFO  [main:FileTxnSnapLog@298] - Snapshotting: 0xb to /x1/jenkins/jenkins-slave/workspace/ZooKeeper_branch35_jdk8/branch-3.5/build/test/tmp/test3891226717827575646.junit.dir/version-2/snapshot.b
    [junit] 2016-05-03 00:08:53,945 [myid:] - INFO  [main:FourLetterWordMain@85] - connecting to 127.0.0.1 11222
    [junit] 2016-05-03 00:08:53,946 [myid:] - INFO  [NIOServerCxnFactory.AcceptThread:0.0.0.0/0.0.0.0:11222:NIOServerCnxnFactory$AcceptThread@296] - Accepted socket connection from /127.0.0.1:41514
    [junit] 2016-05-03 00:08:53,946 [myid:] - INFO  [NIOWorkerThread-1:NIOServerCnxn@485] - Processing stat command from /127.0.0.1:41514
    [junit] 2016-05-03 00:08:53,947 [myid:] - INFO  [NIOWorkerThread-1:StatCommand@49] - Stat command output
    [junit] 2016-05-03 00:08:53,947 [myid:] - INFO  [NIOWorkerThread-1:NIOServerCnxn@607] - Closed socket connection for client /127.0.0.1:41514 (no session established for client)
    [junit] 2016-05-03 00:08:53,947 [myid:] - INFO  [main:JMXEnv@228] - ensureParent:[InMemoryDataTree, StandaloneServer_port]
    [junit] 2016-05-03 00:08:53,949 [myid:] - INFO  [main:JMXEnv@245] - expect:InMemoryDataTree
    [junit] 2016-05-03 00:08:53,949 [myid:] - INFO  [main:JMXEnv@249] - found:InMemoryDataTree org.apache.ZooKeeperService:name0=StandaloneServer_port11222,name1=InMemoryDataTree
    [junit] 2016-05-03 00:08:53,950 [myid:] - INFO  [main:JMXEnv@245] - expect:StandaloneServer_port
    [junit] 2016-05-03 00:08:53,950 [myid:] - INFO  [main:JMXEnv@249] - found:StandaloneServer_port org.apache.ZooKeeperService:name0=StandaloneServer_port11222
    [junit] 2016-05-03 00:08:53,950 [myid:] - INFO  [main:JUnit4ZKTestRunner$LoggedInvokeMethod@82] - Memory used 50141
    [junit] 2016-05-03 00:08:53,951 [myid:] - INFO  [main:JUnit4ZKTestRunner$LoggedInvokeMethod@87] - Number of threads 25
    [junit] 2016-05-03 00:08:53,951 [myid:] - INFO  [main:JUnit4ZKTestRunner$LoggedInvokeMethod@102] - FINISHED TEST METHOD testQuota
    [junit] 2016-05-03 00:08:53,951 [myid:] - INFO  [main:ClientBase@537] - tearDown starting
    [junit] 2016-05-03 00:08:54,001 [myid:] - INFO  [main:ZooKeeper@1313] - Session: 0x1004d9f499d0000 closed
    [junit] 2016-05-03 00:08:54,001 [myid:] - INFO  [main:ClientBase@507] - STOPPING server
    [junit] 2016-05-03 00:08:54,001 [myid:] - INFO  [main-EventThread:ClientCnxn$EventThread@513] - EventThread shut down for session: 0x1004d9f499d0000
    [junit] 2016-05-03 00:08:54,002 [myid:] - INFO  [ConnnectionExpirer:NIOServerCnxnFactory$ConnectionExpirerThread@583] - ConnnectionExpirerThread interrupted
    [junit] 2016-05-03 00:08:54,002 [myid:] - INFO  [NIOServerCxnFactory.SelectorThread-0:NIOServerCnxnFactory$SelectorThread@420] - selector thread exitted run method
    [junit] 2016-05-03 00:08:54,002 [myid:] - INFO  [NIOServerCxnFactory.SelectorThread-1:NIOServerCnxnFactory$SelectorThread@420] - selector thread exitted run method
    [junit] 2016-05-03 00:08:54,002 [myid:] - INFO  [NIOServerCxnFactory.AcceptThread:0.0.0.0/0.0.0.0:11222:NIOServerCnxnFactory$AcceptThread@219] - accept thread exitted run method
    [junit] 2016-05-03 00:08:54,002 [myid:] - INFO  [NIOServerCxnFactory.SelectorThread-2:NIOServerCnxnFactory$SelectorThread@420] - selector thread exitted run method
    [junit] 2016-05-03 00:08:54,003 [myid:] - INFO  [main:ZooKeeperServer@498] - shutting down
    [junit] 2016-05-03 00:08:54,003 [myid:] - INFO  [main:SessionTrackerImpl@232] - Shutting down
    [junit] 2016-05-03 00:08:54,003 [myid:] - INFO  [main:PrepRequestProcessor@965] - Shutting down
    [junit] 2016-05-03 00:08:54,003 [myid:] - INFO  [main:SyncRequestProcessor@191] - Shutting down
    [junit] 2016-05-03 00:08:54,003 [myid:] - INFO  [ProcessThread(sid:0 cport:11222)::PrepRequestProcessor@154] - PrepRequestProcessor exited loop!
    [junit] 2016-05-03 00:08:54,003 [myid:] - INFO  [SyncThread:0:SyncRequestProcessor@169] - SyncRequestProcessor exited!
    [junit] 2016-05-03 00:08:54,004 [myid:] - INFO  [main:FinalRequestProcessor@479] - shutdown of request processor complete
    [junit] 2016-05-03 00:08:54,004 [myid:] - INFO  [main:MBeanRegistry@128] - Unregister MBean [org.apache.ZooKeeperService:name0=StandaloneServer_port11222,name1=InMemoryDataTree]
    [junit] 2016-05-03 00:08:54,004 [myid:] - INFO  [main:MBeanRegistry@128] - Unregister MBean [org.apache.ZooKeeperService:name0=StandaloneServer_port11222]
    [junit] 2016-05-03 00:08:54,005 [myid:] - INFO  [main:FourLetterWordMain@85] - connecting to 127.0.0.1 11222
    [junit] 2016-05-03 00:08:54,005 [myid:] - INFO  [main:JMXEnv@146] - ensureOnly:[]
    [junit] 2016-05-03 00:08:54,010 [myid:] - INFO  [main:ClientBase@562] - fdcount after test is: 50 at start it was 35
    [junit] 2016-05-03 00:08:54,010 [myid:] - INFO  [main:ClientBase@564] - sleeping for 20 secs
    [junit] 2016-05-03 00:08:54,011 [myid:] - INFO  [main:ZKTestCase$1@65] - SUCCEEDED testQuota
    [junit] 2016-05-03 00:08:54,012 [myid:] - INFO  [main:ZKTestCase$1@60] - FINISHED testQuota
    [junit] Tests run: 1, Failures: 0, Errors: 0, Time elapsed: 1.057 sec

BUILD FAILED
/x1/jenkins/jenkins-slave/workspace/ZooKeeper_branch35_jdk8/branch-3.5/build.xml:1322: The following error occurred while executing this line:
/x1/jenkins/jenkins-slave/workspace/ZooKeeper_branch35_jdk8/branch-3.5/build.xml:1233: Tests failed!

Total time: 60 minutes 56 seconds
Build step 'Invoke Ant' marked build as failure
Archiving artifacts
Recording test results
Email was triggered for: Failure - Any
Sending email for trigger: Failure - Any



###################################################################################
############################## FAILED TESTS (if any) ##############################
1 tests failed.
FAILED:  org.apache.zookeeper.server.ZxidRolloverTest.testRolloverThenLeaderRestart

Error Message:
KeeperErrorCode = Session expired for /foofoofoo-connected

Stack Trace:
org.apache.zookeeper.KeeperException$SessionExpiredException: KeeperErrorCode = Session expired for /foofoofoo-connected
	at org.apache.zookeeper.KeeperException.create(KeeperException.java:131)
	at org.apache.zookeeper.KeeperException.create(KeeperException.java:51)
	at org.apache.zookeeper.ZooKeeper.exists(ZooKeeper.java:1846)
	at org.apache.zookeeper.ZooKeeper.exists(ZooKeeper.java:1874)
	at org.apache.zookeeper.server.ZxidRolloverTest.checkClientConnected(ZxidRolloverTest.java:105)
	at org.apache.zookeeper.server.ZxidRolloverTest.checkClientsConnected(ZxidRolloverTest.java:90)
	at org.apache.zookeeper.server.ZxidRolloverTest.start(ZxidRolloverTest.java:165)
	at org.apache.zookeeper.server.ZxidRolloverTest.testRolloverThenLeaderRestart(ZxidRolloverTest.java:389)
	at org.apache.zookeeper.JUnit4ZKTestRunner$LoggedInvokeMethod.evaluate(JUnit4ZKTestRunner.java:79)



ZooKeeper_branch35_jdk8 - Build # 70 - Still Failing

Posted by Apache Jenkins Server <je...@builds.apache.org>.
See https://builds.apache.org/job/ZooKeeper_branch35_jdk8/70/

###################################################################################
########################## LAST 60 LINES OF THE CONSOLE ###########################
[...truncated 386692 lines...]
    [junit] 2016-05-03 12:14:13,065 [myid:] - INFO  [main:QuorumUtil@259] - Waiting for QuorumPeer[myid=5](plain=/127.0.0.1:22135)(secure=disabled) to exit thread
    [junit] 2016-05-03 12:14:13,065 [myid:] - INFO  [main:FourLetterWordMain@85] - connecting to 127.0.0.1 22123
    [junit] 2016-05-03 12:14:13,065 [myid:] - INFO  [main:QuorumUtil@243] - 127.0.0.1:22123 is no longer accepting client connections
    [junit] 2016-05-03 12:14:13,065 [myid:] - INFO  [main:FourLetterWordMain@85] - connecting to 127.0.0.1 22126
    [junit] 2016-05-03 12:14:13,065 [myid:] - INFO  [main:QuorumUtil@243] - 127.0.0.1:22126 is no longer accepting client connections
    [junit] 2016-05-03 12:14:13,066 [myid:] - INFO  [main:FourLetterWordMain@85] - connecting to 127.0.0.1 22129
    [junit] 2016-05-03 12:14:13,066 [myid:] - INFO  [main:QuorumUtil@243] - 127.0.0.1:22129 is no longer accepting client connections
    [junit] 2016-05-03 12:14:13,066 [myid:] - INFO  [main:FourLetterWordMain@85] - connecting to 127.0.0.1 22132
    [junit] 2016-05-03 12:14:13,066 [myid:] - INFO  [main:QuorumUtil@243] - 127.0.0.1:22132 is no longer accepting client connections
    [junit] 2016-05-03 12:14:13,066 [myid:] - INFO  [main:FourLetterWordMain@85] - connecting to 127.0.0.1 22135
    [junit] 2016-05-03 12:14:13,066 [myid:] - INFO  [main:QuorumUtil@243] - 127.0.0.1:22135 is no longer accepting client connections
    [junit] 2016-05-03 12:14:13,068 [myid:] - INFO  [main:ZKTestCase$1@65] - SUCCEEDED testRemoveOneAsynchronous
    [junit] 2016-05-03 12:14:13,069 [myid:] - INFO  [main:ZKTestCase$1@60] - FINISHED testRemoveOneAsynchronous
    [junit] Tests run: 11, Failures: 0, Errors: 0, Skipped: 0, Time elapsed: 136.347 sec, Thread: 5, Class: org.apache.zookeeper.test.ReconfigTest
    [junit] 2016-05-03 12:14:59,525 [myid:] - INFO  [main:JUnit4ZKTestRunner$LoggedInvokeMethod@82] - Memory used 134317
    [junit] 2016-05-03 12:14:59,526 [myid:] - INFO  [main:JUnit4ZKTestRunner$LoggedInvokeMethod@87] - Number of threads 55
    [junit] 2016-05-03 12:14:59,526 [myid:] - INFO  [main:JUnit4ZKTestRunner$LoggedInvokeMethod@102] - FINISHED TEST METHOD testManyChildWatchersAutoReset
    [junit] 2016-05-03 12:14:59,526 [myid:] - INFO  [main:ClientBase@537] - tearDown starting
    [junit] 2016-05-03 12:14:59,527 [myid:] - INFO  [ProcessThread(sid:0 cport:30076)::PrepRequestProcessor@647] - Processed session termination for sessionid: 0x10285e112f50000
    [junit] 2016-05-03 12:14:59,534 [myid:] - INFO  [main:ZooKeeper@1313] - Session: 0x10285e112f50000 closed
    [junit] 2016-05-03 12:14:59,535 [myid:] - INFO  [main-EventThread:ClientCnxn$EventThread@513] - EventThread shut down for session: 0x10285e112f50000
    [junit] 2016-05-03 12:14:59,535 [myid:] - INFO  [NIOWorkerThread-20:MBeanRegistry@128] - Unregister MBean [org.apache.ZooKeeperService:name0=StandaloneServer_port30076,name1=Connections,name2=127.0.0.1,name3=0x10285e112f50000]
    [junit] 2016-05-03 12:14:59,536 [myid:] - INFO  [ProcessThread(sid:0 cport:30076)::PrepRequestProcessor@647] - Processed session termination for sessionid: 0x10285e112f50001
    [junit] 2016-05-03 12:14:59,536 [myid:] - INFO  [NIOWorkerThread-20:NIOServerCnxn@607] - Closed socket connection for client /127.0.0.1:36129 which had sessionid 0x10285e112f50000
    [junit] 2016-05-03 12:14:59,542 [myid:] - INFO  [main:ZooKeeper@1313] - Session: 0x10285e112f50001 closed
    [junit] 2016-05-03 12:14:59,542 [myid:] - INFO  [NIOWorkerThread-29:MBeanRegistry@128] - Unregister MBean [org.apache.ZooKeeperService:name0=StandaloneServer_port30076,name1=Connections,name2=127.0.0.1,name3=0x10285e112f50001]
    [junit] 2016-05-03 12:14:59,543 [myid:] - INFO  [main-EventThread:ClientCnxn$EventThread@513] - EventThread shut down for session: 0x10285e112f50001
    [junit] 2016-05-03 12:14:59,543 [myid:] - INFO  [main:ClientBase@507] - STOPPING server
    [junit] 2016-05-03 12:14:59,543 [myid:] - INFO  [NIOWorkerThread-29:NIOServerCnxn@607] - Closed socket connection for client /127.0.0.1:36132 which had sessionid 0x10285e112f50001
    [junit] 2016-05-03 12:14:59,544 [myid:] - INFO  [ConnnectionExpirer:NIOServerCnxnFactory$ConnectionExpirerThread@583] - ConnnectionExpirerThread interrupted
    [junit] 2016-05-03 12:14:59,545 [myid:] - INFO  [NIOServerCxnFactory.SelectorThread-1:NIOServerCnxnFactory$SelectorThread@420] - selector thread exitted run method
    [junit] 2016-05-03 12:14:59,546 [myid:] - INFO  [NIOServerCxnFactory.SelectorThread-0:NIOServerCnxnFactory$SelectorThread@420] - selector thread exitted run method
    [junit] 2016-05-03 12:14:59,546 [myid:] - INFO  [NIOServerCxnFactory.AcceptThread:0.0.0.0/0.0.0.0:30076:NIOServerCnxnFactory$AcceptThread@219] - accept thread exitted run method
    [junit] 2016-05-03 12:14:59,548 [myid:] - INFO  [main:ZooKeeperServer@498] - shutting down
    [junit] 2016-05-03 12:14:59,548 [myid:] - INFO  [main:SessionTrackerImpl@232] - Shutting down
    [junit] 2016-05-03 12:14:59,548 [myid:] - INFO  [main:PrepRequestProcessor@965] - Shutting down
    [junit] 2016-05-03 12:14:59,548 [myid:] - INFO  [main:SyncRequestProcessor@191] - Shutting down
    [junit] 2016-05-03 12:14:59,549 [myid:] - INFO  [SyncThread:0:SyncRequestProcessor@169] - SyncRequestProcessor exited!
    [junit] 2016-05-03 12:14:59,549 [myid:] - INFO  [ProcessThread(sid:0 cport:30076)::PrepRequestProcessor@154] - PrepRequestProcessor exited loop!
    [junit] 2016-05-03 12:14:59,549 [myid:] - INFO  [main:FinalRequestProcessor@479] - shutdown of request processor complete
    [junit] 2016-05-03 12:14:59,549 [myid:] - INFO  [main:MBeanRegistry@128] - Unregister MBean [org.apache.ZooKeeperService:name0=StandaloneServer_port30076,name1=InMemoryDataTree]
    [junit] 2016-05-03 12:14:59,549 [myid:] - INFO  [main:MBeanRegistry@128] - Unregister MBean [org.apache.ZooKeeperService:name0=StandaloneServer_port30076]
    [junit] 2016-05-03 12:14:59,551 [myid:] - INFO  [main:FourLetterWordMain@85] - connecting to 127.0.0.1 30076
    [junit] 2016-05-03 12:14:59,552 [myid:] - INFO  [main:JMXEnv@146] - ensureOnly:[]
    [junit] 2016-05-03 12:14:59,558 [myid:] - INFO  [main:ClientBase@562] - fdcount after test is: 53 at start it was 53
    [junit] 2016-05-03 12:14:59,558 [myid:] - INFO  [main:ZKTestCase$1@65] - SUCCEEDED testManyChildWatchersAutoReset
    [junit] 2016-05-03 12:14:59,558 [myid:] - INFO  [main:ZKTestCase$1@60] - FINISHED testManyChildWatchersAutoReset
    [junit] Tests run: 4, Failures: 0, Errors: 0, Skipped: 0, Time elapsed: 414.817 sec, Thread: 8, Class: org.apache.zookeeper.test.DisconnectedWatcherTest

BUILD FAILED
/home/jenkins/jenkins-slave/workspace/ZooKeeper_branch35_jdk8/branch-3.5/build.xml:1322: The following error occurred while executing this line:
/home/jenkins/jenkins-slave/workspace/ZooKeeper_branch35_jdk8/branch-3.5/build.xml:1207: Tests failed!

Total time: 10 minutes 2 seconds
Build step 'Invoke Ant' marked build as failure
Archiving artifacts
Recording test results
Email was triggered for: Failure - Any
Sending email for trigger: Failure - Any



###################################################################################
############################## FAILED TESTS (if any) ##############################
1 tests failed.
FAILED:  org.apache.zookeeper.test.AsyncHammerTest.testHammer

Error Message:
null

Stack Trace:
junit.framework.AssertionFailedError
	at org.apache.zookeeper.test.AsyncHammerTest.testHammer(AsyncHammerTest.java:186)
	at org.apache.zookeeper.JUnit4ZKTestRunner$LoggedInvokeMethod.evaluate(JUnit4ZKTestRunner.java:79)