You are viewing a plain text version of this content. The canonical link for it is here.
Posted to yarn-dev@hadoop.apache.org by Apache Jenkins Server <je...@builds.apache.org> on 2016/05/05 19:30:39 UTC
Hadoop-Yarn-trunk-Java8 - Build # 1397 - Failure
See https://builds.apache.org/job/Hadoop-Yarn-trunk-Java8/1397/
###################################################################################
########################## LAST 60 LINES OF THE CONSOLE ###########################
[...truncated 5329 lines...]
Results :
Failed tests:
TestContainerResourceUsage.testUsageAfterAMRestartWithMultipleContainers:252->amRestartTests:395 Unexcpected MemorySeconds value expected:<-1497575224306> but was:<1305>
Tests in error:
TestFairSchedulerConfiguration.testParseResourceConfigValue:34 ExceptionInInitializer
Tests run: 1380, Failures: 1, Errors: 1, Skipped: 3
[INFO] ------------------------------------------------------------------------
[INFO] Reactor Summary:
[INFO]
[INFO] Apache Hadoop YARN ................................ SUCCESS [ 3.146 s]
[INFO] Apache Hadoop YARN API ............................ SUCCESS [01:27 min]
[INFO] Apache Hadoop YARN Common ......................... SUCCESS [02:41 min]
[INFO] Apache Hadoop YARN Server ......................... SUCCESS [ 0.053 s]
[INFO] Apache Hadoop YARN Server Common .................. SUCCESS [ 33.021 s]
[INFO] Apache Hadoop YARN NodeManager .................... SUCCESS [12:12 min]
[INFO] Apache Hadoop YARN Web Proxy ...................... SUCCESS [ 18.515 s]
[INFO] Apache Hadoop YARN ApplicationHistoryService ...... SUCCESS [03:23 min]
[INFO] Apache Hadoop YARN ResourceManager ................ FAILURE [31:40 min]
[INFO] Apache Hadoop YARN Server Tests ................... SKIPPED
[INFO] Apache Hadoop YARN Client ......................... SKIPPED
[INFO] Apache Hadoop YARN SharedCacheManager ............. SKIPPED
[INFO] Apache Hadoop YARN Timeline Plugin Storage ........ SKIPPED
[INFO] Apache Hadoop YARN Applications ................... SKIPPED
[INFO] Apache Hadoop YARN DistributedShell ............... SKIPPED
[INFO] Apache Hadoop YARN Unmanaged Am Launcher .......... SKIPPED
[INFO] Apache Hadoop YARN Site ........................... SKIPPED
[INFO] Apache Hadoop YARN Registry ....................... SKIPPED
[INFO] Apache Hadoop YARN Project ........................ SKIPPED
[INFO] ------------------------------------------------------------------------
[INFO] BUILD FAILURE
[INFO] ------------------------------------------------------------------------
[INFO] Total time: 52:22 min
[INFO] Finished at: 2016-05-05T19:30:34+00:00
[INFO] Final Memory: 86M/1090M
[INFO] ------------------------------------------------------------------------
[ERROR] Failed to execute goal org.apache.maven.plugins:maven-surefire-plugin:2.17:test (default-test) on project hadoop-yarn-server-resourcemanager: There are test failures.
[ERROR]
[ERROR] Please refer to /home/jenkins/jenkins-slave/workspace/Hadoop-Yarn-trunk-Java8/hadoop-yarn-project/hadoop-yarn/hadoop-yarn-server/hadoop-yarn-server-resourcemanager/target/surefire-reports for the individual test results.
[ERROR] -> [Help 1]
[ERROR]
[ERROR] To see the full stack trace of the errors, re-run Maven with the -e switch.
[ERROR] Re-run Maven using the -X switch to enable full debug logging.
[ERROR]
[ERROR] For more information about the errors and possible solutions, please read the following articles:
[ERROR] [Help 1] http://cwiki.apache.org/confluence/display/MAVEN/MojoFailureException
[ERROR]
[ERROR] After correcting the problems, you can resume the build with the command
[ERROR] mvn <goals> -rf :hadoop-yarn-server-resourcemanager
Build step 'Execute shell' marked build as failure
Archiving artifacts
Recording test results
Sending e-mails to: yarn-dev@hadoop.apache.org
Email was triggered for: Failure - Any
Sending email for trigger: Failure - Any
###################################################################################
############################## FAILED TESTS (if any) ##############################
2 tests failed.
FAILED: org.apache.hadoop.yarn.server.resourcemanager.TestContainerResourceUsage.testUsageAfterAMRestartWithMultipleContainers
Error Message:
Unexcpected MemorySeconds value expected:<-1497575224306> but was:<1305>
Stack Trace:
java.lang.AssertionError: Unexcpected MemorySeconds value expected:<-1497575224306> but was:<1305>
at org.junit.Assert.fail(Assert.java:88)
at org.junit.Assert.failNotEquals(Assert.java:743)
at org.junit.Assert.assertEquals(Assert.java:118)
at org.junit.Assert.assertEquals(Assert.java:555)
at org.apache.hadoop.yarn.server.resourcemanager.TestContainerResourceUsage.amRestartTests(TestContainerResourceUsage.java:395)
at org.apache.hadoop.yarn.server.resourcemanager.TestContainerResourceUsage.testUsageAfterAMRestartWithMultipleContainers(TestContainerResourceUsage.java:252)
FAILED: org.apache.hadoop.yarn.server.resourcemanager.scheduler.fair.TestFairSchedulerConfiguration.testParseResourceConfigValue
Error Message:
null
Stack Trace:
java.lang.ExceptionInInitializerError: null
at org.apache.xerces.parsers.DOMParser.parse(Unknown Source)
at org.apache.xerces.jaxp.DocumentBuilderImpl.parse(Unknown Source)
at javax.xml.parsers.DocumentBuilder.parse(DocumentBuilder.java:150)
at org.apache.hadoop.conf.Configuration.parse(Configuration.java:2568)
at org.apache.hadoop.conf.Configuration.parse(Configuration.java:2556)
at org.apache.hadoop.conf.Configuration.loadResource(Configuration.java:2627)
at org.apache.hadoop.conf.Configuration.loadResources(Configuration.java:2580)
at org.apache.hadoop.conf.Configuration.getProps(Configuration.java:2484)
at org.apache.hadoop.conf.Configuration.get(Configuration.java:1296)
at org.apache.hadoop.yarn.factory.providers.RecordFactoryProvider.getRecordFactory(RecordFactoryProvider.java:49)
at org.apache.hadoop.yarn.server.utils.BuilderUtils.<clinit>(BuilderUtils.java:79)
at org.apache.hadoop.yarn.server.resourcemanager.scheduler.fair.TestFairSchedulerConfiguration.testParseResourceConfigValue(TestFairSchedulerConfiguration.java:34)