You are viewing a plain text version of this content. The canonical link for it is here.
Posted to dev@lucene.apache.org by Apache Jenkins Server <je...@builds.apache.org> on 2018/06/18 14:20:01 UTC
[JENKINS] Lucene-Solr-Tests-7.4 - Build # 9 - Still Unstable
Build: https://builds.apache.org/job/Lucene-Solr-Tests-7.4/9/
3 tests failed.
FAILED: org.apache.solr.cloud.MoveReplicaHDFSFailoverTest.testOldReplicaIsDeletedInRaceCondition
Error Message:
Error from server at http://127.0.0.1:33198/solr: Could not fully remove collection: movereplicatest_coll4
Stack Trace:
org.apache.solr.client.solrj.impl.HttpSolrClient$RemoteSolrException: Error from server at http://127.0.0.1:33198/solr: Could not fully remove collection: movereplicatest_coll4
at __randomizedtesting.SeedInfo.seed([37FC3E715740A296:3DACB1079740C337]:0)
at org.apache.solr.client.solrj.impl.HttpSolrClient.executeMethod(HttpSolrClient.java:643)
at org.apache.solr.client.solrj.impl.HttpSolrClient.request(HttpSolrClient.java:255)
at org.apache.solr.client.solrj.impl.HttpSolrClient.request(HttpSolrClient.java:244)
at org.apache.solr.client.solrj.impl.LBHttpSolrClient.doRequest(LBHttpSolrClient.java:483)
at org.apache.solr.client.solrj.impl.LBHttpSolrClient.request(LBHttpSolrClient.java:413)
at org.apache.solr.client.solrj.impl.CloudSolrClient.sendRequest(CloudSolrClient.java:1106)
at org.apache.solr.client.solrj.impl.CloudSolrClient.requestWithRetryOnStaleState(CloudSolrClient.java:886)
at org.apache.solr.client.solrj.impl.CloudSolrClient.request(CloudSolrClient.java:819)
at org.apache.solr.client.solrj.SolrRequest.process(SolrRequest.java:194)
at org.apache.solr.client.solrj.SolrRequest.process(SolrRequest.java:211)
at org.apache.solr.cloud.MoveReplicaHDFSFailoverTest.testOldReplicaIsDeletedInRaceCondition(MoveReplicaHDFSFailoverTest.java:195)
at sun.reflect.NativeMethodAccessorImpl.invoke0(Native Method)
at sun.reflect.NativeMethodAccessorImpl.invoke(NativeMethodAccessorImpl.java:62)
at sun.reflect.DelegatingMethodAccessorImpl.invoke(DelegatingMethodAccessorImpl.java:43)
at java.lang.reflect.Method.invoke(Method.java:498)
at com.carrotsearch.randomizedtesting.RandomizedRunner.invoke(RandomizedRunner.java:1737)
at com.carrotsearch.randomizedtesting.RandomizedRunner$8.evaluate(RandomizedRunner.java:934)
at com.carrotsearch.randomizedtesting.RandomizedRunner$9.evaluate(RandomizedRunner.java:970)
at com.carrotsearch.randomizedtesting.RandomizedRunner$10.evaluate(RandomizedRunner.java:984)
at com.carrotsearch.randomizedtesting.rules.SystemPropertiesRestoreRule$1.evaluate(SystemPropertiesRestoreRule.java:57)
at org.apache.lucene.util.TestRuleSetupTeardownChained$1.evaluate(TestRuleSetupTeardownChained.java:49)
at org.apache.lucene.util.AbstractBeforeAfterRule$1.evaluate(AbstractBeforeAfterRule.java:45)
at org.apache.lucene.util.TestRuleThreadAndTestName$1.evaluate(TestRuleThreadAndTestName.java:48)
at org.apache.lucene.util.TestRuleIgnoreAfterMaxFailures$1.evaluate(TestRuleIgnoreAfterMaxFailures.java:64)
at org.apache.lucene.util.TestRuleMarkFailure$1.evaluate(TestRuleMarkFailure.java:47)
at com.carrotsearch.randomizedtesting.rules.StatementAdapter.evaluate(StatementAdapter.java:36)
at com.carrotsearch.randomizedtesting.ThreadLeakControl$StatementRunner.run(ThreadLeakControl.java:368)
at com.carrotsearch.randomizedtesting.ThreadLeakControl.forkTimeoutingTask(ThreadLeakControl.java:817)
at com.carrotsearch.randomizedtesting.ThreadLeakControl$3.evaluate(ThreadLeakControl.java:468)
at com.carrotsearch.randomizedtesting.RandomizedRunner.runSingleTest(RandomizedRunner.java:943)
at com.carrotsearch.randomizedtesting.RandomizedRunner$5.evaluate(RandomizedRunner.java:829)
at com.carrotsearch.randomizedtesting.RandomizedRunner$6.evaluate(RandomizedRunner.java:879)
at com.carrotsearch.randomizedtesting.RandomizedRunner$7.evaluate(RandomizedRunner.java:890)
at com.carrotsearch.randomizedtesting.rules.StatementAdapter.evaluate(StatementAdapter.java:36)
at com.carrotsearch.randomizedtesting.rules.SystemPropertiesRestoreRule$1.evaluate(SystemPropertiesRestoreRule.java:57)
at org.apache.lucene.util.AbstractBeforeAfterRule$1.evaluate(AbstractBeforeAfterRule.java:45)
at com.carrotsearch.randomizedtesting.rules.StatementAdapter.evaluate(StatementAdapter.java:36)
at org.apache.lucene.util.TestRuleStoreClassName$1.evaluate(TestRuleStoreClassName.java:41)
at com.carrotsearch.randomizedtesting.rules.NoShadowingOrOverridesOnMethodsRule$1.evaluate(NoShadowingOrOverridesOnMethodsRule.java:40)
at com.carrotsearch.randomizedtesting.rules.NoShadowingOrOverridesOnMethodsRule$1.evaluate(NoShadowingOrOverridesOnMethodsRule.java:40)
at com.carrotsearch.randomizedtesting.rules.StatementAdapter.evaluate(StatementAdapter.java:36)
at com.carrotsearch.randomizedtesting.rules.StatementAdapter.evaluate(StatementAdapter.java:36)
at com.carrotsearch.randomizedtesting.rules.StatementAdapter.evaluate(StatementAdapter.java:36)
at org.apache.lucene.util.TestRuleAssertionsRequired$1.evaluate(TestRuleAssertionsRequired.java:53)
at org.apache.lucene.util.TestRuleMarkFailure$1.evaluate(TestRuleMarkFailure.java:47)
at org.apache.lucene.util.TestRuleIgnoreAfterMaxFailures$1.evaluate(TestRuleIgnoreAfterMaxFailures.java:64)
at org.apache.lucene.util.TestRuleIgnoreTestSuites$1.evaluate(TestRuleIgnoreTestSuites.java:54)
at com.carrotsearch.randomizedtesting.rules.StatementAdapter.evaluate(StatementAdapter.java:36)
at com.carrotsearch.randomizedtesting.ThreadLeakControl$StatementRunner.run(ThreadLeakControl.java:368)
at java.lang.Thread.run(Thread.java:748)
FAILED: org.apache.solr.cloud.autoscaling.TestPolicyCloud.testCreateCollectionAddShardUsingPolicy
Error Message:
Could not load collection from ZK: policiesTest
Stack Trace:
org.apache.solr.common.SolrException: Could not load collection from ZK: policiesTest
at org.apache.solr.common.cloud.ZkStateReader.getCollectionLive(ZkStateReader.java:1316)
at org.apache.solr.common.cloud.ZkStateReader$LazyCollectionRef.get(ZkStateReader.java:732)
at org.apache.solr.common.cloud.ClusterState.getCollectionOrNull(ClusterState.java:148)
at org.apache.solr.common.cloud.ClusterState.getCollectionOrNull(ClusterState.java:131)
at org.apache.solr.common.cloud.ClusterState.getCollection(ClusterState.java:117)
at org.apache.solr.cloud.SolrCloudTestCase.getCollectionState(SolrCloudTestCase.java:256)
at org.apache.solr.cloud.autoscaling.TestPolicyCloud.testCreateCollectionAddShardUsingPolicy(TestPolicyCloud.java:320)
at sun.reflect.NativeMethodAccessorImpl.invoke0(Native Method)
at sun.reflect.NativeMethodAccessorImpl.invoke(NativeMethodAccessorImpl.java:62)
at sun.reflect.DelegatingMethodAccessorImpl.invoke(DelegatingMethodAccessorImpl.java:43)
at java.lang.reflect.Method.invoke(Method.java:498)
at com.carrotsearch.randomizedtesting.RandomizedRunner.invoke(RandomizedRunner.java:1737)
at com.carrotsearch.randomizedtesting.RandomizedRunner$8.evaluate(RandomizedRunner.java:934)
at com.carrotsearch.randomizedtesting.RandomizedRunner$9.evaluate(RandomizedRunner.java:970)
at com.carrotsearch.randomizedtesting.RandomizedRunner$10.evaluate(RandomizedRunner.java:984)
at org.junit.rules.ExpectedException$ExpectedExceptionStatement.evaluate(ExpectedException.java:110)
at com.carrotsearch.randomizedtesting.rules.SystemPropertiesRestoreRule$1.evaluate(SystemPropertiesRestoreRule.java:57)
at org.apache.lucene.util.TestRuleSetupTeardownChained$1.evaluate(TestRuleSetupTeardownChained.java:49)
at org.apache.lucene.util.AbstractBeforeAfterRule$1.evaluate(AbstractBeforeAfterRule.java:45)
at org.apache.lucene.util.TestRuleThreadAndTestName$1.evaluate(TestRuleThreadAndTestName.java:48)
at org.apache.lucene.util.TestRuleIgnoreAfterMaxFailures$1.evaluate(TestRuleIgnoreAfterMaxFailures.java:64)
at org.apache.lucene.util.TestRuleMarkFailure$1.evaluate(TestRuleMarkFailure.java:47)
at com.carrotsearch.randomizedtesting.rules.StatementAdapter.evaluate(StatementAdapter.java:36)
at com.carrotsearch.randomizedtesting.ThreadLeakControl$StatementRunner.run(ThreadLeakControl.java:368)
at com.carrotsearch.randomizedtesting.ThreadLeakControl.forkTimeoutingTask(ThreadLeakControl.java:817)
at com.carrotsearch.randomizedtesting.ThreadLeakControl$3.evaluate(ThreadLeakControl.java:468)
at com.carrotsearch.randomizedtesting.RandomizedRunner.runSingleTest(RandomizedRunner.java:943)
at com.carrotsearch.randomizedtesting.RandomizedRunner$5.evaluate(RandomizedRunner.java:829)
at com.carrotsearch.randomizedtesting.RandomizedRunner$6.evaluate(RandomizedRunner.java:879)
at com.carrotsearch.randomizedtesting.RandomizedRunner$7.evaluate(RandomizedRunner.java:890)
at com.carrotsearch.randomizedtesting.rules.StatementAdapter.evaluate(StatementAdapter.java:36)
at com.carrotsearch.randomizedtesting.rules.SystemPropertiesRestoreRule$1.evaluate(SystemPropertiesRestoreRule.java:57)
at org.apache.lucene.util.AbstractBeforeAfterRule$1.evaluate(AbstractBeforeAfterRule.java:45)
at com.carrotsearch.randomizedtesting.rules.StatementAdapter.evaluate(StatementAdapter.java:36)
at org.apache.lucene.util.TestRuleStoreClassName$1.evaluate(TestRuleStoreClassName.java:41)
at com.carrotsearch.randomizedtesting.rules.NoShadowingOrOverridesOnMethodsRule$1.evaluate(NoShadowingOrOverridesOnMethodsRule.java:40)
at com.carrotsearch.randomizedtesting.rules.NoShadowingOrOverridesOnMethodsRule$1.evaluate(NoShadowingOrOverridesOnMethodsRule.java:40)
at com.carrotsearch.randomizedtesting.rules.StatementAdapter.evaluate(StatementAdapter.java:36)
at com.carrotsearch.randomizedtesting.rules.StatementAdapter.evaluate(StatementAdapter.java:36)
at com.carrotsearch.randomizedtesting.rules.StatementAdapter.evaluate(StatementAdapter.java:36)
at org.apache.lucene.util.TestRuleAssertionsRequired$1.evaluate(TestRuleAssertionsRequired.java:53)
at org.apache.lucene.util.TestRuleMarkFailure$1.evaluate(TestRuleMarkFailure.java:47)
at org.apache.lucene.util.TestRuleIgnoreAfterMaxFailures$1.evaluate(TestRuleIgnoreAfterMaxFailures.java:64)
at org.apache.lucene.util.TestRuleIgnoreTestSuites$1.evaluate(TestRuleIgnoreTestSuites.java:54)
at com.carrotsearch.randomizedtesting.rules.StatementAdapter.evaluate(StatementAdapter.java:36)
at com.carrotsearch.randomizedtesting.ThreadLeakControl$StatementRunner.run(ThreadLeakControl.java:368)
at java.lang.Thread.run(Thread.java:748)
Caused by: org.apache.zookeeper.KeeperException$SessionExpiredException: KeeperErrorCode = Session expired for /collections/policiesTest/state.json
at org.apache.zookeeper.KeeperException.create(KeeperException.java:130)
at org.apache.zookeeper.KeeperException.create(KeeperException.java:54)
at org.apache.zookeeper.ZooKeeper.getData(ZooKeeper.java:1215)
at org.apache.solr.common.cloud.SolrZkClient.lambda$getData$5(SolrZkClient.java:341)
at org.apache.solr.common.cloud.ZkCmdExecutor.retryOperation(ZkCmdExecutor.java:60)
at org.apache.solr.common.cloud.SolrZkClient.getData(SolrZkClient.java:341)
at org.apache.solr.common.cloud.ZkStateReader.fetchCollectionState(ZkStateReader.java:1328)
at org.apache.solr.common.cloud.ZkStateReader.getCollectionLive(ZkStateReader.java:1314)
... 46 more
FAILED: org.apache.solr.metrics.rrd.SolrRrdBackendFactoryTest.testBasic
Error Message:
{ "dbLastUpdateTime":1000006030, "firstTimestamp":1000000020, "lastTimestamp":1000006080, "timestamps":[1000000020,1000000080,1000000140,1000000200,1000000260,1000000320,1000000380,1000000440,1000000500,1000000560,1000000620,1000000680,1000000740,1000000800,1000000860,1000000920,1000000980,1000001040,1000001100,1000001160,1000001220,1000001280,1000001340,1000001400,1000001460,1000001520,1000001580,1000001640,1000001700,1000001760,1000001820,1000001880,1000001940,1000002000,1000002060,1000002120,1000002180,1000002240,1000002300,1000002360,1000002420,1000002480,1000002540,1000002600,1000002660,1000002720,1000002780,1000002840,1000002900,1000002960,1000003020,1000003080,1000003140,1000003200,1000003260,1000003320,1000003380,1000003440,1000003500,1000003560,1000003620,1000003680,1000003740,1000003800,1000003860,1000003920,1000003980,1000004040,1000004100,1000004160,1000004220,1000004280,1000004340,1000004400,1000004460,1000004520,1000004580,1000004640,1000004700,1000004760,1000004820,1000004880,1000004940,1000005000,1000005060,1000005120,1000005180,1000005240,1000005300,1000005360,1000005420,1000005480,1000005540,1000005600,1000005660,1000005720,1000005780,1000005840,1000005900,1000005960,1000006020,1000006080], "data":"1000000020: NaN NaN \n1000000080: NaN NaN \n1000000140: NaN NaN \n1000000200: NaN NaN \n1000000260: NaN NaN \n1000000320: NaN NaN \n1000000380: NaN NaN \n1000000440: NaN NaN \n1000000500: NaN NaN \n1000000560: NaN NaN \n1000000620: NaN NaN \n1000000680: NaN NaN \n1000000740: NaN NaN \n1000000800: NaN NaN \n1000000860: NaN NaN \n1000000920: NaN NaN \n1000000980: NaN NaN \n1000001040: NaN NaN \n1000001100: NaN NaN \n1000001160: NaN NaN \n1000001220: NaN NaN \n1000001280: NaN NaN \n1000001340: NaN NaN \n1000001400: NaN NaN \n1000001460: NaN NaN \n1000001520: NaN NaN \n1000001580: NaN NaN \n1000001640: NaN NaN \n1000001700: NaN NaN \n1000001760: NaN NaN \n1000001820: NaN NaN \n1000001880: NaN NaN \n1000001940: NaN NaN \n1000002000: NaN NaN \n1000002060: NaN NaN \n1000002120: NaN NaN \n1000002180: NaN NaN \n1000002240: NaN NaN \n1000002300: NaN NaN \n1000002360: NaN NaN \n1000002420: NaN NaN \n1000002480: NaN NaN \n1000002540: NaN NaN \n1000002600: NaN NaN \n1000002660: NaN NaN \n1000002720: NaN NaN \n1000002780: NaN NaN \n1000002840: NaN NaN \n1000002900: NaN NaN \n1000002960: NaN NaN \n1000003020: NaN NaN \n1000003080: NaN NaN \n1000003140: NaN NaN \n1000003200: NaN NaN \n1000003260: NaN NaN \n1000003320: NaN NaN \n1000003380: NaN NaN \n1000003440: NaN NaN \n1000003500: NaN NaN \n1000003560: NaN NaN \n1000003620: NaN NaN \n1000003680: NaN NaN \n1000003740: NaN NaN \n1000003800: NaN NaN \n1000003860: NaN NaN \n1000003920: NaN NaN \n1000003980: NaN NaN \n1000004040: NaN NaN \n1000004100: NaN NaN \n1000004160: NaN NaN \n1000004220: NaN NaN \n1000004280: NaN NaN \n1000004340: NaN NaN \n1000004400: NaN NaN \n1000004460: NaN NaN \n1000004520: NaN NaN \n1000004580: NaN NaN \n1000004640: NaN NaN \n1000004700: NaN NaN \n1000004760: NaN NaN \n1000004820: NaN NaN \n1000004880: NaN NaN \n1000004940: NaN NaN \n1000005000: NaN NaN \n1000005060: NaN NaN \n1000005120: NaN NaN \n1000005180: NaN NaN \n1000005240: NaN NaN \n1000005300: NaN NaN \n1000005360: NaN NaN \n1000005420: NaN NaN \n1000005480: NaN NaN \n1000005540: NaN NaN \n1000005600: NaN NaN \n1000005660: NaN NaN \n1000005720: NaN NaN \n1000005780: NaN NaN \n1000005840: NaN NaN \n1000005900: NaN NaN \n1000005960: NaN NaN \n1000006020: NaN NaN \n1000006080: NaN NaN \n"} expected:<1.0> but was:<NaN>
Stack Trace:
java.lang.AssertionError: {
"dbLastUpdateTime":1000006030,
"firstTimestamp":1000000020,
"lastTimestamp":1000006080,
"timestamps":[1000000020,1000000080,1000000140,1000000200,1000000260,1000000320,1000000380,1000000440,1000000500,1000000560,1000000620,1000000680,1000000740,1000000800,1000000860,1000000920,1000000980,1000001040,1000001100,1000001160,1000001220,1000001280,1000001340,1000001400,1000001460,1000001520,1000001580,1000001640,1000001700,1000001760,1000001820,1000001880,1000001940,1000002000,1000002060,1000002120,1000002180,1000002240,1000002300,1000002360,1000002420,1000002480,1000002540,1000002600,1000002660,1000002720,1000002780,1000002840,1000002900,1000002960,1000003020,1000003080,1000003140,1000003200,1000003260,1000003320,1000003380,1000003440,1000003500,1000003560,1000003620,1000003680,1000003740,1000003800,1000003860,1000003920,1000003980,1000004040,1000004100,1000004160,1000004220,1000004280,1000004340,1000004400,1000004460,1000004520,1000004580,1000004640,1000004700,1000004760,1000004820,1000004880,1000004940,1000005000,1000005060,1000005120,1000005180,1000005240,1000005300,1000005360,1000005420,1000005480,1000005540,1000005600,1000005660,1000005720,1000005780,1000005840,1000005900,1000005960,1000006020,1000006080],
"data":"1000000020: NaN NaN \n1000000080: NaN NaN \n1000000140: NaN NaN \n1000000200: NaN NaN \n1000000260: NaN NaN \n1000000320: NaN NaN \n1000000380: NaN NaN \n1000000440: NaN NaN \n1000000500: NaN NaN \n1000000560: NaN NaN \n1000000620: NaN NaN \n1000000680: NaN NaN \n1000000740: NaN NaN \n1000000800: NaN NaN \n1000000860: NaN NaN \n1000000920: NaN NaN \n1000000980: NaN NaN \n1000001040: NaN NaN \n1000001100: NaN NaN \n1000001160: NaN NaN \n1000001220: NaN NaN \n1000001280: NaN NaN \n1000001340: NaN NaN \n1000001400: NaN NaN \n1000001460: NaN NaN \n1000001520: NaN NaN \n1000001580: NaN NaN \n1000001640: NaN NaN \n1000001700: NaN NaN \n1000001760: NaN NaN \n1000001820: NaN NaN \n1000001880: NaN NaN \n1000001940: NaN NaN \n1000002000: NaN NaN \n1000002060: NaN NaN \n1000002120: NaN NaN \n1000002180: NaN NaN \n1000002240: NaN NaN \n1000002300: NaN NaN \n1000002360: NaN NaN \n1000002420: NaN NaN \n1000002480: NaN NaN \n1000002540: NaN NaN \n1000002600: NaN NaN \n1000002660: NaN NaN \n1000002720: NaN NaN \n1000002780: NaN NaN \n1000002840: NaN NaN \n1000002900: NaN NaN \n1000002960: NaN NaN \n1000003020: NaN NaN \n1000003080: NaN NaN \n1000003140: NaN NaN \n1000003200: NaN NaN \n1000003260: NaN NaN \n1000003320: NaN NaN \n1000003380: NaN NaN \n1000003440: NaN NaN \n1000003500: NaN NaN \n1000003560: NaN NaN \n1000003620: NaN NaN \n1000003680: NaN NaN \n1000003740: NaN NaN \n1000003800: NaN NaN \n1000003860: NaN NaN \n1000003920: NaN NaN \n1000003980: NaN NaN \n1000004040: NaN NaN \n1000004100: NaN NaN \n1000004160: NaN NaN \n1000004220: NaN NaN \n1000004280: NaN NaN \n1000004340: NaN NaN \n1000004400: NaN NaN \n1000004460: NaN NaN \n1000004520: NaN NaN \n1000004580: NaN NaN \n1000004640: NaN NaN \n1000004700: NaN NaN \n1000004760: NaN NaN \n1000004820: NaN NaN \n1000004880: NaN NaN \n1000004940: NaN NaN \n1000005000: NaN NaN \n1000005060: NaN NaN \n1000005120: NaN NaN \n1000005180: NaN NaN \n1000005240: NaN NaN \n1000005300: NaN NaN \n1000005360: NaN NaN \n1000005420: NaN NaN \n1000005480: NaN NaN \n1000005540: NaN NaN \n1000005600: NaN NaN \n1000005660: NaN NaN \n1000005720: NaN NaN \n1000005780: NaN NaN \n1000005840: NaN NaN \n1000005900: NaN NaN \n1000005960: NaN NaN \n1000006020: NaN NaN \n1000006080: NaN NaN \n"} expected:<1.0> but was:<NaN>
at __randomizedtesting.SeedInfo.seed([37FC3E715740A296:9C062364889C24B8]:0)
at org.junit.Assert.fail(Assert.java:93)
at org.junit.Assert.failNotEquals(Assert.java:647)
at org.junit.Assert.assertEquals(Assert.java:443)
at org.apache.solr.metrics.rrd.SolrRrdBackendFactoryTest.testBasic(SolrRrdBackendFactoryTest.java:161)
at sun.reflect.NativeMethodAccessorImpl.invoke0(Native Method)
at sun.reflect.NativeMethodAccessorImpl.invoke(NativeMethodAccessorImpl.java:62)
at sun.reflect.DelegatingMethodAccessorImpl.invoke(DelegatingMethodAccessorImpl.java:43)
at java.lang.reflect.Method.invoke(Method.java:498)
at com.carrotsearch.randomizedtesting.RandomizedRunner.invoke(RandomizedRunner.java:1737)
at com.carrotsearch.randomizedtesting.RandomizedRunner$8.evaluate(RandomizedRunner.java:934)
at com.carrotsearch.randomizedtesting.RandomizedRunner$9.evaluate(RandomizedRunner.java:970)
at com.carrotsearch.randomizedtesting.RandomizedRunner$10.evaluate(RandomizedRunner.java:984)
at com.carrotsearch.randomizedtesting.rules.SystemPropertiesRestoreRule$1.evaluate(SystemPropertiesRestoreRule.java:57)
at org.apache.lucene.util.TestRuleSetupTeardownChained$1.evaluate(TestRuleSetupTeardownChained.java:49)
at org.apache.lucene.util.AbstractBeforeAfterRule$1.evaluate(AbstractBeforeAfterRule.java:45)
at org.apache.lucene.util.TestRuleThreadAndTestName$1.evaluate(TestRuleThreadAndTestName.java:48)
at org.apache.lucene.util.TestRuleIgnoreAfterMaxFailures$1.evaluate(TestRuleIgnoreAfterMaxFailures.java:64)
at org.apache.lucene.util.TestRuleMarkFailure$1.evaluate(TestRuleMarkFailure.java:47)
at com.carrotsearch.randomizedtesting.rules.StatementAdapter.evaluate(StatementAdapter.java:36)
at com.carrotsearch.randomizedtesting.ThreadLeakControl$StatementRunner.run(ThreadLeakControl.java:368)
at com.carrotsearch.randomizedtesting.ThreadLeakControl.forkTimeoutingTask(ThreadLeakControl.java:817)
at com.carrotsearch.randomizedtesting.ThreadLeakControl$3.evaluate(ThreadLeakControl.java:468)
at com.carrotsearch.randomizedtesting.RandomizedRunner.runSingleTest(RandomizedRunner.java:943)
at com.carrotsearch.randomizedtesting.RandomizedRunner$5.evaluate(RandomizedRunner.java:829)
at com.carrotsearch.randomizedtesting.RandomizedRunner$6.evaluate(RandomizedRunner.java:879)
at com.carrotsearch.randomizedtesting.RandomizedRunner$7.evaluate(RandomizedRunner.java:890)
at com.carrotsearch.randomizedtesting.rules.StatementAdapter.evaluate(StatementAdapter.java:36)
at com.carrotsearch.randomizedtesting.rules.SystemPropertiesRestoreRule$1.evaluate(SystemPropertiesRestoreRule.java:57)
at org.apache.lucene.util.AbstractBeforeAfterRule$1.evaluate(AbstractBeforeAfterRule.java:45)
at com.carrotsearch.randomizedtesting.rules.StatementAdapter.evaluate(StatementAdapter.java:36)
at org.apache.lucene.util.TestRuleStoreClassName$1.evaluate(TestRuleStoreClassName.java:41)
at com.carrotsearch.randomizedtesting.rules.NoShadowingOrOverridesOnMethodsRule$1.evaluate(NoShadowingOrOverridesOnMethodsRule.java:40)
at com.carrotsearch.randomizedtesting.rules.NoShadowingOrOverridesOnMethodsRule$1.evaluate(NoShadowingOrOverridesOnMethodsRule.java:40)
at com.carrotsearch.randomizedtesting.rules.StatementAdapter.evaluate(StatementAdapter.java:36)
at com.carrotsearch.randomizedtesting.rules.StatementAdapter.evaluate(StatementAdapter.java:36)
at com.carrotsearch.randomizedtesting.rules.StatementAdapter.evaluate(StatementAdapter.java:36)
at org.apache.lucene.util.TestRuleAssertionsRequired$1.evaluate(TestRuleAssertionsRequired.java:53)
at org.apache.lucene.util.TestRuleMarkFailure$1.evaluate(TestRuleMarkFailure.java:47)
at org.apache.lucene.util.TestRuleIgnoreAfterMaxFailures$1.evaluate(TestRuleIgnoreAfterMaxFailures.java:64)
at org.apache.lucene.util.TestRuleIgnoreTestSuites$1.evaluate(TestRuleIgnoreTestSuites.java:54)
at com.carrotsearch.randomizedtesting.rules.StatementAdapter.evaluate(StatementAdapter.java:36)
at com.carrotsearch.randomizedtesting.ThreadLeakControl$StatementRunner.run(ThreadLeakControl.java:368)
at java.lang.Thread.run(Thread.java:748)
Build Log:
[...truncated 12466 lines...]
[junit4] Suite: org.apache.solr.cloud.autoscaling.TestPolicyCloud
[junit4] 2> Creating dataDir: /home/jenkins/jenkins-slave/workspace/Lucene-Solr-Tests-7.4/solr/build/solr-core/test/J1/temp/solr.cloud.autoscaling.TestPolicyCloud_37FC3E715740A296-001/init-core-data-001
[junit4] 2> 241381 WARN (SUITE-TestPolicyCloud-seed#[37FC3E715740A296]-worker) [ ] o.a.s.SolrTestCaseJ4 startTrackingSearchers: numOpens=2 numCloses=2
[junit4] 2> 241381 INFO (SUITE-TestPolicyCloud-seed#[37FC3E715740A296]-worker) [ ] o.a.s.SolrTestCaseJ4 Using TrieFields (NUMERIC_POINTS_SYSPROP=false) w/NUMERIC_DOCVALUES_SYSPROP=false
[junit4] 2> 241383 INFO (SUITE-TestPolicyCloud-seed#[37FC3E715740A296]-worker) [ ] o.a.s.SolrTestCaseJ4 Randomized ssl (true) and clientAuth (false) via: @org.apache.solr.util.RandomizeSSL(reason=, ssl=NaN, value=NaN, clientAuth=NaN)
[junit4] 2> 241416 INFO (SUITE-TestPolicyCloud-seed#[37FC3E715740A296]-worker) [ ] o.a.s.SolrTestCaseJ4 SecureRandom sanity checks: test.solr.allowed.securerandom=null & java.security.egd=file:/dev/./urandom
[junit4] 2> 241418 INFO (SUITE-TestPolicyCloud-seed#[37FC3E715740A296]-worker) [ ] o.a.s.c.MiniSolrCloudCluster Starting cluster of 5 servers in /home/jenkins/jenkins-slave/workspace/Lucene-Solr-Tests-7.4/solr/build/solr-core/test/J1/temp/solr.cloud.autoscaling.TestPolicyCloud_37FC3E715740A296-001/tempDir-001
[junit4] 2> 241418 INFO (SUITE-TestPolicyCloud-seed#[37FC3E715740A296]-worker) [ ] o.a.s.c.ZkTestServer STARTING ZK TEST SERVER
[junit4] 2> 241419 INFO (Thread-24) [ ] o.a.s.c.ZkTestServer client port:0.0.0.0/0.0.0.0:0
[junit4] 2> 241419 INFO (Thread-24) [ ] o.a.s.c.ZkTestServer Starting server
[junit4] 2> 241489 ERROR (Thread-24) [ ] o.a.z.s.ZooKeeperServer ZKShutdownHandler is not registered, so ZooKeeper server won't take any action on ERROR or SHUTDOWN server state changes
[junit4] 2> 241525 INFO (SUITE-TestPolicyCloud-seed#[37FC3E715740A296]-worker) [ ] o.a.s.c.ZkTestServer start zk server on port:42638
[junit4] 2> 241615 INFO (zkConnectionManagerCallback-100-thread-1) [ ] o.a.s.c.c.ConnectionManager zkClient has connected
[junit4] 2> 241653 INFO (jetty-launcher-97-thread-1) [ ] o.e.j.s.Server jetty-9.4.10.v20180503; built: 2018-05-03T15:56:21.710Z; git: daa59876e6f384329b122929e70a80934569428c; jvm 1.8.0_172-b11
[junit4] 2> 241679 INFO (jetty-launcher-97-thread-3) [ ] o.e.j.s.Server jetty-9.4.10.v20180503; built: 2018-05-03T15:56:21.710Z; git: daa59876e6f384329b122929e70a80934569428c; jvm 1.8.0_172-b11
[junit4] 2> 241711 INFO (jetty-launcher-97-thread-2) [ ] o.e.j.s.Server jetty-9.4.10.v20180503; built: 2018-05-03T15:56:21.710Z; git: daa59876e6f384329b122929e70a80934569428c; jvm 1.8.0_172-b11
[junit4] 2> 241734 INFO (jetty-launcher-97-thread-4) [ ] o.e.j.s.Server jetty-9.4.10.v20180503; built: 2018-05-03T15:56:21.710Z; git: daa59876e6f384329b122929e70a80934569428c; jvm 1.8.0_172-b11
[junit4] 2> 241764 INFO (jetty-launcher-97-thread-5) [ ] o.e.j.s.Server jetty-9.4.10.v20180503; built: 2018-05-03T15:56:21.710Z; git: daa59876e6f384329b122929e70a80934569428c; jvm 1.8.0_172-b11
[junit4] 2> 241770 INFO (jetty-launcher-97-thread-2) [ ] o.e.j.s.session DefaultSessionIdManager workerName=node0
[junit4] 2> 241770 INFO (jetty-launcher-97-thread-2) [ ] o.e.j.s.session No SessionScavenger set, using defaults
[junit4] 2> 241770 INFO (jetty-launcher-97-thread-2) [ ] o.e.j.s.session node0 Scavenging every 660000ms
[junit4] 2> 241786 INFO (jetty-launcher-97-thread-2) [ ] o.e.j.s.h.ContextHandler Started o.e.j.s.ServletContextHandler@3203c1a6{/solr,null,AVAILABLE}
[junit4] 2> 241819 INFO (jetty-launcher-97-thread-1) [ ] o.e.j.s.session DefaultSessionIdManager workerName=node0
[junit4] 2> 241819 INFO (jetty-launcher-97-thread-1) [ ] o.e.j.s.session No SessionScavenger set, using defaults
[junit4] 2> 241820 INFO (jetty-launcher-97-thread-1) [ ] o.e.j.s.session node0 Scavenging every 600000ms
[junit4] 2> 241820 INFO (jetty-launcher-97-thread-1) [ ] o.e.j.s.h.ContextHandler Started o.e.j.s.ServletContextHandler@7f2304b9{/solr,null,AVAILABLE}
[junit4] 2> 241873 INFO (jetty-launcher-97-thread-3) [ ] o.e.j.s.session DefaultSessionIdManager workerName=node0
[junit4] 2> 241873 INFO (jetty-launcher-97-thread-3) [ ] o.e.j.s.session No SessionScavenger set, using defaults
[junit4] 2> 241874 INFO (jetty-launcher-97-thread-3) [ ] o.e.j.s.session node0 Scavenging every 600000ms
[junit4] 2> 241888 INFO (jetty-launcher-97-thread-3) [ ] o.e.j.s.h.ContextHandler Started o.e.j.s.ServletContextHandler@1518d763{/solr,null,AVAILABLE}
[junit4] 2> 241989 INFO (jetty-launcher-97-thread-5) [ ] o.e.j.s.session DefaultSessionIdManager workerName=node0
[junit4] 2> 241989 INFO (jetty-launcher-97-thread-5) [ ] o.e.j.s.session No SessionScavenger set, using defaults
[junit4] 2> 241989 INFO (jetty-launcher-97-thread-5) [ ] o.e.j.s.session node0 Scavenging every 600000ms
[junit4] 2> 241990 INFO (jetty-launcher-97-thread-5) [ ] o.e.j.s.h.ContextHandler Started o.e.j.s.ServletContextHandler@6c501718{/solr,null,AVAILABLE}
[junit4] 2> 242006 INFO (jetty-launcher-97-thread-4) [ ] o.e.j.s.session DefaultSessionIdManager workerName=node0
[junit4] 2> 242006 INFO (jetty-launcher-97-thread-4) [ ] o.e.j.s.session No SessionScavenger set, using defaults
[junit4] 2> 242006 INFO (jetty-launcher-97-thread-4) [ ] o.e.j.s.session node0 Scavenging every 660000ms
[junit4] 2> 242007 INFO (jetty-launcher-97-thread-4) [ ] o.e.j.s.h.ContextHandler Started o.e.j.s.ServletContextHandler@473807da{/solr,null,AVAILABLE}
[junit4] 2> 242146 INFO (jetty-launcher-97-thread-2) [ ] o.e.j.s.AbstractConnector Started ServerConnector@7b02dce3{SSL,[ssl, http/1.1]}{127.0.0.1:38364}
[junit4] 2> 242146 INFO (jetty-launcher-97-thread-2) [ ] o.e.j.s.Server Started @242380ms
[junit4] 2> 242146 INFO (jetty-launcher-97-thread-2) [ ] o.a.s.c.s.e.JettySolrRunner Jetty properties: {hostContext=/solr, hostPort=38364}
[junit4] 2> 242147 ERROR (jetty-launcher-97-thread-2) [ ] o.a.s.u.StartupLoggingUtils Missing Java Option solr.log.dir. Logging may be missing or incomplete.
[junit4] 2> 242147 INFO (jetty-launcher-97-thread-2) [ ] o.a.s.s.SolrDispatchFilter Using logger factory org.apache.logging.slf4j.Log4jLoggerFactory
[junit4] 2> 242147 INFO (jetty-launcher-97-thread-2) [ ] o.a.s.s.SolrDispatchFilter ___ _ Welcome to Apache Solr™ version 7.4.0
[junit4] 2> 242147 INFO (jetty-launcher-97-thread-2) [ ] o.a.s.s.SolrDispatchFilter / __| ___| |_ _ Starting in cloud mode on port null
[junit4] 2> 242147 INFO (jetty-launcher-97-thread-2) [ ] o.a.s.s.SolrDispatchFilter \__ \/ _ \ | '_| Install dir: null
[junit4] 2> 242184 INFO (jetty-launcher-97-thread-4) [ ] o.e.j.s.AbstractConnector Started ServerConnector@35332eb6{SSL,[ssl, http/1.1]}{127.0.0.1:37708}
[junit4] 2> 242184 INFO (jetty-launcher-97-thread-4) [ ] o.e.j.s.Server Started @242418ms
[junit4] 2> 242184 INFO (jetty-launcher-97-thread-4) [ ] o.a.s.c.s.e.JettySolrRunner Jetty properties: {hostContext=/solr, hostPort=37708}
[junit4] 2> 242185 ERROR (jetty-launcher-97-thread-4) [ ] o.a.s.u.StartupLoggingUtils Missing Java Option solr.log.dir. Logging may be missing or incomplete.
[junit4] 2> 242185 INFO (jetty-launcher-97-thread-4) [ ] o.a.s.s.SolrDispatchFilter Using logger factory org.apache.logging.slf4j.Log4jLoggerFactory
[junit4] 2> 242185 INFO (jetty-launcher-97-thread-4) [ ] o.a.s.s.SolrDispatchFilter ___ _ Welcome to Apache Solr™ version 7.4.0
[junit4] 2> 242185 INFO (jetty-launcher-97-thread-4) [ ] o.a.s.s.SolrDispatchFilter / __| ___| |_ _ Starting in cloud mode on port null
[junit4] 2> 242185 INFO (jetty-launcher-97-thread-4) [ ] o.a.s.s.SolrDispatchFilter \__ \/ _ \ | '_| Install dir: null
[junit4] 2> 242185 INFO (jetty-launcher-97-thread-4) [ ] o.a.s.s.SolrDispatchFilter |___/\___/_|_| Start time: 2018-06-18T11:21:10.219Z
[junit4] 2> 242186 INFO (jetty-launcher-97-thread-2) [ ] o.a.s.s.SolrDispatchFilter |___/\___/_|_| Start time: 2018-06-18T11:21:10.193Z
[junit4] 2> 242196 INFO (jetty-launcher-97-thread-5) [ ] o.e.j.s.AbstractConnector Started ServerConnector@6f8c48d9{SSL,[ssl, http/1.1]}{127.0.0.1:39092}
[junit4] 2> 242198 INFO (jetty-launcher-97-thread-5) [ ] o.e.j.s.Server Started @242432ms
[junit4] 2> 242198 INFO (jetty-launcher-97-thread-5) [ ] o.a.s.c.s.e.JettySolrRunner Jetty properties: {hostContext=/solr, hostPort=39092}
[junit4] 2> 242198 INFO (jetty-launcher-97-thread-1) [ ] o.e.j.s.AbstractConnector Started ServerConnector@a44ab4e{SSL,[ssl, http/1.1]}{127.0.0.1:37084}
[junit4] 2> 242198 INFO (jetty-launcher-97-thread-1) [ ] o.e.j.s.Server Started @242432ms
[junit4] 2> 242198 INFO (jetty-launcher-97-thread-1) [ ] o.a.s.c.s.e.JettySolrRunner Jetty properties: {hostContext=/solr, hostPort=37084}
[junit4] 2> 242197 INFO (jetty-launcher-97-thread-3) [ ] o.e.j.s.AbstractConnector Started ServerConnector@451c867c{SSL,[ssl, http/1.1]}{127.0.0.1:43496}
[junit4] 2> 242199 INFO (jetty-launcher-97-thread-3) [ ] o.e.j.s.Server Started @242433ms
[junit4] 2> 242199 INFO (jetty-launcher-97-thread-3) [ ] o.a.s.c.s.e.JettySolrRunner Jetty properties: {hostContext=/solr, hostPort=43496}
[junit4] 2> 242201 ERROR (jetty-launcher-97-thread-3) [ ] o.a.s.u.StartupLoggingUtils Missing Java Option solr.log.dir. Logging may be missing or incomplete.
[junit4] 2> 242201 INFO (jetty-launcher-97-thread-3) [ ] o.a.s.s.SolrDispatchFilter Using logger factory org.apache.logging.slf4j.Log4jLoggerFactory
[junit4] 2> 242201 INFO (jetty-launcher-97-thread-3) [ ] o.a.s.s.SolrDispatchFilter ___ _ Welcome to Apache Solr™ version 7.4.0
[junit4] 2> 242201 INFO (jetty-launcher-97-thread-3) [ ] o.a.s.s.SolrDispatchFilter / __| ___| |_ _ Starting in cloud mode on port null
[junit4] 2> 242201 INFO (jetty-launcher-97-thread-3) [ ] o.a.s.s.SolrDispatchFilter \__ \/ _ \ | '_| Install dir: null
[junit4] 2> 242201 INFO (jetty-launcher-97-thread-3) [ ] o.a.s.s.SolrDispatchFilter |___/\___/_|_| Start time: 2018-06-18T11:21:10.235Z
[junit4] 2> 242202 ERROR (jetty-launcher-97-thread-1) [ ] o.a.s.u.StartupLoggingUtils Missing Java Option solr.log.dir. Logging may be missing or incomplete.
[junit4] 2> 242202 INFO (jetty-launcher-97-thread-1) [ ] o.a.s.s.SolrDispatchFilter Using logger factory org.apache.logging.slf4j.Log4jLoggerFactory
[junit4] 2> 242202 INFO (jetty-launcher-97-thread-1) [ ] o.a.s.s.SolrDispatchFilter ___ _ Welcome to Apache Solr™ version 7.4.0
[junit4] 2> 242202 INFO (jetty-launcher-97-thread-1) [ ] o.a.s.s.SolrDispatchFilter / __| ___| |_ _ Starting in cloud mode on port null
[junit4] 2> 242202 INFO (jetty-launcher-97-thread-1) [ ] o.a.s.s.SolrDispatchFilter \__ \/ _ \ | '_| Install dir: null
[junit4] 2> 242203 INFO (jetty-launcher-97-thread-1) [ ] o.a.s.s.SolrDispatchFilter |___/\___/_|_| Start time: 2018-06-18T11:21:10.237Z
[junit4] 2> 242203 ERROR (jetty-launcher-97-thread-5) [ ] o.a.s.u.StartupLoggingUtils Missing Java Option solr.log.dir. Logging may be missing or incomplete.
[junit4] 2> 242203 INFO (jetty-launcher-97-thread-5) [ ] o.a.s.s.SolrDispatchFilter Using logger factory org.apache.logging.slf4j.Log4jLoggerFactory
[junit4] 2> 242203 INFO (jetty-launcher-97-thread-5) [ ] o.a.s.s.SolrDispatchFilter ___ _ Welcome to Apache Solr™ version 7.4.0
[junit4] 2> 242203 INFO (jetty-launcher-97-thread-5) [ ] o.a.s.s.SolrDispatchFilter / __| ___| |_ _ Starting in cloud mode on port null
[junit4] 2> 242203 INFO (jetty-launcher-97-thread-5) [ ] o.a.s.s.SolrDispatchFilter \__ \/ _ \ | '_| Install dir: null
[junit4] 2> 242203 INFO (jetty-launcher-97-thread-5) [ ] o.a.s.s.SolrDispatchFilter |___/\___/_|_| Start time: 2018-06-18T11:21:10.237Z
[junit4] 2> 242391 INFO (zkConnectionManagerCallback-108-thread-1) [ ] o.a.s.c.c.ConnectionManager zkClient has connected
[junit4] 2> 242392 INFO (zkConnectionManagerCallback-110-thread-1) [ ] o.a.s.c.c.ConnectionManager zkClient has connected
[junit4] 2> 242392 INFO (zkConnectionManagerCallback-104-thread-1) [ ] o.a.s.c.c.ConnectionManager zkClient has connected
[junit4] 2> 242392 INFO (zkConnectionManagerCallback-106-thread-1) [ ] o.a.s.c.c.ConnectionManager zkClient has connected
[junit4] 2> 242428 INFO (zkConnectionManagerCallback-102-thread-1) [ ] o.a.s.c.c.ConnectionManager zkClient has connected
[junit4] 2> 242428 INFO (jetty-launcher-97-thread-3) [ ] o.a.s.s.SolrDispatchFilter solr.xml found in ZooKeeper. Loading...
[junit4] 2> 242428 INFO (jetty-launcher-97-thread-5) [ ] o.a.s.s.SolrDispatchFilter solr.xml found in ZooKeeper. Loading...
[junit4] 2> 242429 INFO (jetty-launcher-97-thread-1) [ ] o.a.s.s.SolrDispatchFilter solr.xml found in ZooKeeper. Loading...
[junit4] 2> 242429 INFO (jetty-launcher-97-thread-4) [ ] o.a.s.s.SolrDispatchFilter solr.xml found in ZooKeeper. Loading...
[junit4] 2> 242497 INFO (jetty-launcher-97-thread-2) [ ] o.a.s.s.SolrDispatchFilter solr.xml found in ZooKeeper. Loading...
[junit4] 2> 243791 INFO (jetty-launcher-97-thread-4) [ ] o.a.s.c.ZkContainer Zookeeper client=127.0.0.1:42638/solr
[junit4] 2> 243905 INFO (zkConnectionManagerCallback-114-thread-1) [ ] o.a.s.c.c.ConnectionManager zkClient has connected
[junit4] 2> 244026 INFO (jetty-launcher-97-thread-5) [ ] o.a.s.c.ZkContainer Zookeeper client=127.0.0.1:42638/solr
[junit4] 2> 244697 INFO (zkConnectionManagerCallback-120-thread-1) [ ] o.a.s.c.c.ConnectionManager zkClient has connected
[junit4] 2> 244782 INFO (zkConnectionManagerCallback-118-thread-1) [ ] o.a.s.c.c.ConnectionManager zkClient has connected
[junit4] 2> 245111 INFO (zkConnectionManagerCallback-122-thread-1) [ ] o.a.s.c.c.ConnectionManager zkClient has connected
[junit4] 2> 245247 INFO (jetty-launcher-97-thread-2) [ ] o.a.s.c.ZkContainer Zookeeper client=127.0.0.1:42638/solr
[junit4] 2> 245339 INFO (jetty-launcher-97-thread-3) [ ] o.a.s.c.ZkContainer Zookeeper client=127.0.0.1:42638/solr
[junit4] 2> 245446 INFO (zkConnectionManagerCallback-132-thread-1) [ ] o.a.s.c.c.ConnectionManager zkClient has connected
[junit4] 2> 245486 INFO (zkConnectionManagerCallback-126-thread-1) [ ] o.a.s.c.c.ConnectionManager zkClient has connected
[junit4] 2> 245516 WARN (NIOServerCxn.Factory:0.0.0.0/0.0.0.0:0) [ ] o.a.z.s.NIOServerCnxn Unable to read additional data from client sessionid 0x102b6e316e8000a, likely client has closed socket
[junit4] 2> 245546 INFO (zkConnectionManagerCallback-136-thread-1) [ ] o.a.s.c.c.ConnectionManager zkClient has connected
[junit4] 2> 245571 INFO (zkConnectionManagerCallback-138-thread-1) [ ] o.a.s.c.c.ConnectionManager zkClient has connected
[junit4] 2> 245586 INFO (jetty-launcher-97-thread-1) [ ] o.a.s.c.ZkContainer Zookeeper client=127.0.0.1:42638/solr
[junit4] 2> 245626 INFO (zkConnectionManagerCallback-142-thread-1) [ ] o.a.s.c.c.ConnectionManager zkClient has connected
[junit4] 2> 245696 INFO (zkConnectionManagerCallback-146-thread-1) [ ] o.a.s.c.c.ConnectionManager zkClient has connected
[junit4] 2> 245798 INFO (jetty-launcher-97-thread-2) [n:127.0.0.1:38364_solr ] o.a.s.c.Overseer Overseer (id=null) closing
[junit4] 2> 245799 INFO (jetty-launcher-97-thread-2) [n:127.0.0.1:38364_solr ] o.a.s.c.OverseerElectionContext I am going to be the leader 127.0.0.1:38364_solr
[junit4] 2> 245800 INFO (jetty-launcher-97-thread-2) [n:127.0.0.1:38364_solr ] o.a.s.c.Overseer Overseer (id=72821630449483788-127.0.0.1:38364_solr-n_0000000000) starting
[junit4] 2> 245888 INFO (zkConnectionManagerCallback-155-thread-1) [ ] o.a.s.c.c.ConnectionManager zkClient has connected
[junit4] 2> 245978 INFO (jetty-launcher-97-thread-4) [n:127.0.0.1:37708_solr ] o.a.s.c.Overseer Overseer (id=null) closing
[junit4] 2> 245981 INFO (jetty-launcher-97-thread-1) [n:127.0.0.1:37084_solr ] o.a.s.c.Overseer Overseer (id=null) closing
[junit4] 2> 246031 INFO (jetty-launcher-97-thread-1) [n:127.0.0.1:37084_solr ] o.a.s.c.ZkController Register node as live in ZooKeeper:/live_nodes/127.0.0.1:37084_solr
[junit4] 2> 246031 INFO (jetty-launcher-97-thread-4) [n:127.0.0.1:37708_solr ] o.a.s.c.ZkController Register node as live in ZooKeeper:/live_nodes/127.0.0.1:37708_solr
[junit4] 2> 246049 INFO (jetty-launcher-97-thread-2) [n:127.0.0.1:38364_solr ] o.a.s.c.s.i.ZkClientClusterStateProvider Cluster at 127.0.0.1:42638/solr ready
[junit4] 2> 246099 INFO (zkCallback-137-thread-1) [ ] o.a.s.c.c.ZkStateReader Updated live nodes from ZooKeeper... (0) -> (2)
[junit4] 2> 246099 INFO (zkCallback-145-thread-1) [ ] o.a.s.c.c.ZkStateReader Updated live nodes from ZooKeeper... (0) -> (2)
[junit4] 2> 246126 INFO (jetty-launcher-97-thread-2) [n:127.0.0.1:38364_solr ] o.a.s.c.TransientSolrCoreCacheDefault Allocating transient cache for 2147483647 transient cores
[junit4] 2> 246126 INFO (jetty-launcher-97-thread-2) [n:127.0.0.1:38364_solr ] o.a.s.c.ZkController Register node as live in ZooKeeper:/live_nodes/127.0.0.1:38364_solr
[junit4] 2> 246180 INFO (zkCallback-154-thread-1) [ ] o.a.s.c.c.ZkStateReader Updated live nodes from ZooKeeper... (0) -> (2)
[junit4] 2> 246182 INFO (zkCallback-119-thread-1) [ ] o.a.s.c.c.ZkStateReader Updated live nodes from ZooKeeper... (0) -> (2)
[junit4] 2> 246199 INFO (zkCallback-154-thread-1) [ ] o.a.s.c.c.ZkStateReader Updated live nodes from ZooKeeper... (2) -> (3)
[junit4] 2> 246199 INFO (zkCallback-145-thread-1) [ ] o.a.s.c.c.ZkStateReader Updated live nodes from ZooKeeper... (2) -> (3)
[junit4] 2> 246199 INFO (zkCallback-137-thread-1) [ ] o.a.s.c.c.ZkStateReader Updated live nodes from ZooKeeper... (2) -> (3)
[junit4] 2> 246202 INFO (zkCallback-119-thread-1) [ ] o.a.s.c.c.ZkStateReader Updated live nodes from ZooKeeper... (2) -> (3)
[junit4] 2> 246416 INFO (zkConnectionManagerCallback-160-thread-1) [ ] o.a.s.c.c.ConnectionManager zkClient has connected
[junit4] 2> 246453 INFO (jetty-launcher-97-thread-1) [n:127.0.0.1:37084_solr ] o.a.s.c.c.ZkStateReader Updated live nodes from ZooKeeper... (0) -> (3)
[junit4] 2> 246455 INFO (jetty-launcher-97-thread-1) [n:127.0.0.1:37084_solr ] o.a.s.c.s.i.ZkClientClusterStateProvider Cluster at 127.0.0.1:42638/solr ready
[junit4] 2> 246472 INFO (jetty-launcher-97-thread-2) [n:127.0.0.1:38364_solr ] o.a.s.h.a.MetricsHistoryHandler No .system collection, keeping metrics history in memory.
[junit4] 2> 246505 INFO (jetty-launcher-97-thread-1) [n:127.0.0.1:37084_solr ] o.a.s.h.a.MetricsHistoryHandler No .system collection, keeping metrics history in memory.
[junit4] 2> 246566 INFO (jetty-launcher-97-thread-3) [n:127.0.0.1:43496_solr ] o.a.s.c.c.ZkStateReader Updated live nodes from ZooKeeper... (0) -> (3)
[junit4] 2> 246601 INFO (zkConnectionManagerCallback-166-thread-1) [ ] o.a.s.c.c.ConnectionManager zkClient has connected
[junit4] 2> 246620 INFO (jetty-launcher-97-thread-4) [n:127.0.0.1:37708_solr ] o.a.s.c.c.ZkStateReader Updated live nodes from ZooKeeper... (0) -> (3)
[junit4] 2> 246622 INFO (jetty-launcher-97-thread-4) [n:127.0.0.1:37708_solr ] o.a.s.c.s.i.ZkClientClusterStateProvider Cluster at 127.0.0.1:42638/solr ready
[junit4] 2> 246635 INFO (jetty-launcher-97-thread-3) [n:127.0.0.1:43496_solr ] o.a.s.c.Overseer Overseer (id=null) closing
[junit4] 2> 246655 INFO (jetty-launcher-97-thread-4) [n:127.0.0.1:37708_solr ] o.a.s.h.a.MetricsHistoryHandler No .system collection, keeping metrics history in memory.
[junit4] 2> 246778 INFO (jetty-launcher-97-thread-2) [n:127.0.0.1:38364_solr ] o.a.s.m.r.SolrJmxReporter JMX monitoring for 'solr_38364.solr.node' (registry 'solr.node') enabled at server: com.sun.jmx.mbeanserver.JmxMBeanServer@255f0d1c
[junit4] 2> 246838 INFO (jetty-launcher-97-thread-4) [n:127.0.0.1:37708_solr ] o.a.s.m.r.SolrJmxReporter JMX monitoring for 'solr_37708.solr.node' (registry 'solr.node') enabled at server: com.sun.jmx.mbeanserver.JmxMBeanServer@255f0d1c
[junit4] 2> 246851 INFO (jetty-launcher-97-thread-1) [n:127.0.0.1:37084_solr ] o.a.s.m.r.SolrJmxReporter JMX monitoring for 'solr_37084.solr.node' (registry 'solr.node') enabled at server: com.sun.jmx.mbeanserver.JmxMBeanServer@255f0d1c
[junit4] 2> 246908 INFO (jetty-launcher-97-thread-3) [n:127.0.0.1:43496_solr ] o.a.s.c.TransientSolrCoreCacheDefault Allocating transient cache for 2147483647 transient cores
[junit4] 2> 246908 INFO (jetty-launcher-97-thread-3) [n:127.0.0.1:43496_solr ] o.a.s.c.ZkController Register node as live in ZooKeeper:/live_nodes/127.0.0.1:43496_solr
[junit4] 2> 246909 INFO (jetty-launcher-97-thread-2) [n:127.0.0.1:38364_solr ] o.a.s.m.r.SolrJmxReporter JMX monitoring for 'solr_38364.solr.jvm' (registry 'solr.jvm') enabled at server: com.sun.jmx.mbeanserver.JmxMBeanServer@255f0d1c
[junit4] 2> 246909 INFO (jetty-launcher-97-thread-2) [n:127.0.0.1:38364_solr ] o.a.s.m.r.SolrJmxReporter JMX monitoring for 'solr_38364.solr.jetty' (registry 'solr.jetty') enabled at server: com.sun.jmx.mbeanserver.JmxMBeanServer@255f0d1c
[junit4] 2> 246910 INFO (jetty-launcher-97-thread-2) [n:127.0.0.1:38364_solr ] o.a.s.c.CorePropertiesLocator Found 0 core definitions underneath /home/jenkins/jenkins-slave/workspace/Lucene-Solr-Tests-7.4/solr/build/solr-core/test/J1/temp/solr.cloud.autoscaling.TestPolicyCloud_37FC3E715740A296-001/tempDir-001/node2/.
[junit4] 2> 246926 INFO (jetty-launcher-97-thread-4) [n:127.0.0.1:37708_solr ] o.a.s.m.r.SolrJmxReporter JMX monitoring for 'solr_37708.solr.jvm' (registry 'solr.jvm') enabled at server: com.sun.jmx.mbeanserver.JmxMBeanServer@255f0d1c
[junit4] 2> 246926 INFO (jetty-launcher-97-thread-4) [n:127.0.0.1:37708_solr ] o.a.s.m.r.SolrJmxReporter JMX monitoring for 'solr_37708.solr.jetty' (registry 'solr.jetty') enabled at server: com.sun.jmx.mbeanserver.JmxMBeanServer@255f0d1c
[junit4] 2> 246944 INFO (jetty-launcher-97-thread-4) [n:127.0.0.1:37708_solr ] o.a.s.c.CorePropertiesLocator Found 0 core definitions underneath /home/jenkins/jenkins-slave/workspace/Lucene-Solr-Tests-7.4/solr/build/solr-core/test/J1/temp/solr.cloud.autoscaling.TestPolicyCloud_37FC3E715740A296-001/tempDir-001/node4/.
[junit4] 2> 246948 INFO (jetty-launcher-97-thread-1) [n:127.0.0.1:37084_solr ] o.a.s.m.r.SolrJmxReporter JMX monitoring for 'solr_37084.solr.jvm' (registry 'solr.jvm') enabled at server: com.sun.jmx.mbeanserver.JmxMBeanServer@255f0d1c
[junit4] 2> 246950 INFO (zkCallback-137-thread-1) [ ] o.a.s.c.c.ZkStateReader Updated live nodes from ZooKeeper... (3) -> (4)
[junit4] 2> 246981 INFO (zkCallback-119-thread-1) [ ] o.a.s.c.c.ZkStateReader Updated live nodes from ZooKeeper... (3) -> (4)
[junit4] 2> 246981 INFO (zkCallback-145-thread-1) [ ] o.a.s.c.c.ZkStateReader Updated live nodes from ZooKeeper... (3) -> (4)
[junit4] 2> 246981 INFO (zkCallback-154-thread-1) [ ] o.a.s.c.c.ZkStateReader Updated live nodes from ZooKeeper... (3) -> (4)
[junit4] 2> 246981 INFO (jetty-launcher-97-thread-1) [n:127.0.0.1:37084_solr ] o.a.s.m.r.SolrJmxReporter JMX monitoring for 'solr_37084.solr.jetty' (registry 'solr.jetty') enabled at server: com.sun.jmx.mbeanserver.JmxMBeanServer@255f0d1c
[junit4] 2> 246982 INFO (jetty-launcher-97-thread-1) [n:127.0.0.1:37084_solr ] o.a.s.c.CorePropertiesLocator Found 0 core definitions underneath /home/jenkins/jenkins-slave/workspace/Lucene-Solr-Tests-7.4/solr/build/solr-core/test/J1/temp/solr.cloud.autoscaling.TestPolicyCloud_37FC3E715740A296-001/tempDir-001/node1/.
[junit4] 2> 247054 INFO (zkCallback-159-thread-1) [ ] o.a.s.c.c.ZkStateReader Updated live nodes from ZooKeeper... (3) -> (4)
[junit4] 2> 247057 INFO (zkCallback-165-thread-1) [ ] o.a.s.c.c.ZkStateReader Updated live nodes from ZooKeeper... (3) -> (4)
[junit4] 2> 247057 INFO (zkCallback-135-thread-1) [ ] o.a.s.c.c.ZkStateReader Updated live nodes from ZooKeeper... (3) -> (4)
[junit4] 2> 247114 INFO (jetty-launcher-97-thread-5) [n:127.0.0.1:39092_solr ] o.a.s.c.c.ZkStateReader Updated live nodes from ZooKeeper... (0) -> (4)
[junit4] 2> 247218 INFO (zkConnectionManagerCallback-173-thread-1) [ ] o.a.s.c.c.ConnectionManager zkClient has connected
[junit4] 2> 247399 INFO (jetty-launcher-97-thread-3) [n:127.0.0.1:43496_solr ] o.a.s.c.c.ZkStateReader Updated live nodes from ZooKeeper... (0) -> (4)
[junit4] 2> 247469 INFO (jetty-launcher-97-thread-5) [n:127.0.0.1:39092_solr ] o.a.s.c.Overseer Overseer (id=null) closing
[junit4] 2> 247474 INFO (jetty-launcher-97-thread-3) [n:127.0.0.1:43496_solr ] o.a.s.c.s.i.ZkClientClusterStateProvider Cluster at 127.0.0.1:42638/solr ready
[junit4] 2> 247475 INFO (jetty-launcher-97-thread-5) [n:127.0.0.1:39092_solr ] o.a.s.c.TransientSolrCoreCacheDefault Allocating transient cache for 2147483647 transient cores
[junit4] 2> 247475 INFO (jetty-launcher-97-thread-5) [n:127.0.0.1:39092_solr ] o.a.s.c.ZkController Register node as live in ZooKeeper:/live_nodes/127.0.0.1:39092_solr
[junit4] 2> 247509 INFO (jetty-launcher-97-thread-3) [n:127.0.0.1:43496_solr ] o.a.s.h.a.MetricsHistoryHandler No .system collection, keeping metrics history in memory.
[junit4] 2> 247522 INFO (zkCallback-145-thread-1) [ ] o.a.s.c.c.ZkStateReader Updated live nodes from ZooKeeper... (4) -> (5)
[junit4] 2> 247522 INFO (zkCallback-119-thread-1) [ ] o.a.s.c.c.ZkStateReader Updated live nodes from ZooKeeper... (4) -> (5)
[junit4] 2> 247522 INFO (zkCallback-154-thread-1) [ ] o.a.s.c.c.ZkStateReader Updated live nodes from ZooKeeper... (4) -> (5)
[junit4] 2> 247709 INFO (zkCallback-165-thread-1) [ ] o.a.s.c.c.ZkStateReader Updated live nodes from ZooKeeper... (4) -> (5)
[junit4] 2> 247721 INFO (zkCallback-159-thread-1) [ ] o.a.s.c.c.ZkStateReader Updated live nodes from ZooKeeper... (4) -> (5)
[junit4] 2> 247729 INFO (zkCallback-135-thread-1) [ ] o.a.s.c.c.ZkStateReader Updated live nodes from ZooKeeper... (4) -> (5)
[junit4] 2> 247737 INFO (zkCallback-137-thread-2) [ ] o.a.s.c.c.ZkStateReader Updated live nodes from ZooKeeper... (4) -> (5)
[junit4] 2> 247811 INFO (zkCallback-121-thread-1) [ ] o.a.s.c.c.ZkStateReader Updated live nodes from ZooKeeper... (4) -> (5)
[junit4] 2> 247811 INFO (zkCallback-172-thread-1) [ ] o.a.s.c.c.ZkStateReader Updated live nodes from ZooKeeper... (4) -> (5)
[junit4] 2> 247813 INFO (jetty-launcher-97-thread-3) [n:127.0.0.1:43496_solr ] o.a.s.m.r.SolrJmxReporter JMX monitoring for 'solr_43496.solr.node' (registry 'solr.node') enabled at server: com.sun.jmx.mbeanserver.JmxMBeanServer@255f0d1c
[junit4] 2> 247860 INFO (jetty-launcher-97-thread-3) [n:127.0.0.1:43496_solr ] o.a.s.m.r.SolrJmxReporter JMX monitoring for 'solr_43496.solr.jvm' (registry 'solr.jvm') enabled at server: com.sun.jmx.mbeanserver.JmxMBeanServer@255f0d1c
[junit4] 2> 247861 INFO (jetty-launcher-97-thread-3) [n:127.0.0.1:43496_solr ] o.a.s.m.r.SolrJmxReporter JMX monitoring for 'solr_43496.solr.jetty' (registry 'solr.jetty') enabled at server: com.sun.jmx.mbeanserver.JmxMBeanServer@255f0d1c
[junit4] 2> 247862 INFO (jetty-launcher-97-thread-3) [n:127.0.0.1:43496_solr ] o.a.s.c.CorePropertiesLocator Found 0 core definitions underneath /home/jenkins/jenkins-slave/workspace/Lucene-Solr-Tests-7.4/solr/build/solr-core/test/J1/temp/solr.cloud.autoscaling.TestPolicyCloud_37FC3E715740A296-001/tempDir-001/node3/.
[junit4] 2> 247891 INFO (zkConnectionManagerCallback-179-thread-1) [ ] o.a.s.c.c.ConnectionManager zkClient has connected
[junit4] 2> 247913 INFO (jetty-launcher-97-thread-5) [n:127.0.0.1:39092_solr ] o.a.s.c.c.ZkStateReader Updated live nodes from ZooKeeper... (0) -> (5)
[junit4] 2> 247914 INFO (jetty-launcher-97-thread-5) [n:127.0.0.1:39092_solr ] o.a.s.c.s.i.ZkClientClusterStateProvider Cluster at 127.0.0.1:42638/solr ready
[junit4] 2> 247948 INFO (jetty-launcher-97-thread-5) [n:127.0.0.1:39092_solr ] o.a.s.h.a.MetricsHistoryHandler No .system collection, keeping metrics history in memory.
[junit4] 2> 248109 INFO (jetty-launcher-97-thread-5) [n:127.0.0.1:39092_solr ] o.a.s.m.r.SolrJmxReporter JMX monitoring for 'solr_39092.solr.node' (registry 'solr.node') enabled at server: com.sun.jmx.mbeanserver.JmxMBeanServer@255f0d1c
[junit4] 2> 248160 INFO (jetty-launcher-97-thread-5) [n:127.0.0.1:39092_solr ] o.a.s.m.r.SolrJmxReporter JMX monitoring for 'solr_39092.solr.jvm' (registry 'solr.jvm') enabled at server: com.sun.jmx.mbeanserver.JmxMBeanServer@255f0d1c
[junit4] 2> 248161 INFO (jetty-launcher-97-thread-5) [n:127.0.0.1:39092_solr ] o.a.s.m.r.SolrJmxReporter JMX monitoring for 'solr_39092.solr.jetty' (registry 'solr.jetty') enabled at server: com.sun.jmx.mbeanserver.JmxMBeanServer@255f0d1c
[junit4] 2> 248163 INFO (jetty-launcher-97-thread-5) [n:127.0.0.1:39092_solr ] o.a.s.c.CorePropertiesLocator Found 0 core definitions underneath /home/jenkins/jenkins-slave/workspace/Lucene-Solr-Tests-7.4/solr/build/solr-core/test/J1/temp/solr.cloud.autoscaling.TestPolicyCloud_37FC3E715740A296-001/tempDir-001/node5/.
[junit4] 2> 248534 INFO (zkConnectionManagerCallback-182-thread-1) [ ] o.a.s.c.c.ConnectionManager zkClient has connected
[junit4] 2> 248729 INFO (zkConnectionManagerCallback-187-thread-1) [ ] o.a.s.c.c.ConnectionManager zkClient has connected
[junit4] 2> 248734 INFO (SUITE-TestPolicyCloud-seed#[37FC3E715740A296]-worker) [ ] o.a.s.c.c.ZkStateReader Updated live nodes from ZooKeeper... (0) -> (5)
[junit4] 2> 248735 INFO (SUITE-TestPolicyCloud-seed#[37FC3E715740A296]-worker) [ ] o.a.s.c.s.i.ZkClientClusterStateProvider Cluster at 127.0.0.1:42638/solr ready
[junit4] 2> 249540 INFO (TEST-TestPolicyCloud.testDataProvider-seed#[37FC3E715740A296]) [ ] o.a.s.SolrTestCaseJ4 ###Starting testDataProvider
[junit4] 2> 249841 INFO (qtp1585544375-293) [n:127.0.0.1:37084_solr ] o.a.s.h.a.CollectionsHandler Invoked Collection Action :create with params shards=shard1&replicationFactor=2&collection.configName=conf&name=policiesTest&router.name=implicit&nrtReplicas=2&action=CREATE&wt=javabin&version=2 and sendToOCPQueue=true
[junit4] 2> 249885 INFO (OverseerThreadFactory-166-thread-1) [ ] o.a.s.c.a.c.CreateCollectionCmd Create collection policiesTest
[junit4] 2> 250024 INFO (OverseerStateUpdate-72821630449483788-127.0.0.1:38364_solr-n_0000000000) [ ] o.a.s.c.o.SliceMutator createReplica() {
[junit4] 2> "operation":"ADDREPLICA",
[junit4] 2> "collection":"policiesTest",
[junit4] 2> "shard":"shard1",
[junit4] 2> "core":"policiesTest_shard1_replica_n1",
[junit4] 2> "state":"down",
[junit4] 2> "base_url":"https://127.0.0.1:37084/solr",
[junit4] 2> "type":"NRT",
[junit4] 2> "waitForFinalState":"false"}
[junit4] 2> 250027 INFO (OverseerStateUpdate-72821630449483788-127.0.0.1:38364_solr-n_0000000000) [ ] o.a.s.c.o.SliceMutator createReplica() {
[junit4] 2> "operation":"ADDREPLICA",
[junit4] 2> "collection":"policiesTest",
[junit4] 2> "shard":"shard1",
[junit4] 2> "core":"policiesTest_shard1_replica_n2",
[junit4] 2> "state":"down",
[junit4] 2> "base_url":"https://127.0.0.1:43496/solr",
[junit4] 2> "type":"NRT",
[junit4] 2> "waitForFinalState":"false"}
[junit4] 2> 250457 INFO (qtp1585544375-296) [n:127.0.0.1:37084_solr x:policiesTest_shard1_replica_n1] o.a.s.h.a.CoreAdminOperation core create command qt=/admin/cores&coreNodeName=core_node3&collection.configName=conf&newCollection=true&name=policiesTest_shard1_replica_n1&action=CREATE&numShards=1&collection=policiesTest&shard=shard1&wt=javabin&version=2&replicaType=NRT
[junit4] 2> 250482 INFO (qtp1585544375-296) [n:127.0.0.1:37084_solr x:policiesTest_shard1_replica_n1] o.a.s.c.TransientSolrCoreCacheDefault Allocating transient cache for 2147483647 transient cores
[junit4] 2> 250497 INFO (qtp1621710877-285) [n:127.0.0.1:43496_solr x:policiesTest_shard1_replica_n2] o.a.s.h.a.CoreAdminOperation core create command qt=/admin/cores&coreNodeName=core_node4&collection.configName=conf&newCollection=true&name=policiesTest_shard1_replica_n2&action=CREATE&numShards=1&collection=policiesTest&shard=shard1&wt=javabin&version=2&replicaType=NRT
[junit4] 2> 251555 INFO (qtp1621710877-285) [n:127.0.0.1:43496_solr c:policiesTest s:shard1 r:core_node4 x:policiesTest_shard1_replica_n2] o.a.s.c.SolrConfig Using Lucene MatchVersion: 7.4.0
[junit4] 2> 251583 INFO (qtp1621710877-285) [n:127.0.0.1:43496_solr c:policiesTest s:shard1 r:core_node4 x:policiesTest_shard1_replica_n2] o.a.s.s.IndexSchema [policiesTest_shard1_replica_n2] Schema name=minimal
[junit4] 2> 251599 INFO (qtp1621710877-285) [n:127.0.0.1:43496_solr c:policiesTest s:shard1 r:core_node4 x:policiesTest_shard1_replica_n2] o.a.s.s.IndexSchema Loaded schema minimal/1.1 with uniqueid field id
[junit4] 2> 251599 INFO (qtp1621710877-285) [n:127.0.0.1:43496_solr c:policiesTest s:shard1 r:core_node4 x:policiesTest_shard1_replica_n2] o.a.s.c.CoreContainer Creating SolrCore 'policiesTest_shard1_replica_n2' using configuration from collection policiesTest, trusted=true
[junit4] 2> 251668 INFO (qtp1621710877-285) [n:127.0.0.1:43496_solr c:policiesTest s:shard1 r:core_node4 x:policiesTest_shard1_replica_n2] o.a.s.m.r.SolrJmxReporter JMX monitoring for 'solr_43496.solr.core.policiesTest.shard1.replica_n2' (registry 'solr.core.policiesTest.shard1.replica_n2') enabled at server: com.sun.jmx.mbeanserver.JmxMBeanServer@255f0d1c
[junit4] 2> 251669 INFO (qtp1621710877-285) [n:127.0.0.1:43496_solr c:policiesTest s:shard1 r:core_node4 x:policiesTest_shard1_replica_n2] o.a.s.c.SolrCore solr.RecoveryStrategy.Builder
[junit4] 2> 251669 INFO (qtp1621710877-285) [n:127.0.0.1:43496_solr c:policiesTest s:shard1 r:core_node4 x:policiesTest_shard1_replica_n2] o.a.s.c.SolrCore [[policiesTest_shard1_replica_n2] ] Opening new SolrCore at [/home/jenkins/jenkins-slave/workspace/Lucene-Solr-Tests-7.4/solr/build/solr-core/test/J1/temp/solr.cloud.autoscaling.TestPolicyCloud_37FC3E715740A296-001/tempDir-001/node3/policiesTest_shard1_replica_n2], dataDir=[/home/jenkins/jenkins-slave/workspace/Lucene-Solr-Tests-7.4/solr/build/solr-core/test/J1/temp/solr.cloud.autoscaling.TestPolicyCloud_37FC3E715740A296-001/tempDir-001/node3/./policiesTest_shard1_replica_n2/data/]
[junit4] 2> 251695 INFO (qtp1585544375-296) [n:127.0.0.1:37084_solr c:policiesTest s:shard1 r:core_node3 x:policiesTest_shard1_replica_n1] o.a.s.c.SolrConfig Using Lucene MatchVersion: 7.4.0
[junit4] 2> 251804 INFO (qtp1585544375-296) [n:127.0.0.1:37084_solr c:policiesTest s:shard1 r:core_node3 x:policiesTest_shard1_replica_n1] o.a.s.s.IndexSchema [policiesTest_shard1_replica_n1] Schema name=minimal
[junit4] 2> 251840 INFO (qtp1585544375-296) [n:127.0.0.1:37084_solr c:policiesTest s:shard1 r:core_node3 x:policiesTest_shard1_replica_n1] o.a.s.s.IndexSchema Loaded schema minimal/1.1 with uniqueid field id
[junit4] 2> 251841 INFO (qtp1585544375-296) [n:127.0.0.1:37084_solr c:policiesTest s:shard1 r:core_node3 x:policiesTest_shard1_replica_n1] o.a.s.c.CoreContainer Creating SolrCore 'policiesTest_shard1_replica_n1' using configuration from collection policiesTest, trusted=true
[junit4] 2> 251875 INFO (qtp1585544375-296) [n:127.0.0.1:37084_solr c:policiesTest s:shard1 r:core_node3 x:policiesTest_shard1_replica_n1] o.a.s.m.r.SolrJmxReporter JMX monitoring for 'solr_37084.solr.core.policiesTest.shard1.replica_n1' (registry 'solr.core.policiesTest.shard1.replica_n1') enabled at server: com.sun.jmx.mbeanserver.JmxMBeanServer@255f0d1c
[junit4] 2> 251875 INFO (qtp1585544375-296) [n:127.0.0.1:37084_solr c:policiesTest s:shard1 r:core_node3 x:policiesTest_shard1_replica_n1] o.a.s.c.SolrCore solr.RecoveryStrategy.Builder
[junit4] 2> 251875 INFO (qtp1585544375-296) [n:127.0.0.1:37084_solr c:policiesTest s:shard1 r:core_node3 x:policiesTest_shard1_replica_n1] o.a.s.c.SolrCore [[policiesTest_shard1_replica_n1] ] Opening new SolrCore at [/home/jenkins/jenkins-slave/workspace/Lucene-Solr-Tests-7.4/solr/build/solr-core/test/J1/temp/solr.cloud.autoscaling.TestPolicyCloud_37FC3E715740A296-001/tempDir-001/node1/policiesTest_shard1_replica_n1], dataDir=[/home/jenkins/jenkins-slave/workspace/Lucene-Solr-Tests-7.4/solr/build/solr-core/test/J1/temp/solr.cloud.autoscaling.TestPolicyCloud_37FC3E715740A296-001/tempDir-001/node1/./policiesTest_shard1_replica_n1/data/]
[junit4] 2> 253096 INFO (qtp1621710877-285) [n:127.0.0.1:43496_solr c:policiesTest s:shard1 r:core_node4 x:policiesTest_shard1_replica_n2] o.a.s.u.UpdateHandler Using UpdateLog implementation: org.apache.solr.update.UpdateLog
[junit4] 2> 253096 INFO (qtp1621710877-285) [n:127.0.0.1:43496_solr c:policiesTest s:shard1 r:core_node4 x:policiesTest_shard1_replica_n2] o.a.s.u.UpdateLog Initializing UpdateLog: dataDir=null defaultSyncLevel=FLUSH numRecordsToKeep=100 maxNumLogsToKeep=10 numVersionBuckets=65536
[junit4] 2> 253098 INFO (qtp1621710877-285) [n:127.0.0.1:43496_solr c:policiesTest s:shard1 r:core_node4 x:policiesTest_shard1_replica_n2] o.a.s.u.CommitTracker Hard AutoCommit: disabled
[junit4] 2> 253098 INFO (qtp1621710877-285) [n:127.0.0.1:43496_solr c:policiesTest s:shard1 r:core_node4 x:policiesTest_shard1_replica_n2] o.a.s.u.CommitTracker Soft AutoCommit: disabled
[junit4] 2> 253115 INFO (qtp1585544375-296) [n:127.0.0.1:37084_solr c:policiesTest s:shard1 r:core_node3 x:policiesTest_shard1_replica_n1] o.a.s.u.UpdateHandler Using UpdateLog implementation: org.apache.solr.update.UpdateLog
[junit4] 2> 253115 INFO (qtp1585544375-296) [n:127.0.0.1:37084_solr c:policiesTest s:shard1 r:core_node3 x:policiesTest_shard1_replica_n1] o.a.s.u.UpdateLog Initializing UpdateLog: dataDir=null defaultSyncLevel=FLUSH numRecordsToKeep=100 maxNumLogsToKeep=10 numVersionBuckets=65536
[junit4] 2> 253117 INFO (qtp1585544375-296) [n:127.0.0.1:37084_solr c:policiesTest s:shard1 r:core_node3 x:policiesTest_shard1_replica_n1] o.a.s.u.CommitTracker Hard AutoCommit: disabled
[junit4] 2> 253117 INFO (qtp1585544375-296) [n:127.0.0.1:37084_solr c:policiesTest s:shard1 r:core_node3 x:policiesTest_shard1_replica_n1] o.a.s.u.CommitTracker Soft AutoCommit: disabled
[junit4] 2> 253133 INFO (qtp1621710877-285) [n:127.0.0.1:43496_solr c:policiesTest s:shard1 r:core_node4 x:policiesTest_shard1_replica_n2] o.a.s.s.SolrIndexSearcher Opening [Searcher@65357509[policiesTest_shard1_replica_n2] main]
[junit4] 2> 253140 INFO (qtp1585544375-296) [n:127.0.0.1:37084_solr c:policiesTest s:shard1 r:core_node3 x:policiesTest_shard1_replica_n1] o.a.s.s.SolrIndexSearcher Opening [Searcher@50a20c62[policiesTest_shard1_replica_n1] main]
[junit4] 2> 253156 INFO (qtp1585544375-296) [n:127.0.0.1:37084_solr c:policiesTest s:shard1 r:core_node3 x:policiesTest_shard1_replica_n1] o.a.s.r.ManagedResourceStorage Configured ZooKeeperStorageIO with znodeBase: /configs/conf
[junit4] 2> 253157 INFO (qtp1585544375-296) [n:127.0.0.1:37084_solr c:policiesTest s:shard1 r:core_node3 x:policiesTest_shard1_replica_n1] o.a.s.r.ManagedResourceStorage Loaded null at path _rest_managed.json using ZooKeeperStorageIO:path=/configs/conf
[junit4] 2> 253158 INFO (qtp1585544375-296) [n:127.0.0.1:37084_solr c:policiesTest s:shard1 r:core_node3 x:policiesTest_shard1_replica_n1] o.a.s.h.ReplicationHandler Commits will be reserved for 10000ms.
[junit4] 2> 253177 INFO (qtp1585544375-296) [n:127.0.0.1:37084_solr c:policiesTest s:shard1 r:core_node3 x:policiesTest_shard1_replica_n1] o.a.s.u.UpdateLog Could not find max version in index or recent updates, using new clock 1603609172336705536
[junit4] 2> 253226 INFO (qtp1621710877-285) [n:127.0.0.1:43496_solr c:policiesTest s:shard1 r:core_node4 x:policiesTest_shard1_replica_n2] o.a.s.r.ManagedResourceStorage Configured ZooKeeperStorageIO with znodeBase: /configs/conf
[junit4] 2> 253226 INFO (searcherExecutor-187-thread-1-processing-n:127.0.0.1:37084_solr x:policiesTest_shard1_replica_n1 c:policiesTest s:shard1 r:core_node3) [n:127.0.0.1:37084_solr c:policiesTest s:shard1 r:core_node3 x:policiesTest_shard1_replica_n1] o.a.s.c.SolrCore [policiesTest_shard1_replica_n1] Registered new searcher Searcher@50a20c62[policiesTest_shard1_replica_n1] main{ExitableDirectoryReader(UninvertingDirectoryReader())}
[junit4] 2> 253227 INFO (qtp1621710877-285) [n:127.0.0.1:43496_solr c:policiesTest s:shard1 r:core_node4 x:policiesTest_shard1_replica_n2] o.a.s.r.ManagedResourceStorage Loaded null at path _rest_managed.json using ZooKeeperStorageIO:path=/configs/conf
[junit4] 2> 253228 INFO (qtp1621710877-285) [n:127.0.0.1:43496_solr c:policiesTest s:shard1 r:core_node4 x:policiesTest_shard1_replica_n2] o.a.s.h.ReplicationHandler Commits will be reserved for 10000ms.
[junit4] 2> 253228 INFO (qtp1621710877-285) [n:127.0.0.1:43496_solr c:policiesTest s:shard1 r:core_node4 x:policiesTest_shard1_replica_n2] o.a.s.u.UpdateLog Could not find max version in index or recent updates, using new clock 1603609172390182912
[junit4] 2> 253263 INFO (searcherExecutor-186-thread-1-processing-n:127.0.0.1:43496_solr x:policiesTest_shard1_replica_n2 c:policiesTest s:shard1 r:core_node4) [n:127.0.0.1:43496_solr c:policiesTest s:shard1 r:core_node4 x:policiesTest_shard1_replica_n2] o.a.s.c.SolrCore [policiesTest_shard1_replica_n2] Registered new searcher Searcher@65357509[policiesTest_shard1_replica_n2] main{ExitableDirectoryReader(UninvertingDirectoryReader())}
[junit4] 2> 253307 INFO (qtp1585544375-296) [n:127.0.0.1:37084_solr c:policiesTest s:shard1 r:core_node3 x:policiesTest_shard1_replica_n1] o.a.s.c.ZkShardTerms Successful update of terms at /collections/policiesTest/terms/shard1 to Terms{values={core_node3=0}, version=0}
[junit4] 2> 253354 INFO (qtp1621710877-285) [n:127.0.0.1:43496_solr c:policiesTest s:shard1 r:core_node4 x:policiesTest_shard1_replica_n2] o.a.s.c.ZkShardTerms Successful update of terms at /collections/policiesTest/terms/shard1 to Terms{values={core_node3=0, core_node4=0}, version=1}
[junit4] 2> 253441 INFO (qtp1621710877-285) [n:127.0.0.1:43496_solr c:policiesTest s:shard1 r:core_node4 x:policiesTest_shard1_replica_n2] o.a.s.c.ShardLeaderElectionContext Enough replicas found to continue.
[junit4] 2> 253441 INFO (qtp1621710877-285) [n:127.0.0.1:43496_solr c:policiesTest s:shard1 r:core_node4 x:policiesTest_shard1_replica_n2] o.a.s.c.ShardLeaderElectionContext I may be the new leader - try and sync
[junit4] 2> 253441 INFO (qtp1621710877-285) [n:127.0.0.1:43496_solr c:policiesTest s:shard1 r:core_node4 x:policiesTest_shard1_replica_n2] o.a.s.c.SyncStrategy Sync replicas to https://127.0.0.1:43496/solr/policiesTest_shard1_replica_n2/
[junit4] 2> 253461 INFO (qtp1621710877-285) [n:127.0.0.1:43496_solr c:policiesTest s:shard1 r:core_node4 x:policiesTest_shard1_replica_n2] o.a.s.u.PeerSync PeerSync: core=policiesTest_shard1_replica_n2 url=https://127.0.0.1:43496/solr START replicas=[https://127.0.0.1:37084/solr/policiesTest_shard1_replica_n1/] nUpdates=100
[junit4] 2> 253643 INFO (qtp1585544375-290) [n:127.0.0.1:37084_solr c:policiesTest s:shard1 r:core_node3 x:policiesTest_shard1_replica_n1] o.a.s.c.S.Request [policiesTest_shard1_replica_n1] webapp=/solr path=/get params={distrib=false&qt=/get&fingerprint=false&getVersions=100&wt=javabin&version=2} status=0 QTime=4
[junit4] 2> 253762 INFO (qtp1621710877-285) [n:127.0.0.1:43496_solr c:policiesTest s:shard1 r:core_node4 x:policiesTest_shard1_replica_n2] o.a.s.u.PeerSync PeerSync: core=policiesTest_shard1_replica_n2 url=https://127.0.0.1:43496/solr DONE. We have no versions. sync failed.
[junit4] 2> 253763 INFO (qtp1621710877-285) [n:127.0.0.1:43496_solr c:policiesTest s:shard1 r:core_node4 x:policiesTest_shard1_replica_n2] o.a.s.c.SyncStrategy Leader's attempt to sync with shard failed, moving to the next candidate
[junit4] 2> 253763 INFO (qtp1621710877-285) [n:127.0.0.1:43496_solr c:policiesTest s:shard1 r:core_node4 x:policiesTest_shard1_replica_n2] o.a.s.c.ShardLeaderElectionContext We failed sync, but we have no versions - we can't sync in that case - we were active before, so become leader anyway
[junit4] 2> 253763 INFO (qtp1621710877-285) [n:127.0.0.1:43496_solr c:policiesTest s:shard1 r:core_node4 x:policiesTest_shard1_replica_n2] o.a.s.c.ShardLeaderElectionContext Found all replicas participating in election, clear LIR
[junit4] 2> 253784 INFO (qtp1621710877-285) [n:127.0.0.1:43496_solr c:policiesTest s:shard1 r:core_node4 x:policiesTest_shard1_replica_n2] o.a.s.c.ShardLeaderElectionContext I am the new leader: https://127.0.0.1:43496/solr/policiesTest_shard1_replica_n2/ shard1
[junit4] 2> 253887 INFO (qtp1621710877-285) [n:127.0.0.1:43496_solr c:policiesTest s:shard1 r:core_node4 x:policiesTest_shard1_replica_n2] o.a.s.c.ZkController I am the leader, no recovery necessary
[junit4] 2> 253906 INFO (qtp1621710877-285) [n:127.0.0.1:43496_solr c:policiesTest s:shard1 r:core_node4 x:policiesTest_shard1_replica_n2] o.a.s.s.HttpSolrCall [admin] webapp=null path=/admin/cores params={qt=/admin/cores&coreNodeName=core_node4&collection.configName=conf&newCollection=true&name=policiesTest_shard1_replica_n2&action=CREATE&numShards=1&collection=policiesTest&shard=shard1&wt=javabin&version=2&replicaType=NRT} status=0 QTime=3410
[junit4] 2> 254039 INFO (zkCallback-135-thread-1) [ ] o.a.s.c.c.ZkStateReader A cluster state change: [WatchedEvent state:SyncConnected type:NodeDataChanged path:/collections/policiesTest/state.json] for collection [policiesTest] has occurred - updating... (live nodes size: [5])
[junit4] 2> 254437 INFO (qtp1585544375-296) [n:127.0.0.1:37084_solr c:policiesTest s:shard1 r:core_node3 x:policiesTest_shard1_replica_n1] o.a.s.s.HttpSolrCall [admin] webapp=null path=/admin/cores params={qt=/admin/cores&coreNodeName=core_node3&collection.configName=conf&newCollection=true&name=policiesTest_shard1_replica_n1&action=CREATE&numShards=1&collection=policiesTest&shard=shard1&wt=javabin&version=2&replicaType=NRT} status=0 QTime=3980
[junit4] 2> 254492 INFO (qtp1585544375-293) [n:127.0.0.1:37084_solr ] o.a.s.h.a.CollectionsHandler Wait for new collection to be active for at most 30 seconds. Check all shard replicas
[junit4] 2> 254539 INFO (zkCallback-145-thread-2) [ ] o.a.s.c.c.ZkStateReader A cluster state change: [WatchedEvent state:SyncConnected type:NodeDataChanged path:/collections/policiesTest/state.json] for collection [policiesTest] has occurred - updating... (live nodes size: [5])
[junit4] 2> 254539 INFO (zkCallback-135-thread-1) [ ] o.a.s.c.c.ZkStateReader A cluster state change: [WatchedEvent state:SyncConnected type:NodeDataChanged path:/collections/policiesTest/state.json] for collection [policiesTest] has occurred - updating... (live nodes size: [5])
[junit4] 2> 255492 INFO (qtp1585544375-293) [n:127.0.0.1:37084_solr ] o.a.s.s.HttpSolrCall [admin] webapp=null path=/admin/collections params={shards=shard1&replicationFactor=2&collection.configName=conf&name=policiesTest&router.name=implicit&nrtReplicas=2&action=CREATE&wt=javabin&version=2} status=0 QTime=5650
[junit4] 2> 255629 INFO (qtp1585544375-289) [n:127.0.0.1:37084_solr ] o.a.s.s.HttpSolrCall [admin] webapp=null path=/admin/metrics params={prefix=CONTAINER.fs.usableSpace,CORE.coreName,os.systemLoadAverage,memory.heap.usage&wt=javabin&version=2&group=solr.jvm,solr.node,solr.core} status=0 QTime=87
[junit4] 2> 255649 INFO (qtp1585544375-296) [n:127.0.0.1:37084_solr ] o.a.s.h.a.CollectionsHandler Invoked Collection Action :addrole with params node=127.0.0.1:38364_solr&role=overseer&action=ADDROLE&wt=javabin&version=2 and sendToOCPQueue=true
[junit4] 2> 255660 INFO (OverseerCollectionConfigSetProcessor-72821630449483788-127.0.0.1:38364_solr-n_0000000000) [ ] o.a.s.c.OverseerTaskQueue Response ZK path: /overseer/collection-queue-work/qnr-0000000000 doesn't exist. Requestor may have disconnected from ZooKeeper
[junit4] 2> 255660 INFO (OverseerThreadFactory-166-thread-2) [ ] o.a.s.c.a.c.OverseerRoleCmd Overseer role added to 127.0.0.1:38364_solr
[junit4] 2> 255672 INFO (qtp1585544375-296) [n:127.0.0.1:37084_solr ] o.a.s.s.HttpSolrCall [admin] webapp=null path=/admin/collections params={node=127.0.0.1:38364_solr&role=overseer&action=ADDROLE&wt=javabin&version=2} status=0 QTime=23
[junit4] 2> 256722 INFO (qtp158971361-279) [n:127.0.0.1:38364_solr ] o.a.s.s.HttpSolrCall [admin] webapp=null path=/admin/metrics params={wt=javabin&version=2&key=solr.jvm:system.properties:java.vendor&key=solr.jvm:system.properties:java.version} status=0 QTime=2
[junit4] 2> 256742 INFO (TEST-TestPolicyCloud.testDataProvider-seed#[37FC3E715740A296]) [ ] o.a.s.c.c.ZkStateReader Updated live nodes from ZooKeeper... (0) -> (5)
[junit4] 2> 256766 INFO (qtp1585544375-289) [n:127.0.0.1:37084_solr ] o.a.s.h.a.CollectionsHandler Invoked Collection Action :delete with params name=policiesTest&action=DELETE&wt=javabin&version=2 and sendToOCPQueue=true
[junit4] 2> 256769 INFO (OverseerCollectionConfigSetProcessor-72821630449483788-127.0.0.1:38364_solr-n_0000000000) [ ] o.a.s.c.OverseerTaskQueue Response ZK path: /overseer/collection-queue-work/qnr-0000000002 doesn't exist. Requestor may have disconnected from ZooKeeper
[junit4] 2> 256799 INFO (OverseerThreadFactory-166-thread-3) [ ] o.a.s.c.a.c.OverseerCollectionMessageHandler Executing Collection Cmd=action=UNLOAD&deleteInstanceDir=true&deleteDataDir=true&deleteMetricsHistory=true, asyncId=null
[junit4] 2> 256843 INFO (qtp1621710877-288) [n:127.0.0.1:43496_solr x:policiesTest_shard1_replica_n2] o.a.s.m.SolrMetricManager Closing metric reporters for registry=solr.core.policiesTest.shard1.replica_n2, tag=null
[junit4] 2> 256843 INFO (qtp1621710877-288) [n:127.0.0.1:43496_solr x:policiesTest_shard1_replica_n2] o.a.s.m.r.SolrJmxReporter Closing reporter [org.apache.solr.metrics.reporters.SolrJmxReporter@69cf69a6: rootName = solr_43496, domain = solr.core.policiesTest.shard1.replica_n2, service url = null, agent id = null] for registry solr.core.policiesTest.shard1.replica_n2 / com.codahale.metrics.MetricRegistry@38d74c64
[junit4] 2> 256843 INFO (qtp1585544375-294) [n:127.0.0.1:37084_solr x:policiesTest_shard1_replica_n1] o.a.s.m.SolrMetricManager Closing metric reporters for registry=solr.core.policiesTest.shard1.replica_n1, tag=null
[junit4] 2> 256844 INFO (qtp1585544375-294) [n:127.0.0.1:37084_solr x:policiesTest_shard1_replica_n1] o.a.s.m.r.SolrJmxReporter Closing reporter [org.apache.solr.metrics.reporters.SolrJmxReporter@7ed4ea7a: rootName = solr_37084, domain = solr.core.policiesTest.shard1.replica_n1, service url = null, agent id = null] for registry solr.core.policiesTest.shard1.replica_n1 / com.codahale.metrics.MetricRegistry@3a6bfccd
[junit4] 2> 256900 INFO (qtp1585544375-294) [n:127.0.0.1:37084_solr x:policiesTest_shard1_replica_n1] o.a.s.c.SolrCore [policiesTest_shard1_replica_n1] CLOSING SolrCore org.apache.solr.core.SolrCore@11e718c6
[junit4] 2> 256901 INFO (qtp1585544375-294) [n:127.0.0.1:37084_solr x:policiesTest_shard1_replica_n1] o.a.s.m.SolrMetricManager Closing metric reporters for registry=solr.core.policiesTest.shard1.replica_n1, tag=11e718c6
[junit4] 2> 256901 INFO (qtp1585544375-294) [n:127.0.0.1:37084_solr x:policiesTest_shard1_replica_n1] o.a.s.m.SolrMetricManager Closing metric reporters for registry=solr.collection.policiesTest.shard1.leader, tag=11e718c6
[junit4] 2> 256970 INFO (qtp1621710877-288) [n:127.0.0.1:43496_solr x:policiesTest_shard1_replica_n2] o.a.s.c.SolrCore [policiesTest_shard1_replica_n2] CLOSING SolrCore org.apache.solr.core.SolrCore@18930fec
[junit4] 2> 256970 INFO (qtp1621710877-288) [n:127.0.0.1:43496_solr x:policiesTest_shard1_replica_n2] o.a.s.m.SolrMetricManager Closing metric reporters for registry=solr.core.policiesTest.shard1.replica_n2, tag=18930fec
[junit4] 2> 256970 INFO (qtp1621710877-288) [n:127.0.0.1:43496_solr x:policiesTest_shard1_replica_n2] o.a.s.m.SolrMetricManager Closing metric reporters for registry=solr.collection.policiesTest.shard1.leader, tag=18930fec
[junit4] 2> 257139 INFO (qtp1585544375-294) [n:127.0.0.1:37084_solr x:policiesTest_shard1_replica_n1] o.a.s.c.ZkShardTerms Successful update of terms at /collections/policiesTest/terms/shard1 to Terms{values={core_node4=0}, version=2}
[junit4] 2> 257140 INFO (qtp1621710877-288) [n:127.0.0.1:43496_solr x:policiesTest_shard1_replica_n2] o.a.s.c.ZkShardTerms Failed to save terms, version is not a match, retrying
[junit4] 2> 257215 INFO (qtp1621710877-288) [n:127.0.0.1:43496_solr x:policiesTest_shard1_replica_n2] o.a.s.c.ZkShardTerms Successful update of terms at /collections/policiesTest/terms/shard1 to Terms{values={}, version=3}
[junit4] 2> 257215 INFO (qtp1585544375-294) [n:127.0.0.1:37084_solr x:policiesTest_shard1_replica_n1] o.a.s.c.ShardLeaderElectionContextBase No version found for ephemeral leader parent node, won't remove previous leader registration.
[junit4] 2> 257229 INFO (qtp1585544375-294) [n:127.0.0.1:37084_solr x:policiesTest_shard1_replica_n1] o.a.s.s.HttpSolrCall [admin] webapp=null path=/admin/cores params={deleteInstanceDir=true&deleteMetricsHistory=true&core=policiesTest_shard1_replica_n1&qt=/admin/cores&deleteDataDir=true&action=UNLOAD&wt=javabin&version=2} status=0 QTime=426
[junit4] 2> 257249 WARN (zkCallback-145-thread-2) [ ] o.a.s.c.LeaderElector Our node is no longer in line to be leader
[junit4] 2> 257250 INFO (qtp1621710877-288) [n:127.0.0.1:43496_solr x:policiesTest_shard1_replica_n2] o.a.s.s.HttpSolrCall [admin] webapp=null path=/admin/cores params={deleteInstanceDir=true&deleteMetricsHistory=true&core=policiesTest_shard1_replica_n2&qt=/admin/cores&deleteDataDir=true&action=UNLOAD&wt=javabin&version=2} status=0 QTime=446
[junit4] 2> 257270 INFO (zkCallback-145-thread-2) [ ] o.a.s.c.c.ZkStateReader A cluster state change: [WatchedEvent state:SyncConnected type:NodeDataChanged path:/collections/policiesTest/state.json] for collection [policiesTest] has occurred - updating... (live nodes size: [5])
[junit4] 2> 257270 INFO (zkCallback-135-thread-1) [ ] o.a.s.c.c.ZkStateReader A cluster state change: [WatchedEvent state:SyncConnected type:NodeDataChanged path:/collections/policiesTest/state.json] for collection [policiesTest] has occurred - updating... (live nodes size: [5])
[junit4] 2> 258066 INFO (qtp1585544375-289) [n:127.0.0.1:37084_solr ] o.a.s.s.HttpSolrCall [admin] webapp=null path=/admin/collections params={name=policiesTest&action=DELETE&wt=javabin&version=2} status=0 QTime=1300
[junit4] 2> 258068 INFO (TEST-TestPolicyCloud.testDataProvider-seed#[37FC3E715740A296]) [ ] o.a.s.SolrTestCaseJ4 ###Ending testDataProvider
[junit4] 2> 258243 INFO (TEST-TestPolicyCloud.testCreateCollectionSplitShard-seed#[37FC3E715740A296]) [ ] o.a.s.SolrTestCaseJ4 ###Starting testCreateCollectionSplitShard
[junit4] 2> 258450 INFO (qtp1585544375-294) [n:127.0.0.1:37084_solr ] o.a.s.s.HttpSolrCall [admin] webapp=null path=/admin/metrics params={prefix=CONTAINER.fs.usableSpace,CORE.coreName&wt=javabin&version=2&group=solr.node,solr.core} status=0 QTime=0
[junit4] 2> 258556 INFO (qtp158971361-282) [n:127.0.0.1:38364_solr ] o.a.s.s.HttpSolrCall [admin] webapp=null path=/admin/metrics params={prefix=CONTAINER.fs.usableSpace,CORE.coreName&wt=javabin&version=2&group=solr.node,solr.core} status=0 QTime=0
[junit4] 2> 258818 INFO (OverseerCollectionConfigSetProcessor-72821630449483788-127.0.0.1:38364_solr-n_0000000000) [ ] o.a.s.c.OverseerTaskQueue Response ZK path: /overseer/collection-queue-work/qnr-0000000004 doesn't exist. Requestor may have disconnected from ZooKeeper
[junit4] 2> 259010 INFO (qtp1958959686-315) [n:127.0.0.1:37708_solr ] o.a.s.s.HttpSolrCall [admin] webapp=null path=/admin/metrics params={prefix=CONTAINER.fs.usableSpace,CORE.coreName&wt=javabin&version=2&group=solr.node,solr.core} status=0 QTime=0
[junit4] 2> 259279 INFO (qtp673757323-306) [n:127.0.0.1:39092_solr ] o.a.s.s.HttpSolrCall [admin] webapp=null path=/admin/metrics params={prefix=CONTAINER.fs.usableSpace,CORE.coreName&wt=javabin&version=2&group=solr.node,solr.core} status=0 QTime=0
[junit4] 2> 259452 INFO (qtp1621710877-288) [n:127.0.0.1:43496_solr ] o.a.s.s.HttpSolrCall [admin] webapp=null path=/admin/metrics params={prefix=CONTAINER.fs.usableSpace,CORE.coreName&wt=javabin&version=2&group=solr.node,solr.core} status=0 QTime=0
[junit4] 2> 259504 INFO (qtp1585544375-296) [n:127.0.0.1:37084_solr ] o.a.s.s.HttpSolrCall [admin] webapp=null path=/cluster/autoscaling params={wt=javabin&version=2} status=0 QTime=1217
[junit4] 2> 259507 INFO (qtp1585544375-289) [n:127.0.0.1:37084_solr ] o.a.s.h.a.CollectionsHandler Invoked Collection Action :create with params replicationFactor=2&collection.configName=conf&name=testCreateCollectionSplitShard&nrtReplicas=2&action=CREATE&numShards=1&wt=javabin&version=2&policy=c1 and sendToOCPQueue=true
[junit4] 2> 259573 INFO (OverseerThreadFactory-166-thread-4) [ ] o.a.s.c.a.c.CreateCollectionCmd Create collection testCreateCollectionSplitShard
[junit4] 2> 259796 INFO (qtp1585544375-294) [n:127.0.0.1:37084_solr ] o.a.s.s.HttpSolrCall [admin] webapp=null path=/admin/metrics params={prefix=CONTAINER.fs.usableSpace,CORE.coreName&wt=javabin&version=2&group=solr.node,solr.core} status=0 QTime=0
[junit4] 2> 259981 INFO (qtp158971361-282) [n:127.0.0.1:38364_solr ] o.a.s.s.HttpSolrCall [admin] webapp=null path=/admin/metrics params={prefix=CONTAINER.fs.usableSpace,CORE.coreName&wt=javabin&version=2&group=solr.node,solr.core} status=0 QTime=0
[junit4] 2> 260124 INFO (qtp1958959686-318) [n:127.0.0.1:37708_solr ] o.a.s.s.HttpSolrCall [admin] webapp=null path=/admin/metrics params={prefix=CONTAINER.fs.usableSpace,CORE.coreName&wt=javabin&version=2&group=solr.node,solr.core} status=0 QTime=0
[junit4] 2> 260236 INFO (qtp673757323-306) [n:127.0.0.1:39092_solr ] o.a.s.s.HttpSolrCall [admin] webapp=null path=/admin/metrics params={prefix=CONTAINER.fs.usableSpace,CORE.coreName&wt=javabin&version=2&group=solr.node,solr.core} status=0 QTime=0
[junit4] 2> 260318 INFO (qtp1621710877-288) [n:127.0.0.1:43496_solr ] o.a.s.s.HttpSolrCall [admin] webapp=null path=/admin/metrics params={prefix=CONTAINER.fs.usableSpace,CORE.coreName&wt=javabin&version=2&group=solr.node,solr.core} status=0 QTime=0
[junit4] 2> 260522 INFO (OverseerThreadFactory-166-thread-4) [ ] o.a.s.c.s.c.a.PolicyHelper returnSession, curr-time 11658289493 sessionWrapper.createTime 11658289290461996, this.sessionWrapper.createTime 11658289290461996
[junit4] 2> 260706 INFO (OverseerStateUpdate-72821630449483788-127.0.0.1:38364_solr-n_0000000000) [ ] o.a.s.c.o.SliceMutator createReplica() {
[junit4] 2> "operation":"ADDREPLICA",
[junit4] 2> "collection":"testCreateCollectionSplitShard",
[junit4] 2> "shard":"shard1",
[junit4] 2> "core":"testCreateCollectionSplitShard_shard1_replica_n1",
[junit4] 2> "state":"down",
[junit4] 2> "base_url":"https://127.0.0.1:37708/solr",
[junit4] 2> "type":"NRT",
[junit4] 2> "waitForFinalState":"false"}
[junit4] 2> 260761 INFO (OverseerStateUpdate-72821630449483788-127.0.0.1:38364_solr-n_0000000000) [ ] o.a.s.c.o.SliceMutator createReplica() {
[junit4] 2> "operation":"ADDREPLICA",
[junit4] 2> "collection":"testCreateCollectionSplitShard",
[junit4] 2> "shard":"shard1",
[junit4] 2> "core":"testCreateCollectionSplitShard_shard1_replica_n2",
[junit4] 2> "state":"down",
[junit4] 2> "base_url":"https://127.0.0.1:38364/solr",
[junit4] 2> "type":"NRT",
[junit4] 2> "waitForFinalState":"false"}
[junit4] 2> 261078 INFO (qtp1958959686-318) [n:127.0.0.1:37708_solr x:testCreateCollectionSplitShard_shard1_replica_n1] o.a.s.h.a.CoreAdminOperation core create command qt=/admin/cores&coreNodeName=core_node3&collection.configName=conf&newCollection=true&name=testCreateCollectionSplitShard_shard1_replica_n1&action=CREATE&numShards=1&collection=testCreateCollectionSplitShard&shard=shard1&wt=javabin&version=2&replicaType=NRT
[junit4] 2> 261078 INFO (qtp158971361-282) [n:127.0.0.1:38364_solr x:testCreateCollectionSplitShard_shard1_replica_n2] o.a.s.h.a.CoreAdminOperation core create command qt=/admin/cores&coreNodeName=core_node4&collection.configName=conf&newCollection=true&name=testCreateCollectionSplitShard_shard1_replica_n2&action=CREATE&numShards=1&collection=testCreateCollectionSplitShard&shard=shard1&wt=javabin&version=2&replicaType=NRT
[junit4] 2> 261079 INFO (qtp1958959686-318) [n:127.0.0.1:37708_solr x:testCreateCollectionSplitShard_shard1_replica_n1] o.a.s.c.TransientSolrCoreCacheDefault Allocating transient cache for 2147483647 transient cores
[junit4] 2> 262274 INFO (qtp1958959686-318) [n:127.0.0.1:37708_solr c:testCreateCollectionSplitShard s:shard1 r:core_node3 x:testCreateCollectionSplitShard_shard1_replica_n1] o.a.s.c.SolrConfig Using Lucene MatchVersion: 7.4.0
[junit4] 2> 262392 INFO (qtp1958959686-318) [n:127.0.0.1:37708_solr c:testCreateCollectionSplitShard s:shard1 r:core_node3 x:testCreateCollectionSplitShard_shard1_replica_n1] o.a.s.s.IndexSchema [testCreateCollectionSplitShard_shard1_replica_n1] Schema name=minimal
[junit4] 2> 262428 INFO (qtp1958959686-318) [n:127.0.0.1:37708_solr c:testCreateCollectionSplitShard s:shard1 r:core_node3 x:testCreateCollectionSplitShard_shard1_replica_n1] o.a.s.s.IndexSchema Loaded schema minimal/1.1 with uniqueid field id
[junit4] 2> 262428 INFO (qtp1958959686-318) [n:127.0.0.1:37708_solr c:testCreateCollectionSplitShard s:shard1 r:core_node3 x:testCreateCollectionSplitShard_shard1_replica_n1] o.a.s.c.CoreContainer Creating SolrCore 'testCreateCollectionSplitShard_shard1_replica_n1' using configuration from collection testCreateCollectionSplitShard, trusted=true
[junit4] 2> 262443 INFO (qtp158971361-282) [n:127.0.0.1:38364_solr c:testCreateCollectionSplitShard s:shard1 r:core_node4 x:testCreateCollectionSplitShard_shard1_replica_n2] o.a.s.c.SolrConfig Using Lucene MatchVersion: 7.4.0
[junit4] 2> 262462 INFO (qtp1958959686-318) [n:127.0.0.1:37708_solr c:testCreateCollectionSplitShard s:shard1 r:core_node3 x:testCreateCollectionSplitShard_shard1_replica_n1] o.a.s.m.r.SolrJmxReporter JMX monitoring for 'solr_37708.solr.core.testCreateCollectionSplitShard.shard1.replica_n1' (registry 'solr.core.testCreateCollectionSplitShard.shard1.replica_n1') enabled at server: com.sun.jmx.mbeanserver.JmxMBeanServer@255f0d1c
[junit4] 2> 262462 INFO (qtp1958959686-318) [n:127.0.0.1:37708_solr c:testCreateCollectionSplitShard s:shard1 r:core_node3 x:testCreateCollectionSplitShard_shard1_replica_n1] o.a.s.c.SolrCore solr.RecoveryStrategy.Builder
[junit4] 2> 262462 INFO (qtp1958959686-318) [n:127.0.0.1:37708_solr c:testCreateCollectionSplitShard s:shard1 r:core_node3 x:testCreateCollectionSplitShard_shard1_replica_n1] o.a.s.c.SolrCore [[testCreateCollectionSplitShard_shard1_replica_n1] ] Opening new SolrCore at [/home/jenkins/jenkins-slave/workspace/Lucene-Solr-Tests-7.4/solr/build/solr-core/test/J1/temp/solr.cloud.autoscaling.TestPolicyCloud_37FC3E715740A296-001/tempDir-001/node4/testCreateCollectionSplitShard_shard1_replica_n1], dataDir=[/home/jenkins/jenkins-slave/workspace/Lucene-Solr-Tests-7.4/solr/build/solr-core/test/J1/temp/solr.cloud.autoscaling.TestPolicyCloud_37FC3E715740A296-001/tempDir-001/node4/./testCreateCollectionSplitShard_shard1_replica_n1/data/]
[junit4] 2> 262576 INFO (qtp158971361-282) [n:127.0.0.1:38364_solr c:testCreateCollectionSplitShard s:shard1 r:core_node4 x:testCreateCollectionSplitShard_shard1_replica_n2] o.a.s.s.IndexSchema [testCreateCollectionSplitShard_shard1_replica_n2] Schema name=minimal
[junit4] 2> 262597 INFO (qtp158971361-282) [n:127.0.0.1:38364_solr c:testCreateCollectionSplitShard s:shard1 r:core_node4 x:testCreateCollectionSplitShard_shard1_replica_n2] o.a.s.s.IndexSchema Loaded schema minimal/1.1 with uniqueid field id
[junit4] 2> 262597 INFO (qtp158971361-282) [n:127.0.0.1:38364_solr c:testCreateCollectionSplitShard s:shard1 r:core_node4 x:testCreateCollectionSplitShard_shard1_replica_n2] o.a.s.c.CoreContainer Creating SolrCore 'testCreateCollectionSplitShard_shard1_replica_n2' using configuration from collection testCreateCollectionSplitShard, trusted=true
[junit4] 2> 262612 INFO (qtp158971361-282) [n:127.0.0.1:38364_solr c:testCreateCollectionSplitShard s:shard1 r:core_node4 x:testCreateCollectionSplitShard_shard1_replica_n2] o.a.s.m.r.SolrJmxReporter JMX monitoring for 'solr_38364.solr.core.testCreateCollectionSplitShard.shard1.replica_n2' (registry 'solr.core.testCreateCollectionSplitShard.shard1.replica_n2') enabled at server: com.sun.jmx.mbeanserver.JmxMBeanServer@255f0d1c
[junit4] 2> 262612 INFO (qtp158971361-282) [n:127.0.0.1:38364_solr c:testCreateCollectionSplitShard s:shard1 r:core_node4 x:testCreateCollectionSplitShard_shard1_replica_n2] o.a.s.c.SolrCore solr.RecoveryStrategy.Builder
[junit4] 2> 262612 INFO (qtp158971361-282) [n:127.0.0.1:38364_solr c:testCreateCollectionSplitShard s:shard1 r:core_node4 x:testCreateCollectionSplitShard_shard1_replica_n2] o.a.s.c.SolrCore [[testCreateCollectionSplitShard_shard1_replica_n2] ] Opening new SolrCore at [/home/jenkins/jenkins-slave/workspace/Lucene-Solr-Tests-7.4/solr/build/solr-core/test/J1/temp/solr.cloud.autoscaling.TestPolicyCloud_37FC3E715740A296-001/tempDir-001/node2/testC
[...truncated too long message...]
/home/jenkins/jenkins-slave/workspace/Lucene-Solr-Tests-7.4/lucene/top-level-ivy-settings.xml
resolve:
ivy-availability-check:
[loadresource] Do not set property disallowed.ivy.jars.list as its length is 0.
-ivy-fail-disallowed-ivy-version:
ivy-fail:
ivy-configure:
[ivy:configure] :: loading settings :: file = /home/jenkins/jenkins-slave/workspace/Lucene-Solr-Tests-7.4/lucene/top-level-ivy-settings.xml
resolve:
ivy-availability-check:
[loadresource] Do not set property disallowed.ivy.jars.list as its length is 0.
-ivy-fail-disallowed-ivy-version:
ivy-fail:
ivy-configure:
[ivy:configure] :: loading settings :: file = /home/jenkins/jenkins-slave/workspace/Lucene-Solr-Tests-7.4/lucene/top-level-ivy-settings.xml
resolve:
ivy-availability-check:
[loadresource] Do not set property disallowed.ivy.jars.list as its length is 0.
-ivy-fail-disallowed-ivy-version:
ivy-fail:
ivy-configure:
[ivy:configure] :: loading settings :: file = /home/jenkins/jenkins-slave/workspace/Lucene-Solr-Tests-7.4/lucene/top-level-ivy-settings.xml
resolve:
ivy-availability-check:
[loadresource] Do not set property disallowed.ivy.jars.list as its length is 0.
-ivy-fail-disallowed-ivy-version:
ivy-fail:
ivy-configure:
[ivy:configure] :: loading settings :: file = /home/jenkins/jenkins-slave/workspace/Lucene-Solr-Tests-7.4/lucene/top-level-ivy-settings.xml
resolve:
jar-checksums:
[mkdir] Created dir: /home/jenkins/jenkins-slave/workspace/Lucene-Solr-Tests-7.4/lucene/null465276885
[copy] Copying 39 files to /home/jenkins/jenkins-slave/workspace/Lucene-Solr-Tests-7.4/lucene/null465276885
[delete] Deleting directory /home/jenkins/jenkins-slave/workspace/Lucene-Solr-Tests-7.4/lucene/null465276885
resolve-example:
ivy-availability-check:
[loadresource] Do not set property disallowed.ivy.jars.list as its length is 0.
-ivy-fail-disallowed-ivy-version:
ivy-fail:
ivy-configure:
[ivy:configure] :: loading settings :: file = /home/jenkins/jenkins-slave/workspace/Lucene-Solr-Tests-7.4/lucene/top-level-ivy-settings.xml
resolve:
resolve-server:
ivy-availability-check:
[loadresource] Do not set property disallowed.ivy.jars.list as its length is 0.
-ivy-fail-disallowed-ivy-version:
ivy-fail:
ivy-fail:
ivy-configure:
[ivy:configure] :: loading settings :: file = /home/jenkins/jenkins-slave/workspace/Lucene-Solr-Tests-7.4/lucene/top-level-ivy-settings.xml
resolve:
resolve:
ivy-availability-check:
[loadresource] Do not set property disallowed.ivy.jars.list as its length is 0.
-ivy-fail-disallowed-ivy-version:
ivy-fail:
ivy-fail:
ivy-configure:
[ivy:configure] :: loading settings :: file = /home/jenkins/jenkins-slave/workspace/Lucene-Solr-Tests-7.4/lucene/top-level-ivy-settings.xml
resolve:
ivy-availability-check:
[loadresource] Do not set property disallowed.ivy.jars.list as its length is 0.
-ivy-fail-disallowed-ivy-version:
ivy-fail:
ivy-fail:
ivy-configure:
[ivy:configure] :: loading settings :: file = /home/jenkins/jenkins-slave/workspace/Lucene-Solr-Tests-7.4/lucene/top-level-ivy-settings.xml
resolve:
ivy-availability-check:
[loadresource] Do not set property disallowed.ivy.jars.list as its length is 0.
-ivy-fail-disallowed-ivy-version:
ivy-fail:
ivy-configure:
[ivy:configure] :: loading settings :: file = /home/jenkins/jenkins-slave/workspace/Lucene-Solr-Tests-7.4/lucene/top-level-ivy-settings.xml
resolve:
ivy-availability-check:
[loadresource] Do not set property disallowed.ivy.jars.list as its length is 0.
-ivy-fail-disallowed-ivy-version:
ivy-fail:
ivy-fail:
ivy-configure:
[ivy:configure] :: loading settings :: file = /home/jenkins/jenkins-slave/workspace/Lucene-Solr-Tests-7.4/lucene/top-level-ivy-settings.xml
resolve:
ivy-availability-check:
[loadresource] Do not set property disallowed.ivy.jars.list as its length is 0.
-ivy-fail-disallowed-ivy-version:
ivy-fail:
ivy-configure:
[ivy:configure] :: loading settings :: file = /home/jenkins/jenkins-slave/workspace/Lucene-Solr-Tests-7.4/lucene/top-level-ivy-settings.xml
resolve:
ivy-availability-check:
[loadresource] Do not set property disallowed.ivy.jars.list as its length is 0.
-ivy-fail-disallowed-ivy-version:
ivy-fail:
ivy-fail:
ivy-configure:
[ivy:configure] :: loading settings :: file = /home/jenkins/jenkins-slave/workspace/Lucene-Solr-Tests-7.4/lucene/top-level-ivy-settings.xml
resolve:
ivy-availability-check:
[loadresource] Do not set property disallowed.ivy.jars.list as its length is 0.
-ivy-fail-disallowed-ivy-version:
ivy-fail:
ivy-fail:
ivy-configure:
[ivy:configure] :: loading settings :: file = /home/jenkins/jenkins-slave/workspace/Lucene-Solr-Tests-7.4/lucene/top-level-ivy-settings.xml
resolve:
ivy-availability-check:
[loadresource] Do not set property disallowed.ivy.jars.list as its length is 0.
-ivy-fail-disallowed-ivy-version:
ivy-fail:
ivy-fail:
ivy-configure:
[ivy:configure] :: loading settings :: file = /home/jenkins/jenkins-slave/workspace/Lucene-Solr-Tests-7.4/lucene/top-level-ivy-settings.xml
resolve:
ivy-availability-check:
[loadresource] Do not set property disallowed.ivy.jars.list as its length is 0.
-ivy-fail-disallowed-ivy-version:
ivy-fail:
ivy-fail:
ivy-configure:
[ivy:configure] :: loading settings :: file = /home/jenkins/jenkins-slave/workspace/Lucene-Solr-Tests-7.4/lucene/top-level-ivy-settings.xml
resolve:
ivy-availability-check:
[loadresource] Do not set property disallowed.ivy.jars.list as its length is 0.
-ivy-fail-disallowed-ivy-version:
ivy-fail:
ivy-fail:
ivy-configure:
[ivy:configure] :: loading settings :: file = /home/jenkins/jenkins-slave/workspace/Lucene-Solr-Tests-7.4/lucene/top-level-ivy-settings.xml
resolve:
ivy-availability-check:
[loadresource] Do not set property disallowed.ivy.jars.list as its length is 0.
-ivy-fail-disallowed-ivy-version:
ivy-fail:
ivy-fail:
ivy-configure:
[ivy:configure] :: loading settings :: file = /home/jenkins/jenkins-slave/workspace/Lucene-Solr-Tests-7.4/lucene/top-level-ivy-settings.xml
resolve:
ivy-availability-check:
[loadresource] Do not set property disallowed.ivy.jars.list as its length is 0.
-ivy-fail-disallowed-ivy-version:
ivy-fail:
ivy-fail:
ivy-configure:
[ivy:configure] :: loading settings :: file = /home/jenkins/jenkins-slave/workspace/Lucene-Solr-Tests-7.4/lucene/top-level-ivy-settings.xml
resolve:
ivy-availability-check:
[loadresource] Do not set property disallowed.ivy.jars.list as its length is 0.
-ivy-fail-disallowed-ivy-version:
ivy-fail:
ivy-fail:
ivy-configure:
[ivy:configure] :: loading settings :: file = /home/jenkins/jenkins-slave/workspace/Lucene-Solr-Tests-7.4/lucene/top-level-ivy-settings.xml
resolve:
ivy-availability-check:
[loadresource] Do not set property disallowed.ivy.jars.list as its length is 0.
-ivy-fail-disallowed-ivy-version:
ivy-fail:
ivy-fail:
ivy-configure:
[ivy:configure] :: loading settings :: file = /home/jenkins/jenkins-slave/workspace/Lucene-Solr-Tests-7.4/lucene/top-level-ivy-settings.xml
resolve:
ivy-availability-check:
[loadresource] Do not set property disallowed.ivy.jars.list as its length is 0.
-ivy-fail-disallowed-ivy-version:
ivy-fail:
ivy-fail:
ivy-configure:
[ivy:configure] :: loading settings :: file = /home/jenkins/jenkins-slave/workspace/Lucene-Solr-Tests-7.4/lucene/top-level-ivy-settings.xml
resolve:
ivy-availability-check:
[loadresource] Do not set property disallowed.ivy.jars.list as its length is 0.
-ivy-fail-disallowed-ivy-version:
ivy-fail:
ivy-fail:
ivy-configure:
[ivy:configure] :: loading settings :: file = /home/jenkins/jenkins-slave/workspace/Lucene-Solr-Tests-7.4/lucene/top-level-ivy-settings.xml
resolve:
jar-checksums:
[mkdir] Created dir: /home/jenkins/jenkins-slave/workspace/Lucene-Solr-Tests-7.4/solr/null707595876
[copy] Copying 247 files to /home/jenkins/jenkins-slave/workspace/Lucene-Solr-Tests-7.4/solr/null707595876
[delete] Deleting directory /home/jenkins/jenkins-slave/workspace/Lucene-Solr-Tests-7.4/solr/null707595876
check-working-copy:
[ivy:cachepath] :: resolving dependencies :: org.eclipse.jgit#org.eclipse.jgit-caller;working
[ivy:cachepath] confs: [default]
[ivy:cachepath] found org.eclipse.jgit#org.eclipse.jgit;4.6.0.201612231935-r in public
[ivy:cachepath] found com.jcraft#jsch;0.1.53 in public
[ivy:cachepath] found com.googlecode.javaewah#JavaEWAH;1.1.6 in public
[ivy:cachepath] found org.apache.httpcomponents#httpclient;4.3.6 in public
[ivy:cachepath] found org.apache.httpcomponents#httpcore;4.3.3 in public
[ivy:cachepath] found commons-logging#commons-logging;1.1.3 in public
[ivy:cachepath] found commons-codec#commons-codec;1.6 in public
[ivy:cachepath] found org.slf4j#slf4j-api;1.7.2 in public
[ivy:cachepath] :: resolution report :: resolve 168ms :: artifacts dl 2ms
---------------------------------------------------------------------
| | modules || artifacts |
| conf | number| search|dwnlded|evicted|| number|dwnlded|
---------------------------------------------------------------------
| default | 8 | 0 | 0 | 0 || 8 | 0 |
---------------------------------------------------------------------
[wc-checker] Initializing working copy...
[wc-checker] SLF4J: Failed to load class "org.slf4j.impl.StaticLoggerBinder".
[wc-checker] SLF4J: Defaulting to no-operation (NOP) logger implementation
[wc-checker] SLF4J: See http://www.slf4j.org/codes.html#StaticLoggerBinder for further details.
[wc-checker] Checking working copy status...
-jenkins-base:
BUILD SUCCESSFUL
Total time: 299 minutes 5 seconds
Archiving artifacts
WARN: No artifacts found that match the file pattern "**/*.events,heapdumps/**,**/hs_err_pid*". Configuration error?
WARN: java.lang.InterruptedException: no matches found within 10000
Recording test results
Build step 'Publish JUnit test result report' changed build result to UNSTABLE
Email was triggered for: Unstable (Test Failures)
Sending email for trigger: Unstable (Test Failures)