You are viewing a plain text version of this content. The canonical link for it is here.
Posted to builds@hbase.apache.org by Apache Jenkins Server <je...@builds.apache.org> on 2014/08/07 02:19:19 UTC

Build failed in Jenkins: HBase-1.0 #89

See <https://builds.apache.org/job/HBase-1.0/89/changes>

Changes:

[jmhsieh] HBASE-11681 Update and move doc about disabling the WAL (Misty Stanley-Jones)

[stack] HBASE-11603 Apply version of HADOOP-8027 to our JMXJsonServlet

------------------------------------------
[...truncated 14156 lines...]
	- waiting on <0xb5a01e98> (a org.apache.derby.impl.services.daemon.BasicDaemon)
	at org.apache.derby.impl.services.daemon.BasicDaemon.rest(Unknown Source)
	- locked <0xb5a01e98> (a org.apache.derby.impl.services.daemon.BasicDaemon)
	at org.apache.derby.impl.services.daemon.BasicDaemon.run(Unknown Source)
	at java.lang.Thread.run(Thread.java:724)

"Timer-0" daemon prio=10 tid=0xa7dcf800 nid=0x110e in Object.wait() [0xadd7d000]
   java.lang.Thread.State: WAITING (on object monitor)
	at java.lang.Object.wait(Native Method)
	- waiting on <0xb3ef7590> (a java.util.TaskQueue)
	at java.lang.Object.wait(Object.java:503)
	at java.util.TimerThread.mainLoop(Timer.java:526)
	- locked <0xb3ef7590> (a java.util.TaskQueue)
	at java.util.TimerThread.run(Timer.java:505)

"Attach Listener" daemon prio=10 tid=0xa9800800 nid=0x110d waiting on condition [0x00000000]
   java.lang.Thread.State: RUNNABLE

"Service Thread" daemon prio=10 tid=0xa9726c00 nid=0x110b runnable [0x00000000]
   java.lang.Thread.State: RUNNABLE

"C2 CompilerThread1" daemon prio=10 tid=0xa9725000 nid=0x110a waiting on condition [0x00000000]
   java.lang.Thread.State: RUNNABLE

"C2 CompilerThread0" daemon prio=10 tid=0xa9723000 nid=0x1109 waiting on condition [0x00000000]
   java.lang.Thread.State: RUNNABLE

"Signal Dispatcher" daemon prio=10 tid=0xa9721400 nid=0x1108 runnable [0x00000000]
   java.lang.Thread.State: RUNNABLE

"Finalizer" daemon prio=10 tid=0xa9ce6c00 nid=0x1106 in Object.wait() [0xaed7d000]
   java.lang.Thread.State: WAITING (on object monitor)
	at java.lang.Object.wait(Native Method)
	- waiting on <0xb393ec30> (a java.lang.ref.ReferenceQueue$Lock)
	at java.lang.ref.ReferenceQueue.remove(ReferenceQueue.java:135)
	- locked <0xb393ec30> (a java.lang.ref.ReferenceQueue$Lock)
	at java.lang.ref.ReferenceQueue.remove(ReferenceQueue.java:151)
	at java.lang.ref.Finalizer$FinalizerThread.run(Finalizer.java:189)

"Reference Handler" daemon prio=10 tid=0xa9ce5000 nid=0x1105 in Object.wait() [0xaf07d000]
   java.lang.Thread.State: WAITING (on object monitor)
	at java.lang.Object.wait(Native Method)
	- waiting on <0xb393e8a0> (a java.lang.ref.Reference$Lock)
	at java.lang.Object.wait(Object.java:503)
	at java.lang.ref.Reference$ReferenceHandler.run(Reference.java:133)
	- locked <0xb393e8a0> (a java.lang.ref.Reference$Lock)

"main" prio=10 tid=0xf6806800 nid=0x10d9 waiting on condition [0xf695e000]
   java.lang.Thread.State: WAITING (parking)
	at sun.misc.Unsafe.park(Native Method)
	- parking to wait for  <0xe03ee1a8> (a java.util.concurrent.locks.ReentrantLock$NonfairSync)
	at java.util.concurrent.locks.LockSupport.park(LockSupport.java:186)
	at java.util.concurrent.locks.AbstractQueuedSynchronizer.parkAndCheckInterrupt(AbstractQueuedSynchronizer.java:834)
	at java.util.concurrent.locks.AbstractQueuedSynchronizer.acquireQueued(AbstractQueuedSynchronizer.java:867)
	at java.util.concurrent.locks.AbstractQueuedSynchronizer.acquire(AbstractQueuedSynchronizer.java:1197)
	at java.util.concurrent.locks.ReentrantLock$NonfairSync.lock(ReentrantLock.java:214)
	at java.util.concurrent.locks.ReentrantLock.lock(ReentrantLock.java:290)
	at org.apache.openjpa.kernel.BrokerImpl.lock(BrokerImpl.java:4483)
	at org.apache.openjpa.kernel.BrokerImpl.beginOperation(BrokerImpl.java:1961)
	at org.apache.openjpa.kernel.BrokerImpl.isActive(BrokerImpl.java:1933)
	at org.apache.openjpa.kernel.StateManagerImpl.beforeAccessField(StateManagerImpl.java:1650)
	at org.apache.openjpa.kernel.StateManagerImpl.accessingField(StateManagerImpl.java:1586)
	at org.apache.camel.examples.MultiSteps.getId(MultiSteps.java)
	at org.apache.camel.examples.MultiSteps.toString(MultiSteps.java:92)
	at java.lang.String.valueOf(String.java:2854)
	at java.lang.StringBuilder.append(StringBuilder.java:128)
	at org.apache.camel.component.jpa.JpaWithNamedQueryTest$4.doInTransaction(JpaWithNamedQueryTest.java:130)
	at org.springframework.transaction.support.TransactionTemplate.execute(TransactionTemplate.java:131)
	at org.apache.camel.component.jpa.JpaWithNamedQueryTest.testProducerInsertsIntoDatabaseThenConsumerFiresMessageExchange(JpaWithNamedQueryTest.java:112)
	at sun.reflect.NativeMethodAccessorImpl.invoke0(Native Method)
	at sun.reflect.NativeMethodAccessorImpl.invoke(NativeMethodAccessorImpl.java:57)
	at sun.reflect.DelegatingMethodAccessorImpl.invoke(DelegatingMethodAccessorImpl.java:43)
	at java.lang.reflect.Method.invoke(Method.java:606)
	at org.junit.runners.model.FrameworkMethod$1.runReflectiveCall(FrameworkMethod.java:47)
	at org.junit.internal.runners.model.ReflectiveCallable.run(ReflectiveCallable.java:12)
	at org.junit.runners.model.FrameworkMethod.invokeExplosively(FrameworkMethod.java:44)
	at org.junit.internal.runners.statements.InvokeMethod.evaluate(InvokeMethod.java:17)
	at org.junit.internal.runners.statements.RunBefores.evaluate(RunBefores.java:26)
	at org.junit.internal.runners.statements.RunAfters.evaluate(RunAfters.java:27)
	at org.junit.runners.ParentRunner.runLeaf(ParentRunner.java:271)
	at org.junit.runners.BlockJUnit4ClassRunner.runChild(BlockJUnit4ClassRunner.java:70)
	at org.junit.runners.BlockJUnit4ClassRunner.runChild(BlockJUnit4ClassRunner.java:50)
	at org.junit.runners.ParentRunner$3.run(ParentRunner.java:238)
	at org.junit.runners.ParentRunner$1.schedule(ParentRunner.java:63)
	at org.junit.runners.ParentRunner.runChildren(ParentRunner.java:236)
	at org.junit.runners.ParentRunner.access$000(ParentRunner.java:53)
	at org.junit.runners.ParentRunner$2.evaluate(ParentRunner.java:229)
	at org.junit.runners.ParentRunner.run(ParentRunner.java:309)
	at org.apache.maven.surefire.junit4.JUnit4Provider.execute(JUnit4Provider.java:264)
	at org.apache.maven.surefire.junit4.JUnit4Provider.executeTestSet(JUnit4Provider.java:153)
	at org.apache.maven.surefire.junit4.JUnit4Provider.invoke(JUnit4Provider.java:124)
	at org.apache.maven.surefire.booter.ForkedBooter.invokeProviderInSameClassLoader(ForkedBooter.java:200)
	at org.apache.maven.surefire.booter.ForkedBooter.runSuitesInProcess(ForkedBooter.java:153)
	at org.apache.maven.surefire.booter.ForkedBooter.main(ForkedBooter.java:103)

"VM Thread" prio=10 tid=0xa9ff8400 nid=0x1104 runnable 

"GC task thread#0 (ParallelGC)" prio=10 tid=0xf6810800 nid=0x10dd runnable 

"GC task thread#1 (ParallelGC)" prio=10 tid=0xf6812000 nid=0x10e1 runnable 

"GC task thread#2 (ParallelGC)" prio=10 tid=0xf6813800 nid=0x10e3 runnable 

"GC task thread#3 (ParallelGC)" prio=10 tid=0xf6814c00 nid=0x10e5 runnable 

"GC task thread#4 (ParallelGC)" prio=10 tid=0xf6816400 nid=0x10e7 runnable 

"GC task thread#5 (ParallelGC)" prio=10 tid=0xf6817c00 nid=0x10e9 runnable 

"GC task thread#6 (ParallelGC)" prio=10 tid=0xf6819000 nid=0x10ea runnable 

"GC task thread#7 (ParallelGC)" prio=10 tid=0xf681a800 nid=0x10ee runnable 

"GC task thread#8 (ParallelGC)" prio=10 tid=0xf681c000 nid=0x10f0 runnable 

"GC task thread#9 (ParallelGC)" prio=10 tid=0xf681d400 nid=0x10f3 runnable 

"GC task thread#10 (ParallelGC)" prio=10 tid=0xf681ec00 nid=0x10f4 runnable 

"GC task thread#11 (ParallelGC)" prio=10 tid=0xf6820400 nid=0x10f5 runnable 

"GC task thread#12 (ParallelGC)" prio=10 tid=0xf6821800 nid=0x10f6 runnable 

"GC task thread#13 (ParallelGC)" prio=10 tid=0xf6823000 nid=0x10f7 runnable 

"GC task thread#14 (ParallelGC)" prio=10 tid=0xf6824800 nid=0x10f8 runnable 

"GC task thread#15 (ParallelGC)" prio=10 tid=0xf6825c00 nid=0x10fa runnable 

"GC task thread#16 (ParallelGC)" prio=10 tid=0xf6827400 nid=0x10fb runnable 

"GC task thread#17 (ParallelGC)" prio=10 tid=0xf6828c00 nid=0x1101 runnable 

"VM Periodic Task Thread" prio=10 tid=0xa9728c00 nid=0x110c waiting on condition 

JNI global references: 260


Found one Java-level deadlock:
=============================
"Camel (camel-28) thread #6 - jpa://org.apache.camel.examples.MultiSteps":
  waiting for ownable synchronizer 0xe0455ae0, (a java.util.concurrent.locks.ReentrantLock$NonfairSync),
  which is held by "main"
"main":
  waiting for ownable synchronizer 0xe03ee1a8, (a java.util.concurrent.locks.ReentrantLock$NonfairSync),
  which is held by "Camel (camel-28) thread #6 - jpa://org.apache.camel.examples.MultiSteps"

Java stack information for the threads listed above:
===================================================
"Camel (camel-28) thread #6 - jpa://org.apache.camel.examples.MultiSteps":
	at sun.misc.Unsafe.park(Native Method)
	- parking to wait for  <0xe0455ae0> (a java.util.concurrent.locks.ReentrantLock$NonfairSync)
	at java.util.concurrent.locks.LockSupport.park(LockSupport.java:186)
	at java.util.concurrent.locks.AbstractQueuedSynchronizer.parkAndCheckInterrupt(AbstractQueuedSynchronizer.java:834)
	at java.util.concurrent.locks.AbstractQueuedSynchronizer.acquireQueued(AbstractQueuedSynchronizer.java:867)
	at java.util.concurrent.locks.AbstractQueuedSynchronizer.acquire(AbstractQueuedSynchronizer.java:1197)
	at java.util.concurrent.locks.ReentrantLock$NonfairSync.lock(ReentrantLock.java:214)
	at java.util.concurrent.locks.ReentrantLock.lock(ReentrantLock.java:290)
	at org.apache.openjpa.kernel.StateManagerImpl.lock(StateManagerImpl.java:3382)
	at org.apache.openjpa.kernel.StateManagerImpl.assignObjectId(StateManagerImpl.java:576)
	at org.apache.openjpa.kernel.StateManagerImpl.fetchObjectId(StateManagerImpl.java:1528)
	at org.apache.openjpa.kernel.DetachedStateManager.<init>(DetachedStateManager.java:88)
	at org.apache.openjpa.kernel.DetachManager.detachInternal(DetachManager.java:469)
	at org.apache.openjpa.kernel.DetachManager.detachAll(DetachManager.java:334)
	at org.apache.openjpa.kernel.BrokerImpl.detachAllInternal(BrokerImpl.java:3472)
	at org.apache.openjpa.kernel.BrokerImpl.detachAll(BrokerImpl.java:3436)
	at org.apache.openjpa.kernel.DelegatingBroker.detachAll(DelegatingBroker.java:1206)
	at org.apache.openjpa.persistence.EntityManagerImpl.clear(EntityManagerImpl.java:1172)
	at sun.reflect.NativeMethodAccessorImpl.invoke0(Native Method)
	at sun.reflect.NativeMethodAccessorImpl.invoke(NativeMethodAccessorImpl.java:57)
	at sun.reflect.DelegatingMethodAccessorImpl.invoke(DelegatingMethodAccessorImpl.java:43)
	at java.lang.reflect.Method.invoke(Method.java:606)
	at org.springframework.orm.jpa.ExtendedEntityManagerCreator$ExtendedEntityManagerInvocationHandler.invoke(ExtendedEntityManagerCreator.java:366)
	at com.sun.proxy.$Proxy22.clear(Unknown Source)
	at org.apache.camel.component.jpa.JpaConsumer$1.doInTransaction(JpaConsumer.java:139)
	at org.springframework.transaction.support.TransactionTemplate.execute(TransactionTemplate.java:131)
	at org.apache.camel.component.jpa.JpaConsumer.poll(JpaConsumer.java:91)
	at org.apache.camel.impl.ScheduledPollConsumer.doRun(ScheduledPollConsumer.java:187)
	at org.apache.camel.impl.ScheduledPollConsumer.run(ScheduledPollConsumer.java:114)
	at java.util.concurrent.Executors$RunnableAdapter.call(Executors.java:471)
	at java.util.concurrent.FutureTask$Sync.innerRunAndReset(FutureTask.java:351)
	at java.util.concurrent.FutureTask.runAndReset(FutureTask.java:178)
	at java.util.concurrent.ScheduledThreadPoolExecutor$ScheduledFutureTask.access$301(ScheduledThreadPoolExecutor.java:178)
	at java.util.concurrent.ScheduledThreadPoolExecutor$ScheduledFutureTask.run(ScheduledThreadPoolExecutor.java:293)
	at java.util.concurrent.ThreadPoolExecutor.runWorker(ThreadPoolExecutor.java:1145)
	at java.util.concurrent.ThreadPoolExecutor$Worker.run(ThreadPoolExecutor.java:615)
	at java.lang.Thread.run(Thread.java:724)
"main":
	at sun.misc.Unsafe.park(Native Method)
	- parking to wait for  <0xe03ee1a8> (a java.util.concurrent.locks.ReentrantLock$NonfairSync)
	at java.util.concurrent.locks.LockSupport.park(LockSupport.java:186)
	at java.util.concurrent.locks.AbstractQueuedSynchronizer.parkAndCheckInterrupt(AbstractQueuedSynchronizer.java:834)
	at java.util.concurrent.locks.AbstractQueuedSynchronizer.acquireQueued(AbstractQueuedSynchronizer.java:867)
	at java.util.concurrent.locks.AbstractQueuedSynchronizer.acquire(AbstractQueuedSynchronizer.java:1197)
	at java.util.concurrent.locks.ReentrantLock$NonfairSync.lock(ReentrantLock.java:214)
	at java.util.concurrent.locks.ReentrantLock.lock(ReentrantLock.java:290)
	at org.apache.openjpa.kernel.BrokerImpl.lock(BrokerImpl.java:4483)
	at org.apache.openjpa.kernel.BrokerImpl.beginOperation(BrokerImpl.java:1961)
	at org.apache.openjpa.kernel.BrokerImpl.isActive(BrokerImpl.java:1933)
	at org.apache.openjpa.kernel.StateManagerImpl.beforeAccessField(StateManagerImpl.java:1650)
	at org.apache.openjpa.kernel.StateManagerImpl.accessingField(StateManagerImpl.java:1586)
	at org.apache.camel.examples.MultiSteps.getId(MultiSteps.java)
	at org.apache.camel.examples.MultiSteps.toString(MultiSteps.java:92)
	at java.lang.String.valueOf(String.java:2854)
	at java.lang.StringBuilder.append(StringBuilder.java:128)
	at org.apache.camel.component.jpa.JpaWithNamedQueryTest$4.doInTransaction(JpaWithNamedQueryTest.java:130)
	at org.springframework.transaction.support.TransactionTemplate.execute(TransactionTemplate.java:131)
	at org.apache.camel.component.jpa.JpaWithNamedQueryTest.testProducerInsertsIntoDatabaseThenConsumerFiresMessageExchange(JpaWithNamedQueryTest.java:112)
	at sun.reflect.NativeMethodAccessorImpl.invoke0(Native Method)
	at sun.reflect.NativeMethodAccessorImpl.invoke(NativeMethodAccessorImpl.java:57)
	at sun.reflect.DelegatingMethodAccessorImpl.invoke(DelegatingMethodAccessorImpl.java:43)
	at java.lang.reflect.Method.invoke(Method.java:606)
	at org.junit.runners.model.FrameworkMethod$1.runReflectiveCall(FrameworkMethod.java:47)
	at org.junit.internal.runners.model.ReflectiveCallable.run(ReflectiveCallable.java:12)
	at org.junit.runners.model.FrameworkMethod.invokeExplosively(FrameworkMethod.java:44)
	at org.junit.internal.runners.statements.InvokeMethod.evaluate(InvokeMethod.java:17)
	at org.junit.internal.runners.statements.RunBefores.evaluate(RunBefores.java:26)
	at org.junit.internal.runners.statements.RunAfters.evaluate(RunAfters.java:27)
	at org.junit.runners.ParentRunner.runLeaf(ParentRunner.java:271)
	at org.junit.runners.BlockJUnit4ClassRunner.runChild(BlockJUnit4ClassRunner.java:70)
	at org.junit.runners.BlockJUnit4ClassRunner.runChild(BlockJUnit4ClassRunner.java:50)
	at org.junit.runners.ParentRunner$3.run(ParentRunner.java:238)
	at org.junit.runners.ParentRunner$1.schedule(ParentRunner.java:63)
	at org.junit.runners.ParentRunner.runChildren(ParentRunner.java:236)
	at org.junit.runners.ParentRunner.access$000(ParentRunner.java:53)
	at org.junit.runners.ParentRunner$2.evaluate(ParentRunner.java:229)
	at org.junit.runners.ParentRunner.run(ParentRunner.java:309)
	at org.apache.maven.surefire.junit4.JUnit4Provider.execute(JUnit4Provider.java:264)
	at org.apache.maven.surefire.junit4.JUnit4Provider.executeTestSet(JUnit4Provider.java:153)
	at org.apache.maven.surefire.junit4.JUnit4Provider.invoke(JUnit4Provider.java:124)
	at org.apache.maven.surefire.booter.ForkedBooter.invokeProviderInSameClassLoader(ForkedBooter.java:200)
	at org.apache.maven.surefire.booter.ForkedBooter.runSuitesInProcess(ForkedBooter.java:153)
	at org.apache.maven.surefire.booter.ForkedBooter.main(ForkedBooter.java:103)

Found 1 deadlock.

POST BUILD TASK : FAILURE
END OF POST BUILD TASK : 0
Archiving artifacts
Sending artifact delta relative to HBase-1.0 #88
Archived 654 artifacts
Archive block size is 32768
Received 7 blocks and 33209674 bytes
Compression is 0.7%
Took 2 min 29 sec
Recording test results
Updating HBASE-11681
Updating HBASE-11603
Updating HADOOP-8027

Jenkins build is back to normal : HBase-1.0 #96

Posted by Apache Jenkins Server <je...@builds.apache.org>.
See <https://builds.apache.org/job/HBase-1.0/96/changes>


Build failed in Jenkins: HBase-1.0 #95

Posted by Apache Jenkins Server <je...@builds.apache.org>.
See <https://builds.apache.org/job/HBase-1.0/95/changes>

Changes:

[nkeywal] HBASE-11718 Remove some logs in RpcClient.java

[nkeywal] HBASE-11719 Remove some unused paths in AsyncClient

------------------------------------------
[...truncated 1792 lines...]
[ERROR] Failed to execute goal org.apache.maven.plugins:maven-surefire-plugin:2.12-TRUNK-HBASE-2:test (secondPartTestsExecution) on project hbase-server: There are test failures.
[ERROR] 
[ERROR] Please refer to <https://builds.apache.org/job/HBase-1.0/ws/hbase-server/target/surefire-reports> for the individual test results.
[ERROR] -> [Help 1]
[ERROR] 
[ERROR] To see the full stack trace of the errors, re-run Maven with the -e switch.
[ERROR] Re-run Maven using the -X switch to enable full debug logging.
[ERROR] 
[ERROR] For more information about the errors and possible solutions, please read the following articles:
[ERROR] [Help 1] http://cwiki.apache.org/confluence/display/MAVEN/MojoFailureException
[ERROR] 
[ERROR] After correcting the problems, you can resume the build with the command
[ERROR]   mvn <goals> -rf :hbase-server
Build step 'Invoke top-level Maven targets' marked build as failure
Performing Post build task...
Match found for :.* : True
Logical operation result is TRUE
Running script  :   ZOMBIE_TESTS_COUNT=`jps | grep surefirebooter | wc -l`
  if [[ $ZOMBIE_TESTS_COUNT != 0 ]] ; then
    #It seems sometimes the tests are not dying immediately. Let's give them 10s
    echo "Suspicious java process found - waiting 10s to see if there are just slow to stop"
    sleep 10   
    ZOMBIE_TESTS_COUNT=`jps | grep surefirebooter | wc -l`
    if [[ $ZOMBIE_TESTS_COUNT != 0 ]] ; then
      echo "There are $ZOMBIE_TESTS_COUNT zombie tests, they should have been killed by surefire but survived"
      echo "************ BEGIN zombies jstack extract"
      ZB_STACK=`jps | grep surefirebooter | cut -d ' ' -f 1 | xargs -n 1 jstack | grep ".test" | grep "\.java"`
      jps | grep surefirebooter | cut -d ' ' -f 1 | xargs -n 1 jstack
      echo "************ END  zombies jstack extract"
      JIRA_COMMENT="$JIRA_COMMENT

     {color:red}-1 core zombie tests{color}.  There are ${ZOMBIE_TESTS_COUNT} zombie test(s): ${ZB_STACK}"
      BAD=1
      jps | grep surefirebooter | cut -d ' ' -f 1 | xargs kill -9
    else
      echo "We're ok: there is no zombie test, but some tests took some time to stop"
    fi
  else
    echo "We're ok: there is no zombie test"
  fi
[HBase-1.0] $ /bin/bash -xe /tmp/hudson4940325358172344093.sh
++ jps
++ grep surefirebooter
++ wc -l
+ ZOMBIE_TESTS_COUNT=1
+ [[ 1 != 0 ]]
+ echo 'Suspicious java process found - waiting 10s to see if there are just slow to stop'
Suspicious java process found - waiting 10s to see if there are just slow to stop
+ sleep 10
++ jps
++ grep surefirebooter
++ wc -l
+ ZOMBIE_TESTS_COUNT=1
+ [[ 1 != 0 ]]
+ echo 'There are 1 zombie tests, they should have been killed by surefire but survived'
There are 1 zombie tests, they should have been killed by surefire but survived
+ echo '************ BEGIN zombies jstack extract'
************ BEGIN zombies jstack extract
++ jps
++ cut -d ' ' -f 1
++ grep surefirebooter
++ grep '\.java'
++ grep .test
++ xargs -n 1 jstack
+ ZB_STACK='	at org.apache.blur.lucene.warmup.IndexWarmupTest.testIndexWarmupBitSet(IndexWarmupTest.java:90)'
+ jps
+ grep surefirebooter
+ xargs -n 1 jstack
+ cut -d ' ' -f 1
2014-08-12 13:18:17
Full thread dump Java HotSpot(TM) Server VM (23.25-b01 mixed mode):

"Attach Listener" daemon prio=10 tid=0xaa900800 nid=0x3e1 waiting on condition [0x00000000]
   java.lang.Thread.State: RUNNABLE

"Lucene Merge Thread #1" daemon prio=10 tid=0xa9fbf800 nid=0x290 in Object.wait() [0xab97d000]
   java.lang.Thread.State: TIMED_WAITING (on object monitor)
	at java.lang.Object.wait(Native Method)
	at org.apache.lucene.index.MergePolicy$OneMerge.checkAborted(MergePolicy.java:211)
	- locked <0xc323b200> (a org.apache.lucene.index.MergePolicy$OneMerge)
	at org.apache.lucene.index.IndexWriter.mergeMiddle(IndexWriter.java:3614)
	at org.apache.lucene.index.IndexWriter.merge(IndexWriter.java:3313)
	at org.apache.lucene.index.ConcurrentMergeScheduler.doMerge(ConcurrentMergeScheduler.java:401)
	at org.apache.lucene.index.ConcurrentMergeScheduler$MergeThread.run(ConcurrentMergeScheduler.java:478)

"Lucene Merge Thread #0" daemon prio=10 tid=0xa9fbec00 nid=0x7eaf in Object.wait() [0xf1d7d000]
   java.lang.Thread.State: TIMED_WAITING (on object monitor)
	at java.lang.Object.wait(Native Method)
	at org.apache.blur.lucene.warmup.SlowAccessDirectory$SlowAccessIndexInput.delay(SlowAccessDirectory.java:48)
	- locked <0xc100b308> (a org.apache.blur.lucene.warmup.SlowAccessDirectory$SlowAccessIndexInput)
	at org.apache.blur.lucene.warmup.SlowAccessDirectory$SlowAccessIndexInput.readInternal(SlowAccessDirectory.java:72)
	at org.apache.lucene.store.BufferedIndexInput.refill(BufferedIndexInput.java:272)
	at org.apache.lucene.store.BufferedIndexInput.readByte(BufferedIndexInput.java:51)
	at org.apache.blur.lucene.warmup.TraceableIndexInput.readByte(TraceableIndexInput.java:62)
	at org.apache.lucene.store.DataInput.readVInt(DataInput.java:108)
	at org.apache.lucene.codecs.BlockTreeTermsReader$FieldReader$SegmentTermsEnum$Frame.loadBlock(BlockTreeTermsReader.java:2357)
	at org.apache.lucene.codecs.BlockTreeTermsReader$FieldReader$SegmentTermsEnum.next(BlockTreeTermsReader.java:2148)
	at org.apache.lucene.index.MultiTermsEnum.pushTop(MultiTermsEnum.java:292)
	at org.apache.lucene.index.MultiTermsEnum.next(MultiTermsEnum.java:318)
	at org.apache.lucene.codecs.TermsConsumer.merge(TermsConsumer.java:156)
	at org.apache.lucene.codecs.FieldsConsumer.merge(FieldsConsumer.java:72)
	at org.apache.lucene.index.SegmentMerger.mergeTerms(SegmentMerger.java:365)
	at org.apache.lucene.index.SegmentMerger.merge(SegmentMerger.java:98)
	at org.apache.lucene.index.IndexWriter.mergeMiddle(IndexWriter.java:3709)
	at org.apache.lucene.index.IndexWriter.merge(IndexWriter.java:3313)
	at org.apache.lucene.index.ConcurrentMergeScheduler.doMerge(ConcurrentMergeScheduler.java:401)
	at org.apache.lucene.index.ConcurrentMergeScheduler$MergeThread.run(ConcurrentMergeScheduler.java:478)

"Service Thread" daemon prio=10 tid=0xab171c00 nid=0x7c1c runnable [0x00000000]
   java.lang.Thread.State: RUNNABLE

"C2 CompilerThread1" daemon prio=10 tid=0xab16fc00 nid=0x7c1b waiting on condition [0x00000000]
   java.lang.Thread.State: RUNNABLE

"C2 CompilerThread0" daemon prio=10 tid=0xab16e400 nid=0x7c1a waiting on condition [0x00000000]
   java.lang.Thread.State: RUNNABLE

"Signal Dispatcher" daemon prio=10 tid=0xab16c800 nid=0x7c19 runnable [0x00000000]
   java.lang.Thread.State: RUNNABLE

"Surrogate Locker Thread (Concurrent GC)" daemon prio=10 tid=0xab16b000 nid=0x7c18 waiting on condition [0x00000000]
   java.lang.Thread.State: RUNNABLE

"Finalizer" daemon prio=10 tid=0xab130800 nid=0x7c17 in Object.wait() [0xf2f7d000]
   java.lang.Thread.State: WAITING (on object monitor)
	at java.lang.Object.wait(Native Method)
	at java.lang.ref.ReferenceQueue.remove(ReferenceQueue.java:135)
	- locked <0xc3164860> (a java.lang.ref.ReferenceQueue$Lock)
	at java.lang.ref.ReferenceQueue.remove(ReferenceQueue.java:151)
	at java.lang.ref.Finalizer$FinalizerThread.run(Finalizer.java:189)

"Reference Handler" daemon prio=10 tid=0xab12e800 nid=0x7c16 in Object.wait() [0xf317d000]
   java.lang.Thread.State: WAITING (on object monitor)
	at java.lang.Object.wait(Native Method)
	at java.lang.Object.wait(Object.java:503)
	at java.lang.ref.Reference$ReferenceHandler.run(Reference.java:133)
	- locked <0xc3160b98> (a java.lang.ref.Reference$Lock)

"main" prio=10 tid=0xf6706800 nid=0x7c02 runnable [0xf689a000]
   java.lang.Thread.State: RUNNABLE
	at org.apache.lucene.index.FreqProxTermsWriterPerField.flush(FreqProxTermsWriterPerField.java:541)
	at org.apache.lucene.index.FreqProxTermsWriter.flush(FreqProxTermsWriter.java:85)
	at org.apache.lucene.index.TermsHash.flush(TermsHash.java:116)
	at org.apache.lucene.index.DocInverter.flush(DocInverter.java:53)
	at org.apache.lucene.index.DocFieldProcessor.flush(DocFieldProcessor.java:81)
	at org.apache.lucene.index.DocumentsWriterPerThread.flush(DocumentsWriterPerThread.java:493)
	at org.apache.lucene.index.DocumentsWriter.doFlush(DocumentsWriter.java:422)
	at org.apache.lucene.index.DocumentsWriter.postUpdate(DocumentsWriter.java:316)
	at org.apache.lucene.index.DocumentsWriter.updateDocument(DocumentsWriter.java:389)
	at org.apache.lucene.index.IndexWriter.updateDocument(IndexWriter.java:1485)
	at org.apache.lucene.index.IndexWriter.addDocument(IndexWriter.java:1160)
	at org.apache.lucene.index.IndexWriter.addDocument(IndexWriter.java:1141)
	at org.apache.blur.lucene.warmup.IndexWarmupTest.addDocs(IndexWarmupTest.java:149)
	at org.apache.blur.lucene.warmup.IndexWarmupTest.populate(IndexWarmupTest.java:143)
	at org.apache.blur.lucene.warmup.IndexWarmupTest.getIndexReader(IndexWarmupTest.java:131)
	at org.apache.blur.lucene.warmup.IndexWarmupTest.testIndexWarmupBitSet(IndexWarmupTest.java:90)
	at sun.reflect.NativeMethodAccessorImpl.invoke0(Native Method)
	at sun.reflect.NativeMethodAccessorImpl.invoke(NativeMethodAccessorImpl.java:57)
	at sun.reflect.DelegatingMethodAccessorImpl.invoke(DelegatingMethodAccessorImpl.java:43)
	at java.lang.reflect.Method.invoke(Method.java:606)
	at org.junit.runners.model.FrameworkMethod$1.runReflectiveCall(FrameworkMethod.java:44)
	at org.junit.internal.runners.model.ReflectiveCallable.run(ReflectiveCallable.java:15)
	at org.junit.runners.model.FrameworkMethod.invokeExplosively(FrameworkMethod.java:41)
	at org.junit.internal.runners.statements.InvokeMethod.evaluate(InvokeMethod.java:20)
	at org.junit.runners.ParentRunner.runLeaf(ParentRunner.java:263)
	at org.junit.runners.BlockJUnit4ClassRunner.runChild(BlockJUnit4ClassRunner.java:69)
	at org.junit.runners.BlockJUnit4ClassRunner.runChild(BlockJUnit4ClassRunner.java:48)
	at org.junit.runners.ParentRunner$3.run(ParentRunner.java:231)
	at org.junit.runners.ParentRunner$1.schedule(ParentRunner.java:60)
	at org.junit.runners.ParentRunner.runChildren(ParentRunner.java:229)
	at org.junit.runners.ParentRunner.access$000(ParentRunner.java:50)
	at org.junit.runners.ParentRunner$2.evaluate(ParentRunner.java:222)
	at org.junit.runners.ParentRunner.run(ParentRunner.java:292)
	at org.apache.maven.surefire.junit4.JUnit4Provider.execute(JUnit4Provider.java:252)
	at org.apache.maven.surefire.junit4.JUnit4Provider.executeTestSet(JUnit4Provider.java:141)
	at org.apache.maven.surefire.junit4.JUnit4Provider.invoke(JUnit4Provider.java:112)
	at sun.reflect.NativeMethodAccessorImpl.invoke0(Native Method)
	at sun.reflect.NativeMethodAccessorImpl.invoke(NativeMethodAccessorImpl.java:57)
	at sun.reflect.DelegatingMethodAccessorImpl.invoke(DelegatingMethodAccessorImpl.java:43)
	at java.lang.reflect.Method.invoke(Method.java:606)
	at org.apache.maven.surefire.util.ReflectionUtils.invokeMethodWithArray(ReflectionUtils.java:189)
	at org.apache.maven.surefire.booter.ProviderFactory$ProviderProxy.invoke(ProviderFactory.java:165)
	at org.apache.maven.surefire.booter.ProviderFactory.invokeProvider(ProviderFactory.java:85)
	at org.apache.maven.surefire.booter.ForkedBooter.runSuitesInProcess(ForkedBooter.java:115)
	at org.apache.maven.surefire.booter.ForkedBooter.main(ForkedBooter.java:75)

"VM Thread" prio=10 tid=0xab129000 nid=0x7c15 runnable 

"Gang worker#0 (Parallel GC Threads)" prio=10 tid=0xf670d800 nid=0x7c03 runnable 

"Gang worker#1 (Parallel GC Threads)" prio=10 tid=0xf670f000 nid=0x7c04 runnable 

"Gang worker#2 (Parallel GC Threads)" prio=10 tid=0xf6710800 nid=0x7c05 runnable 

"Gang worker#3 (Parallel GC Threads)" prio=10 tid=0xf6711c00 nid=0x7c06 runnable 

"Gang worker#4 (Parallel GC Threads)" prio=10 tid=0xf6713400 nid=0x7c07 runnable 

"Gang worker#5 (Parallel GC Threads)" prio=10 tid=0xf6714c00 nid=0x7c08 runnable 

"Gang worker#6 (Parallel GC Threads)" prio=10 tid=0xf6716000 nid=0x7c09 runnable 

"Gang worker#7 (Parallel GC Threads)" prio=10 tid=0xf6717800 nid=0x7c0a runnable 

"Gang worker#8 (Parallel GC Threads)" prio=10 tid=0xf6719000 nid=0x7c0b runnable 

"Gang worker#9 (Parallel GC Threads)" prio=10 tid=0xf671a400 nid=0x7c0c runnable 

"Gang worker#10 (Parallel GC Threads)" prio=10 tid=0xf671bc00 nid=0x7c0d runnable 

"Gang worker#11 (Parallel GC Threads)" prio=10 tid=0xf671d400 nid=0x7c0e runnable 

"Gang worker#12 (Parallel GC Threads)" prio=10 tid=0xf671e800 nid=0x7c0f runnable 

"Concurrent Mark-Sweep GC Thread" prio=10 tid=0xab3a0400 nid=0x7c14 runnable 
"Gang worker#0 (Parallel CMS Threads)" prio=10 tid=0xad7c1c00 nid=0x7c10 runnable 

"Gang worker#1 (Parallel CMS Threads)" prio=10 tid=0xad7c3400 nid=0x7c11 runnable 

"Gang worker#2 (Parallel CMS Threads)" prio=10 tid=0xad7c4800 nid=0x7c12 runnable 

"Gang worker#3 (Parallel CMS Threads)" prio=10 tid=0xad7c6000 nid=0x7c13 runnable 

"VM Periodic Task Thread" prio=10 tid=0xab173c00 nid=0x7c1d waiting on condition 

JNI global references: 228

+ echo '************ END  zombies jstack extract'
************ END  zombies jstack extract
+ JIRA_COMMENT='

     {color:red}-1 core zombie tests{color}.  There are 1 zombie test(s): 	at org.apache.blur.lucene.warmup.IndexWarmupTest.testIndexWarmupBitSet(IndexWarmupTest.java:90)'
+ BAD=1
+ jps
+ grep surefirebooter
+ cut -d ' ' -f 1
+ xargs kill -9
POST BUILD TASK : SUCCESS
END OF POST BUILD TASK : 0
Archiving artifacts
Sending artifact delta relative to HBase-1.0 #88
Archived 1754 artifacts
Archive block size is 32768
Received 70 blocks and 672432492 bytes
Compression is 0.3%
Took 3 min 32 sec
Recording test results
Updating HBASE-11718
Updating HBASE-11719

Build failed in Jenkins: HBase-1.0 #94

Posted by Apache Jenkins Server <je...@builds.apache.org>.
See <https://builds.apache.org/job/HBase-1.0/94/changes>

Changes:

[apurtell] HBASE-11716 LoadTestDataGeneratorWithVisibilityLabels should handle Delete mutations (Anoop Sam John)

------------------------------------------
[...truncated 1616 lines...]
Tests run: 44, Failures: 0, Errors: 0, Skipped: 0, Time elapsed: 119.78 sec
Running org.apache.hadoop.hbase.TestGlobalMemStoreSize
Tests run: 1, Failures: 0, Errors: 0, Skipped: 0, Time elapsed: 13.498 sec
Running org.apache.hadoop.hbase.constraint.TestConstraint
Tests run: 5, Failures: 0, Errors: 0, Skipped: 0, Time elapsed: 16.476 sec
Running org.apache.hadoop.hbase.rest.TestSchemaResource
Tests run: 2, Failures: 0, Errors: 0, Skipped: 0, Time elapsed: 13.92 sec
Running org.apache.hadoop.hbase.rest.client.TestRemoteTable
Tests run: 9, Failures: 0, Errors: 0, Skipped: 0, Time elapsed: 22.811 sec
Running org.apache.hadoop.hbase.rest.TestTableResource
Tests run: 8, Failures: 0, Errors: 0, Skipped: 0, Time elapsed: 27.936 sec
Running org.apache.hadoop.hbase.rest.TestMultiRowResource
Tests run: 3, Failures: 0, Errors: 0, Skipped: 0, Time elapsed: 13.863 sec
Running org.apache.hadoop.hbase.rest.TestGetAndPutResource
Tests run: 18, Failures: 0, Errors: 0, Skipped: 0, Time elapsed: 36.249 sec
Running org.apache.hadoop.hbase.rest.TestGzipFilter
Tests run: 2, Failures: 0, Errors: 0, Skipped: 0, Time elapsed: 13.108 sec
Running org.apache.hadoop.hbase.rest.TestResourceFilter
Tests run: 1, Failures: 0, Errors: 0, Skipped: 0, Time elapsed: 11.098 sec
Running org.apache.hadoop.hbase.rest.TestDeleteRow
Tests run: 2, Failures: 0, Errors: 0, Skipped: 0, Time elapsed: 14.764 sec
Running org.apache.hadoop.hbase.rest.TestTableScan
Tests run: 10, Failures: 0, Errors: 0, Skipped: 0, Time elapsed: 37.69 sec
Running org.apache.hadoop.hbase.rest.TestScannerResource
Tests run: 5, Failures: 0, Errors: 0, Skipped: 0, Time elapsed: 32.559 sec
Running org.apache.hadoop.hbase.rest.TestVersionResource
Tests run: 7, Failures: 0, Errors: 0, Skipped: 0, Time elapsed: 12.329 sec
Running org.apache.hadoop.hbase.rest.TestStatusResource
Tests run: 2, Failures: 0, Errors: 0, Skipped: 0, Time elapsed: 11.957 sec
Running org.apache.hadoop.hbase.rest.TestScannersWithLabels
Tests run: 2, Failures: 0, Errors: 0, Skipped: 0, Time elapsed: 13.863 sec
Running org.apache.hadoop.hbase.rest.TestScannersWithFilters
Tests run: 10, Failures: 0, Errors: 0, Skipped: 0, Time elapsed: 16.777 sec
Running org.apache.hadoop.hbase.io.hfile.TestHFileBlockIndex
Tests run: 2, Failures: 0, Errors: 0, Skipped: 0, Time elapsed: 0.721 sec
Running org.apache.hadoop.hbase.io.hfile.TestHFileSeek
Tests run: 1, Failures: 0, Errors: 0, Skipped: 0, Time elapsed: 2.715 sec
Running org.apache.hadoop.hbase.trace.TestHTraceHooks
Tests run: 1, Failures: 0, Errors: 0, Skipped: 0, Time elapsed: 11.917 sec
Running org.apache.hadoop.hbase.io.hfile.TestCacheConfig
Tests run: 6, Failures: 0, Errors: 0, Skipped: 0, Time elapsed: 1.458 sec
Running org.apache.hadoop.hbase.io.hfile.TestForceCacheImportantBlocks
Tests run: 2, Failures: 0, Errors: 0, Skipped: 0, Time elapsed: 19.382 sec
Running org.apache.hadoop.hbase.io.hfile.TestCacheOnWrite
Tests run: 36, Failures: 0, Errors: 0, Skipped: 0, Time elapsed: 63.573 sec
Running org.apache.hadoop.hbase.io.hfile.TestScannerSelectionUsingTTL
Tests run: 6, Failures: 0, Errors: 0, Skipped: 0, Time elapsed: 62.265 sec
Running org.apache.hadoop.hbase.io.TestFileLink
Tests run: 3, Failures: 0, Errors: 0, Skipped: 0, Time elapsed: 18.069 sec
Running org.apache.hadoop.hbase.io.hfile.TestHFileBlock
Tests run: 28, Failures: 0, Errors: 0, Skipped: 0, Time elapsed: 93.223 sec
Running org.apache.hadoop.hbase.io.encoding.TestEncodedSeekers
Tests run: 20, Failures: 0, Errors: 0, Skipped: 0, Time elapsed: 119.253 sec
Running org.apache.hadoop.hbase.io.encoding.TestChangingEncoding
Tests run: 3, Failures: 0, Errors: 0, Skipped: 0, Time elapsed: 73.711 sec
Running org.apache.hadoop.hbase.io.encoding.TestBufferedDataBlockEncoder
Tests run: 1, Failures: 0, Errors: 0, Skipped: 0, Time elapsed: 17.642 sec
Running org.apache.hadoop.hbase.io.encoding.TestLoadAndSwitchEncodeOnDisk
Tests run: 1, Failures: 0, Errors: 0, Skipped: 0, Time elapsed: 22.37 sec
Running org.apache.hadoop.hbase.TestRegionRebalancing
Tests run: 2, Failures: 0, Errors: 0, Skipped: 0, Time elapsed: 53.919 sec
Running org.apache.hadoop.hbase.TestHColumnDescriptorDefaultVersions
Tests run: 3, Failures: 0, Errors: 0, Skipped: 0, Time elapsed: 22.349 sec
Running org.apache.hadoop.hbase.io.encoding.TestDataBlockEncoders
Tests run: 28, Failures: 0, Errors: 0, Skipped: 0, Time elapsed: 182.747 sec
Running org.apache.hadoop.hbase.mapred.TestTableInputFormat
Tests run: 10, Failures: 0, Errors: 0, Skipped: 0, Time elapsed: 14.726 sec
Running org.apache.hadoop.hbase.mapred.TestTableMapReduceUtil
Tests run: 4, Failures: 0, Errors: 0, Skipped: 0, Time elapsed: 106.389 sec
Running org.apache.hadoop.hbase.mapred.TestTableMapReduce
Tests run: 2, Failures: 0, Errors: 0, Skipped: 0, Time elapsed: 113.655 sec
Running org.apache.hadoop.hbase.replication.TestReplicationTrackerZKImpl
Tests run: 4, Failures: 0, Errors: 0, Skipped: 2, Time elapsed: 1.717 sec
Running org.apache.hadoop.hbase.replication.TestReplicationEndpoint
Tests run: 3, Failures: 0, Errors: 0, Skipped: 0, Time elapsed: 29.167 sec
Running org.apache.hadoop.hbase.replication.TestReplicationDisableInactivePeer
Tests run: 1, Failures: 0, Errors: 0, Skipped: 0, Time elapsed: 41.456 sec
Running org.apache.hadoop.hbase.replication.TestReplicationKillMasterRSCompressed
Tests run: 1, Failures: 0, Errors: 0, Skipped: 0, Time elapsed: 36.3 sec
Running org.apache.hadoop.hbase.replication.TestPerTableCFReplication
Tests run: 2, Failures: 0, Errors: 0, Skipped: 0, Time elapsed: 46.573 sec
Running org.apache.hadoop.hbase.mapred.TestTableSnapshotInputFormat
Tests run: 6, Failures: 0, Errors: 0, Skipped: 0, Time elapsed: 266.954 sec
Running org.apache.hadoop.hbase.replication.regionserver.TestReplicationSink
Tests run: 5, Failures: 0, Errors: 0, Skipped: 0, Time elapsed: 13.007 sec
Running org.apache.hadoop.hbase.replication.regionserver.TestReplicationSourceManager
Tests run: 4, Failures: 0, Errors: 0, Skipped: 0, Time elapsed: 6.865 sec
Running org.apache.hadoop.hbase.replication.TestReplicationSource
Tests run: 1, Failures: 0, Errors: 0, Skipped: 0, Time elapsed: 4.446 sec
Running org.apache.hadoop.hbase.replication.TestReplicationChangingPeerRegionservers
Tests run: 1, Failures: 0, Errors: 0, Skipped: 0, Time elapsed: 26.466 sec
Running org.apache.hadoop.hbase.replication.TestReplicationSyncUpTool
Tests run: 1, Failures: 0, Errors: 0, Skipped: 0, Time elapsed: 75.287 sec
Running org.apache.hadoop.hbase.replication.TestReplicationKillMasterRS
Tests run: 1, Failures: 0, Errors: 0, Skipped: 0, Time elapsed: 38.304 sec
Running org.apache.hadoop.hbase.replication.TestMultiSlaveReplication
Tests run: 1, Failures: 0, Errors: 0, Skipped: 0, Time elapsed: 27.29 sec
Running org.apache.hadoop.hbase.replication.regionserver.TestReplicationHLogReaderManager
Tests run: 8, Failures: 0, Errors: 0, Skipped: 0, Time elapsed: 236.736 sec
Running org.apache.hadoop.hbase.replication.TestReplicationWithTags
Tests run: 1, Failures: 0, Errors: 0, Skipped: 0, Time elapsed: 23.188 sec
Running org.apache.hadoop.hbase.replication.TestReplicationStateZKImpl
Tests run: 6, Failures: 0, Errors: 0, Skipped: 0, Time elapsed: 6.109 sec
Running org.apache.hadoop.hbase.replication.TestReplicationKillSlaveRS
Tests run: 1, Failures: 0, Errors: 0, Skipped: 0, Time elapsed: 32.742 sec
Running org.apache.hadoop.hbase.replication.TestReplicationSmallTests
Tests run: 9, Failures: 0, Errors: 0, Skipped: 0, Time elapsed: 55.826 sec
Running org.apache.hadoop.hbase.replication.TestMasterReplication
Tests run: 3, Failures: 0, Errors: 0, Skipped: 0, Time elapsed: 62.007 sec
Running org.apache.hadoop.hbase.util.TestFSTableDescriptors
Tests run: 12, Failures: 0, Errors: 0, Skipped: 0, Time elapsed: 2.161 sec
Running org.apache.hadoop.hbase.util.TestMergeTool
Tests run: 1, Failures: 0, Errors: 0, Skipped: 0, Time elapsed: 17.989 sec
Running org.apache.hadoop.hbase.util.TestHBaseFsckEncryption
Tests run: 1, Failures: 0, Errors: 0, Skipped: 0, Time elapsed: 12.45 sec
Running org.apache.hadoop.hbase.util.TestIdLock
Tests run: 1, Failures: 0, Errors: 0, Skipped: 0, Time elapsed: 15.416 sec
Running org.apache.hadoop.hbase.util.TestMergeTable
Tests run: 1, Failures: 0, Errors: 0, Skipped: 0, Time elapsed: 21.105 sec
Running org.apache.hadoop.hbase.util.TestMiniClusterLoadSequential
Tests run: 4, Failures: 0, Errors: 0, Skipped: 0, Time elapsed: 50.242 sec
Running org.apache.hadoop.hbase.util.TestMiniClusterLoadParallel
Tests run: 4, Failures: 0, Errors: 0, Skipped: 0, Time elapsed: 49.247 sec
Running org.apache.hadoop.hbase.util.TestFSUtils
Tests run: 7, Failures: 0, Errors: 0, Skipped: 0, Time elapsed: 16.668 sec
Running org.apache.hadoop.hbase.util.TestRegionSplitter
Tests run: 5, Failures: 0, Errors: 0, Skipped: 0, Time elapsed: 16.615 sec
Running org.apache.hadoop.hbase.util.TestProcessBasedCluster
Tests run: 1, Failures: 0, Errors: 0, Skipped: 0, Time elapsed: 0.54 sec
Running org.apache.hadoop.hbase.util.TestMiniClusterLoadEncoded
Tests run: 5, Failures: 0, Errors: 0, Skipped: 0, Time elapsed: 56.34 sec
Running org.apache.hadoop.hbase.util.TestCoprocessorScanPolicy
Tests run: 4, Failures: 0, Errors: 0, Skipped: 0, Time elapsed: 14.221 sec
Running org.apache.hadoop.hbase.util.TestFSVisitor
Tests run: 3, Failures: 0, Errors: 0, Skipped: 0, Time elapsed: 3.823 sec
Running org.apache.hadoop.hbase.util.hbck.TestOfflineMetaRebuildBase
Tests run: 1, Failures: 0, Errors: 0, Skipped: 0, Time elapsed: 22.636 sec
Running org.apache.hadoop.hbase.util.hbck.TestOfflineMetaRebuildOverlap
Tests run: 1, Failures: 0, Errors: 0, Skipped: 0, Time elapsed: 20.238 sec
Running org.apache.hadoop.hbase.util.hbck.TestOfflineMetaRebuildHole
Tests run: 1, Failures: 0, Errors: 0, Skipped: 0, Time elapsed: 21.407 sec
Running org.apache.hadoop.hbase.util.TestDefaultEnvironmentEdge
Tests run: 1, Failures: 0, Errors: 0, Skipped: 0, Time elapsed: 0.34 sec
Running org.apache.hadoop.hbase.util.TestFSHDFSUtils
Tests run: 3, Failures: 0, Errors: 0, Skipped: 0, Time elapsed: 6.203 sec
Running org.apache.hadoop.hbase.TestMetaTableAccessorNoCluster
Tests run: 2, Failures: 0, Errors: 0, Skipped: 0, Time elapsed: 3.788 sec
Running org.apache.hadoop.hbase.migration.TestNamespaceUpgrade
Tests run: 5, Failures: 0, Errors: 0, Skipped: 0, Time elapsed: 31.369 sec
Running org.apache.hadoop.hbase.migration.TestUpgradeTo96
Tests run: 5, Failures: 0, Errors: 0, Skipped: 0, Time elapsed: 9.29 sec
Running org.apache.hadoop.hbase.TestNamespace
Tests run: 9, Failures: 0, Errors: 0, Skipped: 1, Time elapsed: 22.576 sec
Running org.apache.hadoop.hbase.util.TestHBaseFsck
Tests run: 43, Failures: 0, Errors: 0, Skipped: 1, Time elapsed: 288.876 sec
Running org.apache.hadoop.hbase.TestInfoServers
Tests run: 3, Failures: 0, Errors: 0, Skipped: 0, Time elapsed: 13.498 sec
Running org.apache.hadoop.hbase.TestMetaTableAccessor
Tests run: 8, Failures: 0, Errors: 0, Skipped: 0, Time elapsed: 18.811 sec

Results :

Failed tests:   testNonCachedGetRegionLocation(org.apache.hadoop.hbase.client.TestFromClientSideWithCoprocessor): expected:<41732> but was:<56835>

Tests run: 2102, Failures: 1, Errors: 0, Skipped: 21

[INFO] ------------------------------------------------------------------------
[INFO] Reactor Summary:
[INFO] 
[INFO] HBase ............................................. SUCCESS [9.458s]
[INFO] HBase - Common .................................... SUCCESS [46.351s]
[INFO] HBase - Protocol .................................. SUCCESS [8.063s]
[INFO] HBase - Client .................................... SUCCESS [55.019s]
[INFO] HBase - Hadoop Compatibility ...................... SUCCESS [5.577s]
[INFO] HBase - Hadoop Two Compatibility .................. SUCCESS [2.005s]
[INFO] HBase - Prefix Tree ............................... SUCCESS [3.635s]
[INFO] HBase - Server .................................... FAILURE [2:09:47.955s]
[INFO] HBase - Testing Util .............................. SKIPPED
[INFO] HBase - Thrift .................................... SKIPPED
[INFO] HBase - Shell ..................................... SKIPPED
[INFO] HBase - Integration Tests ......................... SKIPPED
[INFO] HBase - Examples .................................. SKIPPED
[INFO] HBase - Assembly .................................. SKIPPED
[INFO] ------------------------------------------------------------------------
[INFO] BUILD FAILURE
[INFO] ------------------------------------------------------------------------
[INFO] Total time: 2:11:58.816s
[INFO] Finished at: Mon Aug 11 23:52:35 UTC 2014
[INFO] Final Memory: 39M/422M
[INFO] ------------------------------------------------------------------------
[ERROR] Failed to execute goal org.apache.maven.plugins:maven-surefire-plugin:2.12-TRUNK-HBASE-2:test (secondPartTestsExecution) on project hbase-server: There are test failures.
[ERROR] 
[ERROR] Please refer to /x1/jenkins/jenkins-slave/workspace/HBase-1.0/hbase-server/target/surefire-reports for the individual test results.
[ERROR] -> [Help 1]
[ERROR] 
[ERROR] To see the full stack trace of the errors, re-run Maven with the -e switch.
[ERROR] Re-run Maven using the -X switch to enable full debug logging.
[ERROR] 
[ERROR] For more information about the errors and possible solutions, please read the following articles:
[ERROR] [Help 1] http://cwiki.apache.org/confluence/display/MAVEN/MojoFailureException
[ERROR] 
[ERROR] After correcting the problems, you can resume the build with the command
[ERROR]   mvn <goals> -rf :hbase-server
Build step 'Invoke top-level Maven targets' marked build as failure
Performing Post build task...
Match found for :.* : True
Logical operation result is TRUE
Running script  :   ZOMBIE_TESTS_COUNT=`jps | grep surefirebooter | wc -l`
  if [[ $ZOMBIE_TESTS_COUNT != 0 ]] ; then
    #It seems sometimes the tests are not dying immediately. Let's give them 10s
    echo "Suspicious java process found - waiting 10s to see if there are just slow to stop"
    sleep 10   
    ZOMBIE_TESTS_COUNT=`jps | grep surefirebooter | wc -l`
    if [[ $ZOMBIE_TESTS_COUNT != 0 ]] ; then
      echo "There are $ZOMBIE_TESTS_COUNT zombie tests, they should have been killed by surefire but survived"
      echo "************ BEGIN zombies jstack extract"
      ZB_STACK=`jps | grep surefirebooter | cut -d ' ' -f 1 | xargs -n 1 jstack | grep ".test" | grep "\.java"`
      jps | grep surefirebooter | cut -d ' ' -f 1 | xargs -n 1 jstack
      echo "************ END  zombies jstack extract"
      JIRA_COMMENT="$JIRA_COMMENT

     {color:red}-1 core zombie tests{color}.  There are ${ZOMBIE_TESTS_COUNT} zombie test(s): ${ZB_STACK}"
      BAD=1
      jps | grep surefirebooter | cut -d ' ' -f 1 | xargs kill -9
    else
      echo "We're ok: there is no zombie test, but some tests took some time to stop"
    fi
  else
    echo "We're ok: there is no zombie test"
  fi
[HBase-1.0] $ /bin/bash -xe /tmp/hudson5759830896704316842.sh
++ jps
++ grep surefirebooter
++ wc -l
+ ZOMBIE_TESTS_COUNT=0
+ [[ 0 != 0 ]]
+ echo 'We'\''re ok: there is no zombie test'
We're ok: there is no zombie test
POST BUILD TASK : SUCCESS
END OF POST BUILD TASK : 0
Archiving artifacts
Sending artifact delta relative to HBase-1.0 #88
Archived 1755 artifacts
Archive block size is 32768
Received 70 blocks and 1016582910 bytes
Compression is 0.2%
Took 4 min 44 sec
Recording test results
Updating HBASE-11716

Build failed in Jenkins: HBase-1.0 #93

Posted by Apache Jenkins Server <je...@builds.apache.org>.
See <https://builds.apache.org/job/HBase-1.0/93/changes>

Changes:

[anoopsamjohn] HBASE-11527 Cluster free memory limit check should consider L2 block cache size also when L2 cache is onheap. (Anoop)

------------------------------------------
[...truncated 1005 lines...]
Tests run: 9, Failures: 0, Errors: 0, Skipped: 0, Time elapsed: 0.56 sec
Running org.apache.hadoop.hbase.io.hfile.TestFixedFileTrailer
Tests run: 4, Failures: 0, Errors: 0, Skipped: 0, Time elapsed: 0.239 sec
Running org.apache.hadoop.hbase.io.hfile.TestCachedBlockQueue
Tests run: 2, Failures: 0, Errors: 0, Skipped: 0, Time elapsed: 0.047 sec
Running org.apache.hadoop.hbase.io.hfile.TestHFileBlockCompatibility
Tests run: 16, Failures: 0, Errors: 0, Skipped: 0, Time elapsed: 1.393 sec
Running org.apache.hadoop.hbase.io.hfile.TestHFileWriterV3
Tests run: 4, Failures: 0, Errors: 0, Skipped: 0, Time elapsed: 1.472 sec
Running org.apache.hadoop.hbase.io.hfile.TestReseekTo
Tests run: 1, Failures: 0, Errors: 0, Skipped: 0, Time elapsed: 0.077 sec
Running org.apache.hadoop.hbase.io.hfile.TestChecksum
Tests run: 3, Failures: 0, Errors: 0, Skipped: 0, Time elapsed: 0.302 sec
Running org.apache.hadoop.hbase.io.hfile.TestHFileDataBlockEncoder
Tests run: 30, Failures: 0, Errors: 0, Skipped: 0, Time elapsed: 0.686 sec
Running org.apache.hadoop.hbase.io.hfile.TestSeekTo
Tests run: 4, Failures: 0, Errors: 0, Skipped: 0, Time elapsed: 1.134 sec
Running org.apache.hadoop.hbase.io.hfile.TestHFileInlineToRootChunkConversion
Tests run: 1, Failures: 0, Errors: 0, Skipped: 0, Time elapsed: 0.034 sec
Running org.apache.hadoop.hbase.io.hfile.bucket.TestBucketCache
Tests run: 8, Failures: 0, Errors: 0, Skipped: 0, Time elapsed: 14.726 sec
Running org.apache.hadoop.hbase.io.hfile.bucket.TestByteBufferIOEngine
Tests run: 1, Failures: 0, Errors: 0, Skipped: 0, Time elapsed: 0.043 sec
Running org.apache.hadoop.hbase.io.hfile.bucket.TestFileIOEngine
Tests run: 1, Failures: 0, Errors: 0, Skipped: 0, Time elapsed: 0.017 sec
Running org.apache.hadoop.hbase.io.hfile.bucket.TestBucketWriterThread
Tests run: 4, Failures: 0, Errors: 0, Skipped: 0, Time elapsed: 0.194 sec
Running org.apache.hadoop.hbase.io.hfile.TestLruCachedBlock
Tests run: 1, Failures: 0, Errors: 0, Skipped: 0, Time elapsed: 0.035 sec
Running org.apache.hadoop.hbase.io.TestHalfStoreFileReader
Tests run: 2, Failures: 0, Errors: 0, Skipped: 0, Time elapsed: 0.063 sec
Running org.apache.hadoop.hbase.io.TestImmutableBytesWritable
Tests run: 3, Failures: 0, Errors: 0, Skipped: 0, Time elapsed: 0.045 sec
Running org.apache.hadoop.hbase.io.TestHeapSize
Tests run: 3, Failures: 0, Errors: 0, Skipped: 0, Time elapsed: 0.047 sec
Running org.apache.hadoop.hbase.io.TestReference
Tests run: 1, Failures: 0, Errors: 0, Skipped: 0, Time elapsed: 0.025 sec
Running org.apache.hadoop.hbase.io.encoding.TestSeekToBlockWithEncoders
Tests run: 9, Failures: 0, Errors: 0, Skipped: 0, Time elapsed: 0.129 sec
Running org.apache.hadoop.hbase.io.encoding.TestPrefixTreeEncoding
Tests run: 8, Failures: 0, Errors: 0, Skipped: 0, Time elapsed: 0.24 sec
Running org.apache.hadoop.hbase.io.TestHFileLink
Tests run: 2, Failures: 0, Errors: 0, Skipped: 0, Time elapsed: 0.047 sec
Running org.apache.hadoop.hbase.mapred.TestRowCounter
Tests run: 4, Failures: 0, Errors: 0, Skipped: 0, Time elapsed: 1.836 sec
Running org.apache.hadoop.hbase.mapred.TestGroupingTableMap
Tests run: 4, Failures: 0, Errors: 0, Skipped: 0, Time elapsed: 0.136 sec
Running org.apache.hadoop.hbase.mapred.TestSplitTable
Tests run: 2, Failures: 0, Errors: 0, Skipped: 0, Time elapsed: 0.045 sec
Running org.apache.hadoop.hbase.mapred.TestDriver
Tests run: 1, Failures: 0, Errors: 0, Skipped: 0, Time elapsed: 0.028 sec
Running org.apache.hadoop.hbase.mapred.TestIdentityTableMap
Tests run: 1, Failures: 0, Errors: 0, Skipped: 0, Time elapsed: 0.058 sec
Running org.apache.hadoop.hbase.replication.regionserver.TestReplicationSinkManager
Tests run: 5, Failures: 0, Errors: 0, Skipped: 0, Time elapsed: 0.237 sec
Running org.apache.hadoop.hbase.replication.regionserver.TestReplicationThrottler
Tests run: 1, Failures: 0, Errors: 0, Skipped: 0, Time elapsed: 0.024 sec
Running org.apache.hadoop.hbase.replication.TestReplicationWALEntryFilters
Tests run: 4, Failures: 0, Errors: 0, Skipped: 0, Time elapsed: 0.096 sec
Running org.apache.hadoop.hbase.TestCheckTestClasses
Tests run: 1, Failures: 0, Errors: 0, Skipped: 0, Time elapsed: 0.764 sec
Running org.apache.hadoop.hbase.util.TestHBaseFsckComparator
Tests run: 6, Failures: 0, Errors: 0, Skipped: 0, Time elapsed: 0.131 sec
Running org.apache.hadoop.hbase.util.TestCompressionTest
Tests run: 2, Failures: 0, Errors: 0, Skipped: 0, Time elapsed: 0.06 sec
Running org.apache.hadoop.hbase.util.TestSortedCopyOnWriteSet
Tests run: 2, Failures: 0, Errors: 0, Skipped: 0, Time elapsed: 0.044 sec
Running org.apache.hadoop.hbase.util.TestHFileArchiveUtil
Tests run: 4, Failures: 0, Errors: 0, Skipped: 0, Time elapsed: 0.123 sec
Running org.apache.hadoop.hbase.util.TestByteBloomFilter
Tests run: 5, Failures: 0, Errors: 0, Skipped: 0, Time elapsed: 0.809 sec
Running org.apache.hadoop.hbase.util.TestRootPath
Tests run: 1, Failures: 0, Errors: 0, Skipped: 0, Time elapsed: 0.021 sec
Running org.apache.hadoop.hbase.util.TestByteBufferUtils
Tests run: 12, Failures: 0, Errors: 0, Skipped: 0, Time elapsed: 0.454 sec
Running org.apache.hadoop.hbase.util.TestPoolMap$TestRoundRobinPoolType
Tests run: 3, Failures: 0, Errors: 0, Skipped: 0, Time elapsed: 0.075 sec
Running org.apache.hadoop.hbase.util.TestPoolMap$TestThreadLocalPoolType
Tests run: 3, Failures: 0, Errors: 0, Skipped: 0, Time elapsed: 0.072 sec
Running org.apache.hadoop.hbase.util.TestPoolMap$TestReusablePoolType
Tests run: 3, Failures: 0, Errors: 0, Skipped: 0, Time elapsed: 0.071 sec
Running org.apache.hadoop.hbase.util.TestTableName
Tests run: 4, Failures: 0, Errors: 0, Skipped: 0, Time elapsed: 0.098 sec
Running org.apache.hadoop.hbase.util.TestBoundedPriorityBlockingQueue
Tests run: 7, Failures: 0, Errors: 0, Skipped: 0, Time elapsed: 1.178 sec
Running org.apache.hadoop.hbase.util.TestIncrementingEnvironmentEdge
Tests run: 1, Failures: 0, Errors: 0, Skipped: 0, Time elapsed: 0.023 sec
Running org.apache.hadoop.hbase.util.TestRegionSizeCalculator
Tests run: 3, Failures: 0, Errors: 0, Skipped: 0, Time elapsed: 0.215 sec
Running org.apache.hadoop.hbase.util.TestRegionSplitCalculator
Tests run: 15, Failures: 0, Errors: 0, Skipped: 0, Time elapsed: 0.331 sec
Running org.apache.hadoop.hbase.TestHRegionLocation
Tests run: 3, Failures: 0, Errors: 0, Skipped: 0, Time elapsed: 0.066 sec
Running org.apache.hadoop.hbase.http.TestHtmlQuoting
Tests run: 4, Failures: 0, Errors: 0, Skipped: 0, Time elapsed: 0.103 sec
Running org.apache.hadoop.hbase.http.TestGlobalFilter
Tests run: 1, Failures: 0, Errors: 0, Skipped: 0, Time elapsed: 0.584 sec
Running org.apache.hadoop.hbase.http.log.TestLogLevel
Tests run: 1, Failures: 0, Errors: 0, Skipped: 0, Time elapsed: 0.234 sec
Running org.apache.hadoop.hbase.http.TestServletFilter
Tests run: 3, Failures: 0, Errors: 0, Skipped: 0, Time elapsed: 1.344 sec
Running org.apache.hadoop.hbase.http.TestHttpServerWebapps
Tests run: 2, Failures: 0, Errors: 0, Skipped: 0, Time elapsed: 0.102 sec
Running org.apache.hadoop.hbase.http.jmx.TestJMXJsonServlet
Tests run: 1, Failures: 0, Errors: 0, Skipped: 0, Time elapsed: 0.217 sec
Running org.apache.hadoop.hbase.http.conf.TestConfServlet
Tests run: 3, Failures: 0, Errors: 0, Skipped: 0, Time elapsed: 0.279 sec
Running org.apache.hadoop.hbase.http.TestPathFilter
Tests run: 1, Failures: 0, Errors: 0, Skipped: 0, Time elapsed: 0.261 sec
Running org.apache.hadoop.hbase.http.TestHttpRequestLogAppender
Tests run: 1, Failures: 0, Errors: 0, Skipped: 0, Time elapsed: 0.028 sec
Running org.apache.hadoop.hbase.http.lib.TestStaticUserWebFilter
Tests run: 3, Failures: 0, Errors: 0, Skipped: 0, Time elapsed: 0.115 sec
Running org.apache.hadoop.hbase.http.TestHttpServer
Tests run: 15, Failures: 0, Errors: 0, Skipped: 3, Time elapsed: 1.831 sec
Running org.apache.hadoop.hbase.http.TestHttpRequestLog
Tests run: 2, Failures: 0, Errors: 0, Skipped: 0, Time elapsed: 0.071 sec
Running org.apache.hadoop.hbase.http.TestSSLHttpServer
Tests run: 1, Failures: 0, Errors: 0, Skipped: 0, Time elapsed: 0.156 sec
Running org.apache.hadoop.hbase.http.TestHttpServerLifecycle
Tests run: 7, Failures: 0, Errors: 0, Skipped: 0, Time elapsed: 1.426 sec
Running org.apache.hadoop.hbase.TestNodeHealthCheckChore
Tests run: 4, Failures: 0, Errors: 0, Skipped: 0, Time elapsed: 10.224 sec
Running org.apache.hadoop.hbase.TestServerLoad
Tests run: 2, Failures: 0, Errors: 0, Skipped: 0, Time elapsed: 0.061 sec
Running org.apache.hadoop.hbase.TestCompare
Tests run: 1, Failures: 0, Errors: 0, Skipped: 0, Time elapsed: 0.03 sec
Running org.apache.hadoop.hbase.errorhandling.TestTimeoutExceptionInjector
Tests run: 4, Failures: 0, Errors: 0, Skipped: 0, Time elapsed: 0.151 sec
Running org.apache.hadoop.hbase.errorhandling.TestForeignExceptionDispatcher
Tests run: 3, Failures: 0, Errors: 0, Skipped: 0, Time elapsed: 0.081 sec
Running org.apache.hadoop.hbase.errorhandling.TestForeignExceptionSerialization
Tests run: 2, Failures: 0, Errors: 0, Skipped: 0, Time elapsed: 0.077 sec
Running org.apache.hadoop.hbase.TestServerName
Tests run: 6, Failures: 0, Errors: 0, Skipped: 0, Time elapsed: 231.221 sec
Running org.apache.hadoop.hbase.security.TestSecureRPC
Tests run: 1, Failures: 0, Errors: 0, Skipped: 1, Time elapsed: 231.221 sec
Running org.apache.hadoop.hbase.security.TestUsersOperationsWithSecureHadoop
Tests run: 1, Failures: 0, Errors: 0, Skipped: 1, Time elapsed: 231.221 sec
Running org.apache.hadoop.hbase.procedure.TestProcedureMember
Tests run: 8, Failures: 0, Errors: 1, Skipped: 0, Time elapsed: 231.221 sec <<< FAILURE!

Results :

Tests in error: 
  testSimpleRun(org.apache.hadoop.hbase.procedure.TestProcedureMember): test timed out after 500 milliseconds

Tests run: 908, Failures: 0, Errors: 1, Skipped: 5

[INFO] ------------------------------------------------------------------------
[INFO] Reactor Summary:
[INFO] 
[INFO] HBase ............................................. SUCCESS [8.301s]
[INFO] HBase - Common .................................... SUCCESS [43.961s]
[INFO] HBase - Protocol .................................. SUCCESS [8.207s]
[INFO] HBase - Client .................................... SUCCESS [55.511s]
[INFO] HBase - Hadoop Compatibility ...................... SUCCESS [5.595s]
[INFO] HBase - Hadoop Two Compatibility .................. SUCCESS [2.153s]
[INFO] HBase - Prefix Tree ............................... SUCCESS [3.293s]
[INFO] HBase - Server .................................... FAILURE [4:14.616s]
[INFO] HBase - Testing Util .............................. SKIPPED
[INFO] HBase - Thrift .................................... SKIPPED
[INFO] HBase - Shell ..................................... SKIPPED
[INFO] HBase - Integration Tests ......................... SKIPPED
[INFO] HBase - Examples .................................. SKIPPED
[INFO] HBase - Assembly .................................. SKIPPED
[INFO] ------------------------------------------------------------------------
[INFO] BUILD FAILURE
[INFO] ------------------------------------------------------------------------
[INFO] Total time: 6:22.363s
[INFO] Finished at: Mon Aug 11 08:51:59 UTC 2014
[INFO] Final Memory: 70M/807M
[INFO] ------------------------------------------------------------------------
[ERROR] Failed to execute goal org.apache.maven.plugins:maven-surefire-plugin:2.12-TRUNK-HBASE-2:test (default-test) on project hbase-server: There are test failures.
[ERROR] 
[ERROR] Please refer to /x1/jenkins/jenkins-slave/workspace/HBase-1.0/hbase-server/target/surefire-reports for the individual test results.
[ERROR] -> [Help 1]
[ERROR] 
[ERROR] To see the full stack trace of the errors, re-run Maven with the -e switch.
[ERROR] Re-run Maven using the -X switch to enable full debug logging.
[ERROR] 
[ERROR] For more information about the errors and possible solutions, please read the following articles:
[ERROR] [Help 1] http://cwiki.apache.org/confluence/display/MAVEN/MojoFailureException
[ERROR] 
[ERROR] After correcting the problems, you can resume the build with the command
[ERROR]   mvn <goals> -rf :hbase-server
Build step 'Invoke top-level Maven targets' marked build as failure
Performing Post build task...
Match found for :.* : True
Logical operation result is TRUE
Running script  :   ZOMBIE_TESTS_COUNT=`jps | grep surefirebooter | wc -l`
  if [[ $ZOMBIE_TESTS_COUNT != 0 ]] ; then
    #It seems sometimes the tests are not dying immediately. Let's give them 10s
    echo "Suspicious java process found - waiting 10s to see if there are just slow to stop"
    sleep 10   
    ZOMBIE_TESTS_COUNT=`jps | grep surefirebooter | wc -l`
    if [[ $ZOMBIE_TESTS_COUNT != 0 ]] ; then
      echo "There are $ZOMBIE_TESTS_COUNT zombie tests, they should have been killed by surefire but survived"
      echo "************ BEGIN zombies jstack extract"
      ZB_STACK=`jps | grep surefirebooter | cut -d ' ' -f 1 | xargs -n 1 jstack | grep ".test" | grep "\.java"`
      jps | grep surefirebooter | cut -d ' ' -f 1 | xargs -n 1 jstack
      echo "************ END  zombies jstack extract"
      JIRA_COMMENT="$JIRA_COMMENT

     {color:red}-1 core zombie tests{color}.  There are ${ZOMBIE_TESTS_COUNT} zombie test(s): ${ZB_STACK}"
      BAD=1
      jps | grep surefirebooter | cut -d ' ' -f 1 | xargs kill -9
    else
      echo "We're ok: there is no zombie test, but some tests took some time to stop"
    fi
  else
    echo "We're ok: there is no zombie test"
  fi
[HBase-1.0] $ /bin/bash -xe /tmp/hudson5568604104975057679.sh
++ jps
++ grep surefirebooter
++ wc -l
+ ZOMBIE_TESTS_COUNT=1
+ [[ 1 != 0 ]]
+ echo 'Suspicious java process found - waiting 10s to see if there are just slow to stop'
Suspicious java process found - waiting 10s to see if there are just slow to stop
+ sleep 10
++ jps
++ grep surefirebooter
++ wc -l
+ ZOMBIE_TESTS_COUNT=1
+ [[ 1 != 0 ]]
+ echo 'There are 1 zombie tests, they should have been killed by surefire but survived'
There are 1 zombie tests, they should have been killed by surefire but survived
+ echo '************ BEGIN zombies jstack extract'
************ BEGIN zombies jstack extract
++ jps
++ grep surefirebooter
++ cut -d ' ' -f 1
++ xargs -n 1 jstack
++ grep .test
++ grep '\.java'
+ ZB_STACK=
POST BUILD TASK : FAILURE
END OF POST BUILD TASK : 0
Archiving artifacts
Sending artifact delta relative to HBase-1.0 #88
Archived 838 artifacts
Archive block size is 32768
Received 7 blocks and 36159765 bytes
Compression is 0.6%
Took 1 min 32 sec
Recording test results
Updating HBASE-11527

Build failed in Jenkins: HBase-1.0 #92

Posted by Apache Jenkins Server <je...@builds.apache.org>.
See <https://builds.apache.org/job/HBase-1.0/92/changes>

Changes:

[jxiang] HBASE-11659 Region state RPC call is not idempotent (Virag Kothari)

[apurtell] HBASE-11706 Set versions for VerifyReplication (cuijianwei)

[apurtell] HBASE-11705 callQueueSize should be decremented in a fail-fast scenario (Esteban Gutierrez)

[apurtell] HBASE-11589 AccessControlException should be a not retriable exception (Qiang Tian)

------------------------------------------
[...truncated 13095 lines...]
"pool-1-thread-1-EventThread" daemon prio=10 tid=0x5f5dc800 nid=0x605a waiting on condition [0x604fe000]
   java.lang.Thread.State: WAITING (parking)
	at sun.misc.Unsafe.park(Native Method)
	- parking to wait for  <0x7ddcc820> (a java.util.concurrent.locks.AbstractQueuedSynchronizer$ConditionObject)
	at java.util.concurrent.locks.LockSupport.park(LockSupport.java:186)
	at java.util.concurrent.locks.AbstractQueuedSynchronizer$ConditionObject.await(AbstractQueuedSynchronizer.java:2043)
	at java.util.concurrent.LinkedBlockingQueue.take(LinkedBlockingQueue.java:442)
	at org.apache.zookeeper.ClientCnxn$EventThread.run(ClientCnxn.java:494)

"pool-1-thread-1-SendThread(localhost:51538)" daemon prio=10 tid=0x5f5e2400 nid=0x6059 waiting on condition [0x617fe000]
   java.lang.Thread.State: TIMED_WAITING (sleeping)
	at java.lang.Thread.sleep(Native Method)
	at org.apache.zookeeper.ClientCnxn$SendThread.run(ClientCnxn.java:994)

"sync.4" prio=10 tid=0x5f604c00 nid=0x5509 waiting on condition [0x6339b000]
   java.lang.Thread.State: WAITING (parking)
	at sun.misc.Unsafe.park(Native Method)
	- parking to wait for  <0x7da68668> (a java.util.concurrent.locks.AbstractQueuedSynchronizer$ConditionObject)
	at java.util.concurrent.locks.LockSupport.park(LockSupport.java:186)
	at java.util.concurrent.locks.AbstractQueuedSynchronizer$ConditionObject.await(AbstractQueuedSynchronizer.java:2043)
	at java.util.concurrent.LinkedBlockingQueue.take(LinkedBlockingQueue.java:442)
	at org.apache.hadoop.hbase.regionserver.wal.FSHLog$SyncRunner.run(FSHLog.java:1267)
	at java.lang.Thread.run(Thread.java:724)

"sync.3" prio=10 tid=0x5f603c00 nid=0x5508 waiting on condition [0x633ec000]
   java.lang.Thread.State: WAITING (parking)
	at sun.misc.Unsafe.park(Native Method)
	- parking to wait for  <0x7dad95a0> (a java.util.concurrent.locks.AbstractQueuedSynchronizer$ConditionObject)
	at java.util.concurrent.locks.LockSupport.park(LockSupport.java:186)
	at java.util.concurrent.locks.AbstractQueuedSynchronizer$ConditionObject.await(AbstractQueuedSynchronizer.java:2043)
	at java.util.concurrent.LinkedBlockingQueue.take(LinkedBlockingQueue.java:442)
	at org.apache.hadoop.hbase.regionserver.wal.FSHLog$SyncRunner.run(FSHLog.java:1267)
	at java.lang.Thread.run(Thread.java:724)

"sync.2" prio=10 tid=0x5f602800 nid=0x5505 waiting on condition [0x6377d000]
   java.lang.Thread.State: WAITING (parking)
	at sun.misc.Unsafe.park(Native Method)
	- parking to wait for  <0x7dae9988> (a java.util.concurrent.locks.AbstractQueuedSynchronizer$ConditionObject)
	at java.util.concurrent.locks.LockSupport.park(LockSupport.java:186)
	at java.util.concurrent.locks.AbstractQueuedSynchronizer$ConditionObject.await(AbstractQueuedSynchronizer.java:2043)
	at java.util.concurrent.LinkedBlockingQueue.take(LinkedBlockingQueue.java:442)
	at org.apache.hadoop.hbase.regionserver.wal.FSHLog$SyncRunner.run(FSHLog.java:1267)
	at java.lang.Thread.run(Thread.java:724)

"sync.1" prio=10 tid=0x5f601800 nid=0x5504 waiting on condition [0x6397d000]
   java.lang.Thread.State: WAITING (parking)
	at sun.misc.Unsafe.park(Native Method)
	- parking to wait for  <0x7dae9d60> (a java.util.concurrent.locks.AbstractQueuedSynchronizer$ConditionObject)
	at java.util.concurrent.locks.LockSupport.park(LockSupport.java:186)
	at java.util.concurrent.locks.AbstractQueuedSynchronizer$ConditionObject.await(AbstractQueuedSynchronizer.java:2043)
	at java.util.concurrent.LinkedBlockingQueue.take(LinkedBlockingQueue.java:442)
	at org.apache.hadoop.hbase.regionserver.wal.FSHLog$SyncRunner.run(FSHLog.java:1267)
	at java.lang.Thread.run(Thread.java:724)

"sync.0" prio=10 tid=0x5f600800 nid=0x5503 waiting on condition [0x63b7d000]
   java.lang.Thread.State: WAITING (parking)
	at sun.misc.Unsafe.park(Native Method)
	- parking to wait for  <0x7daea138> (a java.util.concurrent.locks.AbstractQueuedSynchronizer$ConditionObject)
	at java.util.concurrent.locks.LockSupport.park(LockSupport.java:186)
	at java.util.concurrent.locks.AbstractQueuedSynchronizer$ConditionObject.await(AbstractQueuedSynchronizer.java:2043)
	at java.util.concurrent.LinkedBlockingQueue.take(LinkedBlockingQueue.java:442)
	at org.apache.hadoop.hbase.regionserver.wal.FSHLog$SyncRunner.run(FSHLog.java:1267)
	at java.lang.Thread.run(Thread.java:724)

"pool-1-thread-1.append-pool1-t1" prio=10 tid=0x5f506000 nid=0x5501 waiting on condition [0x6a17d000]
   java.lang.Thread.State: WAITING (parking)
	at sun.misc.Unsafe.park(Native Method)
	- parking to wait for  <0x7dad8850> (a java.util.concurrent.locks.AbstractQueuedSynchronizer$ConditionObject)
	at java.util.concurrent.locks.LockSupport.park(LockSupport.java:186)
	at java.util.concurrent.locks.AbstractQueuedSynchronizer$ConditionObject.await(AbstractQueuedSynchronizer.java:2043)
	at com.lmax.disruptor.BlockingWaitStrategy.waitFor(BlockingWaitStrategy.java:45)
	at com.lmax.disruptor.ProcessingSequenceBarrier.waitFor(ProcessingSequenceBarrier.java:55)
	at com.lmax.disruptor.BatchEventProcessor.run(BatchEventProcessor.java:123)
	at java.util.concurrent.ThreadPoolExecutor.runWorker(ThreadPoolExecutor.java:1145)
	at java.util.concurrent.ThreadPoolExecutor$Worker.run(ThreadPoolExecutor.java:615)
	at java.lang.Thread.run(Thread.java:724)

"Timer for 'HBase' metrics system" daemon prio=10 tid=0x5f7f2000 nid=0x54ff in Object.wait() [0x6a37d000]
   java.lang.Thread.State: TIMED_WAITING (on object monitor)
	at java.lang.Object.wait(Native Method)
	at java.util.TimerThread.mainLoop(Timer.java:552)
	- locked <0x7d890d90> (a java.util.TaskQueue)
	at java.util.TimerThread.run(Timer.java:505)

"pool-1-thread-1" prio=10 tid=0x60994c00 nid=0x549b sleeping[0x6a57d000]
   java.lang.Thread.State: TIMED_WAITING (sleeping)
	at java.lang.Thread.sleep(Native Method)
	at org.apache.hadoop.hbase.io.hfile.CacheTestUtils.hammerSingleKey(CacheTestUtils.java:199)
	at org.apache.hadoop.hbase.io.hfile.bucket.TestBucketCache.testCacheMultiThreadedSingleKey(TestBucketCache.java:176)
	at sun.reflect.NativeMethodAccessorImpl.invoke0(Native Method)
	at sun.reflect.NativeMethodAccessorImpl.invoke(NativeMethodAccessorImpl.java:57)
	at sun.reflect.DelegatingMethodAccessorImpl.invoke(DelegatingMethodAccessorImpl.java:43)
	at java.lang.reflect.Method.invoke(Method.java:606)
	at org.junit.runners.model.FrameworkMethod$1.runReflectiveCall(FrameworkMethod.java:47)
	at org.junit.internal.runners.model.ReflectiveCallable.run(ReflectiveCallable.java:12)
	at org.junit.runners.model.FrameworkMethod.invokeExplosively(FrameworkMethod.java:44)
	at org.junit.internal.runners.statements.InvokeMethod.evaluate(InvokeMethod.java:17)
	at org.junit.internal.runners.statements.RunBefores.evaluate(RunBefores.java:26)
	at org.junit.internal.runners.statements.RunAfters.evaluate(RunAfters.java:27)
	at org.junit.runners.ParentRunner.runLeaf(ParentRunner.java:271)
	at org.junit.runners.BlockJUnit4ClassRunner.runChild(BlockJUnit4ClassRunner.java:70)
	at org.junit.runners.BlockJUnit4ClassRunner.runChild(BlockJUnit4ClassRunner.java:50)
	at org.junit.runners.ParentRunner$3.run(ParentRunner.java:238)
	at org.junit.runners.ParentRunner$1.schedule(ParentRunner.java:63)
	at org.junit.runners.ParentRunner.runChildren(ParentRunner.java:236)
	at org.junit.runners.ParentRunner.access$000(ParentRunner.java:53)
	at org.junit.runners.ParentRunner$2.evaluate(ParentRunner.java:229)
	at org.junit.runners.ParentRunner.run(ParentRunner.java:309)
	at org.junit.runners.Suite.runChild(Suite.java:127)
	at org.junit.runners.Suite.runChild(Suite.java:26)
	at org.junit.runners.ParentRunner$3.run(ParentRunner.java:238)
	at org.junit.runners.ParentRunner$1.schedule(ParentRunner.java:63)
	at org.junit.runners.ParentRunner.runChildren(ParentRunner.java:236)
	at org.junit.runners.ParentRunner.access$000(ParentRunner.java:53)
	at org.junit.runners.ParentRunner$2.evaluate(ParentRunner.java:229)
	at org.junit.runners.ParentRunner.run(ParentRunner.java:309)
	at org.junit.runners.Suite.runChild(Suite.java:127)
	at org.junit.runners.Suite.runChild(Suite.java:26)
	at org.junit.runners.ParentRunner$3.run(ParentRunner.java:238)
	at java.util.concurrent.Executors$RunnableAdapter.call(Executors.java:471)
	at java.util.concurrent.FutureTask$Sync.innerRun(FutureTask.java:334)
	at java.util.concurrent.FutureTask.run(FutureTask.java:166)
	at java.util.concurrent.ThreadPoolExecutor.runWorker(ThreadPoolExecutor.java:1145)
	at java.util.concurrent.ThreadPoolExecutor$Worker.run(ThreadPoolExecutor.java:615)
	at java.lang.Thread.run(Thread.java:724)

"Service Thread" daemon prio=10 tid=0x63c27000 nid=0x5469 runnable [0x00000000]
   java.lang.Thread.State: RUNNABLE

"C2 CompilerThread1" daemon prio=10 tid=0x63c25000 nid=0x5467 waiting on condition [0x00000000]
   java.lang.Thread.State: RUNNABLE

"C2 CompilerThread0" daemon prio=10 tid=0x63c23000 nid=0x5466 waiting on condition [0x00000000]
   java.lang.Thread.State: RUNNABLE

"Signal Dispatcher" daemon prio=10 tid=0x63c21800 nid=0x5465 runnable [0x00000000]
   java.lang.Thread.State: RUNNABLE

"Finalizer" daemon prio=10 tid=0x640e7000 nid=0x5464 in Object.wait() [0x6bd7d000]
   java.lang.Thread.State: WAITING (on object monitor)
	at java.lang.Object.wait(Native Method)
	at java.lang.ref.ReferenceQueue.remove(ReferenceQueue.java:135)
	- locked <0x7ca51010> (a java.lang.ref.ReferenceQueue$Lock)
	at java.lang.ref.ReferenceQueue.remove(ReferenceQueue.java:151)
	at java.lang.ref.Finalizer$FinalizerThread.run(Finalizer.java:189)

"Reference Handler" daemon prio=10 tid=0x640e5000 nid=0x5461 in Object.wait() [0x6c07d000]
   java.lang.Thread.State: WAITING (on object monitor)
	at java.lang.Object.wait(Native Method)
	at java.lang.Object.wait(Object.java:503)
	at java.lang.ref.Reference$ReferenceHandler.run(Reference.java:133)
	- locked <0x7ca50b20> (a java.lang.ref.Reference$Lock)

"main" prio=10 tid=0xf6706800 nid=0x5436 waiting on condition [0xf692a000]
   java.lang.Thread.State: WAITING (parking)
	at sun.misc.Unsafe.park(Native Method)
	- parking to wait for  <0x7d8c5a48> (a java.util.concurrent.FutureTask$Sync)
	at java.util.concurrent.locks.LockSupport.park(LockSupport.java:186)
	at java.util.concurrent.locks.AbstractQueuedSynchronizer.parkAndCheckInterrupt(AbstractQueuedSynchronizer.java:834)
	at java.util.concurrent.locks.AbstractQueuedSynchronizer.doAcquireSharedInterruptibly(AbstractQueuedSynchronizer.java:994)
	at java.util.concurrent.locks.AbstractQueuedSynchronizer.acquireSharedInterruptibly(AbstractQueuedSynchronizer.java:1303)
	at java.util.concurrent.FutureTask$Sync.innerGet(FutureTask.java:248)
	at java.util.concurrent.FutureTask.get(FutureTask.java:111)
	at org.apache.maven.surefire.junitcore.AsynchronousRunner.waitForCompletion(AsynchronousRunner.java:73)
	at org.apache.maven.surefire.junitcore.AsynchronousRunner.finished(AsynchronousRunner.java:58)
	at org.junit.runners.ParentRunner.runChildren(ParentRunner.java:242)
	at org.junit.runners.ParentRunner.access$000(ParentRunner.java:53)
	at org.junit.runners.ParentRunner$2.evaluate(ParentRunner.java:229)
	at org.junit.runners.ParentRunner.run(ParentRunner.java:309)
	at org.junit.runner.JUnitCore.run(JUnitCore.java:160)
	at org.junit.runner.JUnitCore.run(JUnitCore.java:138)
	at org.apache.maven.surefire.junitcore.JUnitCoreWrapper.execute(JUnitCoreWrapper.java:61)
	at org.apache.maven.surefire.junitcore.JUnitCoreProvider.invoke(JUnitCoreProvider.java:137)
	at sun.reflect.NativeMethodAccessorImpl.invoke0(Native Method)
	at sun.reflect.NativeMethodAccessorImpl.invoke(NativeMethodAccessorImpl.java:57)
	at sun.reflect.DelegatingMethodAccessorImpl.invoke(DelegatingMethodAccessorImpl.java:43)
	at java.lang.reflect.Method.invoke(Method.java:606)
	at org.apache.maven.surefire.util.ReflectionUtils.invokeMethodWithArray(ReflectionUtils.java:188)
	at org.apache.maven.surefire.booter.ProviderFactory$ProviderProxy.invoke(ProviderFactory.java:166)
	at org.apache.maven.surefire.booter.ProviderFactory.invokeProvider(ProviderFactory.java:86)
	at org.apache.maven.surefire.booter.ForkedBooter.runSuitesInProcess(ForkedBooter.java:101)
	at org.apache.maven.surefire.booter.ForkedBooter.main(ForkedBooter.java:74)

"VM Thread" prio=10 tid=0x643f8800 nid=0x5460 runnable 

"GC task thread#0 (ParallelGC)" prio=10 tid=0xf6710c00 nid=0x5439 runnable 

"GC task thread#1 (ParallelGC)" prio=10 tid=0xf6712000 nid=0x543e runnable 

"GC task thread#2 (ParallelGC)" prio=10 tid=0xf6713800 nid=0x5440 runnable 

"GC task thread#3 (ParallelGC)" prio=10 tid=0xf6715000 nid=0x5441 runnable 

"GC task thread#4 (ParallelGC)" prio=10 tid=0xf6716400 nid=0x5443 runnable 

"GC task thread#5 (ParallelGC)" prio=10 tid=0xf6717c00 nid=0x5444 runnable 

"GC task thread#6 (ParallelGC)" prio=10 tid=0xf6719400 nid=0x5446 runnable 

"GC task thread#7 (ParallelGC)" prio=10 tid=0xf671a800 nid=0x5448 runnable 

"GC task thread#8 (ParallelGC)" prio=10 tid=0xf671c000 nid=0x5449 runnable 

"GC task thread#9 (ParallelGC)" prio=10 tid=0xf671d800 nid=0x544b runnable 

"GC task thread#10 (ParallelGC)" prio=10 tid=0xf671ec00 nid=0x5451 runnable 

"GC task thread#11 (ParallelGC)" prio=10 tid=0xf6720400 nid=0x5452 runnable 

"GC task thread#12 (ParallelGC)" prio=10 tid=0xf6721c00 nid=0x5454 runnable 

"GC task thread#13 (ParallelGC)" prio=10 tid=0xf6723400 nid=0x5457 runnable 

"GC task thread#14 (ParallelGC)" prio=10 tid=0xf6724800 nid=0x5459 runnable 

"GC task thread#15 (ParallelGC)" prio=10 tid=0xf6726000 nid=0x545b runnable 

"GC task thread#16 (ParallelGC)" prio=10 tid=0xf6727800 nid=0x545d runnable 

"GC task thread#17 (ParallelGC)" prio=10 tid=0xf6728c00 nid=0x545e runnable 

"VM Periodic Task Thread" prio=10 tid=0x63c28c00 nid=0x546b waiting on condition 

JNI global references: 410

+ echo '************ END  zombies jstack extract'
************ END  zombies jstack extract
+ JIRA_COMMENT='

     {color:red}-1 core zombie tests{color}.  There are 1 zombie test(s): 	at org.apache.hadoop.hbase.io.hfile.bucket.TestBucketCache.testCacheMultiThreadedSingleKey(TestBucketCache.java:176)'
+ BAD=1
+ jps
+ cut -d ' ' -f 1
+ grep surefirebooter
+ xargs kill -9
POST BUILD TASK : SUCCESS
END OF POST BUILD TASK : 0
Archiving artifacts
Sending artifact delta relative to HBase-1.0 #88
Archived 654 artifacts
Archive block size is 32768
Received 7 blocks and 33131694 bytes
Compression is 0.7%
Took 2 min 23 sec
Recording test results
Updating HBASE-11589
Updating HBASE-11705
Updating HBASE-11706
Updating HBASE-11659

Build failed in Jenkins: HBase-1.0 #91

Posted by Apache Jenkins Server <je...@builds.apache.org>.
See <https://builds.apache.org/job/HBase-1.0/91/changes>

Changes:

[apurtell] HBASE-11701 Start and end of memstore flush log should be on the same level (Esteban Gutierrez)

------------------------------------------
[...truncated 1242 lines...]
	at org.apache.qpid.amqp_1_0.jms.impl.SessionImpl$Dispatcher.run(SessionImpl.java:869)
	- locked <0x00000000e04a1740> (a org.apache.qpid.amqp_1_0.transport.ConnectionEndpoint)
	at java.lang.Thread.run(Thread.java:745)

"Thread-295" #942 daemon prio=5 os_prio=0 tid=0x00007f637c008000 nid=0x33f2 waiting for monitor entry [0x00007f636abee000]
   java.lang.Thread.State: BLOCKED (on object monitor)
	at org.apache.qpid.amqp_1_0.client.Session.close(Session.java:303)
	- waiting to lock <0x00000000e04990e8> (a org.apache.qpid.amqp_1_0.client.Session)
	at org.apache.qpid.amqp_1_0.jms.impl.SessionImpl.close(SessionImpl.java:296)
	at org.apache.qpid.amqp_1_0.jms.impl.SessionImpl$1.remoteEnd(SessionImpl.java:117)
	at org.apache.qpid.amqp_1_0.transport.SessionEndpoint.end(SessionEndpoint.java:173)
	- locked <0x00000000e04a1740> (a org.apache.qpid.amqp_1_0.transport.ConnectionEndpoint)
	at org.apache.qpid.amqp_1_0.transport.SessionEndpoint.end(SessionEndpoint.java:155)
	at org.apache.qpid.amqp_1_0.transport.ConnectionEndpoint.inputClosed(ConnectionEndpoint.java:428)
	- locked <0x00000000e04a1740> (a org.apache.qpid.amqp_1_0.transport.ConnectionEndpoint)
	at org.apache.qpid.amqp_1_0.client.Connection.doRead(Connection.java:406)
	at org.apache.qpid.amqp_1_0.client.Connection.access$000(Connection.java:47)
	at org.apache.qpid.amqp_1_0.client.Connection$2.run(Connection.java:259)
	at java.lang.Thread.run(Thread.java:745)

"Thread-293" #939 prio=5 os_prio=0 tid=0x00007f649860f000 nid=0x33ef waiting for monitor entry [0x00007f636baf8000]
   java.lang.Thread.State: BLOCKED (on object monitor)
	at java.lang.Object.wait(Native Method)
	at java.lang.Object.wait(Object.java:502)
	at org.apache.qpid.amqp_1_0.client.Receiver.<init>(Receiver.java:146)
	- locked <0x00000000e04a1740> (a org.apache.qpid.amqp_1_0.transport.ConnectionEndpoint)
	at org.apache.qpid.amqp_1_0.client.Session.createReceiver(Session.java:250)
	- locked <0x00000000e04990e8> (a org.apache.qpid.amqp_1_0.client.Session)
	at org.apache.qpid.amqp_1_0.client.Session.createReceiver(Session.java:179)
	at org.apache.qpid.amqp_1_0.jms.impl.MessageConsumerImpl.createClientReceiver(MessageConsumerImpl.java:157)
	at org.apache.qpid.amqp_1_0.jms.impl.MessageConsumerImpl.<init>(MessageConsumerImpl.java:121)
	at org.apache.qpid.amqp_1_0.jms.impl.MessageConsumerImpl.<init>(MessageConsumerImpl.java:85)
	at org.apache.qpid.amqp_1_0.jms.impl.SessionImpl.createConsumer(SessionImpl.java:414)
	- locked <0x00000000e04a1740> (a org.apache.qpid.amqp_1_0.transport.ConnectionEndpoint)
	at org.apache.qpid.amqp_1_0.jms.impl.SessionImpl.createConsumer(SessionImpl.java:379)
	at org.apache.qpid.amqp_1_0.jms.impl.SessionImpl.createConsumer(SessionImpl.java:66)
	at org.apache.activemq.transport.amqp.JMSClientTest.testConsumerCreateThrowsWhenBrokerStops(JMSClientTest.java:387)
	at sun.reflect.NativeMethodAccessorImpl.invoke0(Native Method)
	at sun.reflect.NativeMethodAccessorImpl.invoke(NativeMethodAccessorImpl.java:62)
	at sun.reflect.DelegatingMethodAccessorImpl.invoke(DelegatingMethodAccessorImpl.java:43)
	at java.lang.reflect.Method.invoke(Method.java:483)
	at org.junit.runners.model.FrameworkMethod$1.runReflectiveCall(FrameworkMethod.java:47)
	at org.junit.internal.runners.model.ReflectiveCallable.run(ReflectiveCallable.java:12)
	at org.junit.runners.model.FrameworkMethod.invokeExplosively(FrameworkMethod.java:44)
	at org.junit.internal.runners.statements.InvokeMethod.evaluate(InvokeMethod.java:17)
	at org.junit.internal.runners.statements.FailOnTimeout$StatementThread.run(FailOnTimeout.java:74)

"Thread-143" #457 daemon prio=5 os_prio=0 tid=0x00007f63b4007800 nid=0x31f8 runnable [0x00007f6451fb0000]
   java.lang.Thread.State: RUNNABLE
	at org.apache.qpid.amqp_1_0.framing.ConnectionHandler$BytesOutputHandler.run(ConnectionHandler.java:403)
	at java.lang.Thread.run(Thread.java:745)

"Thread-137" #433 daemon prio=5 os_prio=0 tid=0x00007f640000a000 nid=0x31e3 runnable [0x00007f64513a8000]
   java.lang.Thread.State: RUNNABLE
	at org.apache.qpid.amqp_1_0.framing.ConnectionHandler$BytesOutputHandler.run(ConnectionHandler.java:403)
	at java.lang.Thread.run(Thread.java:745)

"Thread-124" #396 daemon prio=5 os_prio=0 tid=0x00007f63c4003000 nid=0x31c3 runnable [0x00007f64528ca000]
   java.lang.Thread.State: RUNNABLE
	at org.apache.qpid.amqp_1_0.framing.ConnectionHandler$BytesOutputHandler.run(ConnectionHandler.java:403)
	at java.lang.Thread.run(Thread.java:745)

"Thread-111" #359 daemon prio=5 os_prio=0 tid=0x00007f63c8016800 nid=0x3194 runnable [0x00007f6452acc000]
   java.lang.Thread.State: RUNNABLE
	at org.apache.qpid.amqp_1_0.framing.ConnectionHandler$BytesOutputHandler.run(ConnectionHandler.java:403)
	at java.lang.Thread.run(Thread.java:745)

"Thread-45" #162 daemon prio=5 os_prio=0 tid=0x00007f63c4002800 nid=0x30d7 runnable [0x00007f6453973000]
   java.lang.Thread.State: RUNNABLE
	at org.apache.qpid.amqp_1_0.framing.ConnectionHandler$BytesOutputHandler.run(ConnectionHandler.java:403)
	at java.lang.Thread.run(Thread.java:745)

"Thread-39" #143 daemon prio=5 os_prio=0 tid=0x00007f63b4006800 nid=0x30bf runnable [0x00007f64514a9000]
   java.lang.Thread.State: RUNNABLE
	at org.apache.qpid.amqp_1_0.framing.ConnectionHandler$BytesOutputHandler.run(ConnectionHandler.java:403)
	at java.lang.Thread.run(Thread.java:745)

"Thread-10" #53 daemon prio=5 os_prio=0 tid=0x00007f63d8001000 nid=0x3065 runnable [0x00007f64520b1000]
   java.lang.Thread.State: RUNNABLE
	at org.apache.qpid.amqp_1_0.framing.ConnectionHandler$BytesOutputHandler.run(ConnectionHandler.java:403)
	at java.lang.Thread.run(Thread.java:745)

"RMI Scheduler(0)" #26 daemon prio=5 os_prio=0 tid=0x00007f63f4027800 nid=0x304e waiting on condition [0x00007f64525b4000]
   java.lang.Thread.State: WAITING (parking)
	at sun.misc.Unsafe.park(Native Method)
	- parking to wait for  <0x00000000e01a9160> (a java.util.concurrent.locks.AbstractQueuedSynchronizer$ConditionObject)
	at java.util.concurrent.locks.LockSupport.park(LockSupport.java:175)
	at java.util.concurrent.locks.AbstractQueuedSynchronizer$ConditionObject.await(AbstractQueuedSynchronizer.java:2039)
	at java.util.concurrent.ScheduledThreadPoolExecutor$DelayedWorkQueue.take(ScheduledThreadPoolExecutor.java:1081)
	at java.util.concurrent.ScheduledThreadPoolExecutor$DelayedWorkQueue.take(ScheduledThreadPoolExecutor.java:809)
	at java.util.concurrent.ThreadPoolExecutor.getTask(ThreadPoolExecutor.java:1067)
	at java.util.concurrent.ThreadPoolExecutor.runWorker(ThreadPoolExecutor.java:1127)
	at java.util.concurrent.ThreadPoolExecutor$Worker.run(ThreadPoolExecutor.java:617)
	at java.lang.Thread.run(Thread.java:745)

"RMI TCP Accept-0" #22 daemon prio=5 os_prio=0 tid=0x00007f63f4007800 nid=0x304a runnable [0x00007f64529cb000]
   java.lang.Thread.State: RUNNABLE
	at java.net.PlainSocketImpl.socketAccept(Native Method)
	at java.net.AbstractPlainSocketImpl.accept(AbstractPlainSocketImpl.java:404)
	at java.net.ServerSocket.implAccept(ServerSocket.java:545)
	at java.net.ServerSocket.accept(ServerSocket.java:513)
	at sun.rmi.transport.tcp.TCPTransport$AcceptLoop.executeAcceptLoop(TCPTransport.java:389)
	at sun.rmi.transport.tcp.TCPTransport$AcceptLoop.run(TCPTransport.java:361)
	at java.lang.Thread.run(Thread.java:745)

"Service Thread" #17 daemon prio=9 os_prio=0 tid=0x00007f64982cb000 nid=0x3044 runnable [0x0000000000000000]
   java.lang.Thread.State: RUNNABLE

"C1 CompilerThread11" #16 daemon prio=9 os_prio=0 tid=0x00007f64982c6000 nid=0x3043 waiting on condition [0x0000000000000000]
   java.lang.Thread.State: RUNNABLE

"C1 CompilerThread10" #15 daemon prio=9 os_prio=0 tid=0x00007f64982c4000 nid=0x3042 waiting on condition [0x0000000000000000]
   java.lang.Thread.State: RUNNABLE

"C1 CompilerThread9" #14 daemon prio=9 os_prio=0 tid=0x00007f64982c2000 nid=0x3041 waiting on condition [0x0000000000000000]
   java.lang.Thread.State: RUNNABLE

"C1 CompilerThread8" #13 daemon prio=9 os_prio=0 tid=0x00007f64982c0000 nid=0x3040 waiting on condition [0x0000000000000000]
   java.lang.Thread.State: RUNNABLE

"C2 CompilerThread7" #12 daemon prio=9 os_prio=0 tid=0x00007f64982bd800 nid=0x303f waiting on condition [0x0000000000000000]
   java.lang.Thread.State: RUNNABLE

"C2 CompilerThread6" #11 daemon prio=9 os_prio=0 tid=0x00007f64982bb800 nid=0x303e waiting on condition [0x0000000000000000]
   java.lang.Thread.State: RUNNABLE

"C2 CompilerThread5" #10 daemon prio=9 os_prio=0 tid=0x00007f64982b9800 nid=0x303d waiting on condition [0x0000000000000000]
   java.lang.Thread.State: RUNNABLE

"C2 CompilerThread4" #9 daemon prio=9 os_prio=0 tid=0x00007f64982af800 nid=0x303c waiting on condition [0x0000000000000000]
   java.lang.Thread.State: RUNNABLE

"C2 CompilerThread3" #8 daemon prio=9 os_prio=0 tid=0x00007f64982ad000 nid=0x303b waiting on condition [0x0000000000000000]
   java.lang.Thread.State: RUNNABLE

"C2 CompilerThread2" #7 daemon prio=9 os_prio=0 tid=0x00007f64982a8800 nid=0x303a waiting on condition [0x0000000000000000]
   java.lang.Thread.State: RUNNABLE

"C2 CompilerThread1" #6 daemon prio=9 os_prio=0 tid=0x00007f64982a7000 nid=0x3039 waiting on condition [0x0000000000000000]
   java.lang.Thread.State: RUNNABLE

"C2 CompilerThread0" #5 daemon prio=9 os_prio=0 tid=0x00007f64982a4000 nid=0x3038 waiting on condition [0x0000000000000000]
   java.lang.Thread.State: RUNNABLE

"Signal Dispatcher" #4 daemon prio=9 os_prio=0 tid=0x00007f64982a2000 nid=0x3037 runnable [0x0000000000000000]
   java.lang.Thread.State: RUNNABLE

"Finalizer" #3 daemon prio=8 os_prio=0 tid=0x00007f6498276000 nid=0x3036 in Object.wait() [0x00007f6470b83000]
   java.lang.Thread.State: WAITING (on object monitor)
	at java.lang.Object.wait(Native Method)
	at java.lang.ref.ReferenceQueue.remove(ReferenceQueue.java:142)
	- locked <0x00000000e0064880> (a java.lang.ref.ReferenceQueue$Lock)
	at java.lang.ref.ReferenceQueue.remove(ReferenceQueue.java:158)
	at java.lang.ref.Finalizer$FinalizerThread.run(Finalizer.java:209)

"Reference Handler" #2 daemon prio=10 os_prio=0 tid=0x00007f6498272000 nid=0x3035 in Object.wait() [0x00007f6470c84000]
   java.lang.Thread.State: WAITING (on object monitor)
	at java.lang.Object.wait(Native Method)
	at java.lang.Object.wait(Object.java:502)
	at java.lang.ref.Reference$ReferenceHandler.run(Reference.java:157)
	- locked <0x00000000e006f170> (a java.lang.ref.Reference$Lock)

"main" #1 prio=5 os_prio=0 tid=0x00007f649800a000 nid=0x3026 waiting for monitor entry [0x00007f64a048f000]
   java.lang.Thread.State: BLOCKED (on object monitor)
	at org.apache.qpid.amqp_1_0.transport.ConnectionEndpoint.close(ConnectionEndpoint.java:754)
	- waiting to lock <0x00000000e04a1740> (a org.apache.qpid.amqp_1_0.transport.ConnectionEndpoint)
	at org.apache.qpid.amqp_1_0.client.Connection.close(Connection.java:422)
	at org.apache.qpid.amqp_1_0.jms.impl.ConnectionImpl.close(ConnectionImpl.java:385)
	at org.apache.activemq.transport.amqp.JMSClientTestSupport.tearDown(JMSClientTestSupport.java:35)
	at org.apache.activemq.transport.amqp.JMSClientTest.tearDown(JMSClientTest.java:75)
	at sun.reflect.GeneratedMethodAccessor17.invoke(Unknown Source)
	at sun.reflect.DelegatingMethodAccessorImpl.invoke(DelegatingMethodAccessorImpl.java:43)
	at java.lang.reflect.Method.invoke(Method.java:483)
	at org.junit.runners.model.FrameworkMethod$1.runReflectiveCall(FrameworkMethod.java:47)
	at org.junit.internal.runners.model.ReflectiveCallable.run(ReflectiveCallable.java:12)
	at org.junit.runners.model.FrameworkMethod.invokeExplosively(FrameworkMethod.java:44)
	at org.junit.internal.runners.statements.RunAfters.evaluate(RunAfters.java:33)
	at org.junit.rules.TestWatcher$1.evaluate(TestWatcher.java:55)
	at org.junit.rules.RunRules.evaluate(RunRules.java:20)
	at org.junit.runners.ParentRunner.runLeaf(ParentRunner.java:271)
	at org.junit.runners.BlockJUnit4ClassRunner.runChild(BlockJUnit4ClassRunner.java:70)
	at org.junit.runners.BlockJUnit4ClassRunner.runChild(BlockJUnit4ClassRunner.java:50)
	at org.junit.runners.ParentRunner$3.run(ParentRunner.java:238)
	at org.junit.runners.ParentRunner$1.schedule(ParentRunner.java:63)
	at org.junit.runners.ParentRunner.runChildren(ParentRunner.java:236)
	at org.junit.runners.ParentRunner.access$000(ParentRunner.java:53)
	at org.junit.runners.ParentRunner$2.evaluate(ParentRunner.java:229)
	at org.junit.internal.runners.statements.RunBefores.evaluate(RunBefores.java:26)
	at org.junit.runners.ParentRunner.run(ParentRunner.java:309)
	at org.apache.maven.surefire.junit4.JUnit4Provider.execute(JUnit4Provider.java:264)
	at org.apache.maven.surefire.junit4.JUnit4Provider.executeTestSet(JUnit4Provider.java:153)
	at org.apache.maven.surefire.junit4.JUnit4Provider.invoke(JUnit4Provider.java:124)
	at org.apache.maven.surefire.booter.ForkedBooter.invokeProviderInSameClassLoader(ForkedBooter.java:200)
	at org.apache.maven.surefire.booter.ForkedBooter.runSuitesInProcess(ForkedBooter.java:153)
	at org.apache.maven.surefire.booter.ForkedBooter.main(ForkedBooter.java:103)

"VM Thread" os_prio=0 tid=0x00007f649826d000 nid=0x3034 runnable 

"GC task thread#0 (ParallelGC)" os_prio=0 tid=0x00007f649801f800 nid=0x3027 runnable 

"GC task thread#1 (ParallelGC)" os_prio=0 tid=0x00007f6498021800 nid=0x3028 runnable 

"GC task thread#2 (ParallelGC)" os_prio=0 tid=0x00007f6498023000 nid=0x3029 runnable 

"GC task thread#3 (ParallelGC)" os_prio=0 tid=0x00007f6498025000 nid=0x302a runnable 

"GC task thread#4 (ParallelGC)" os_prio=0 tid=0x00007f6498026800 nid=0x302b runnable 

"GC task thread#5 (ParallelGC)" os_prio=0 tid=0x00007f6498028800 nid=0x302c runnable 

"GC task thread#6 (ParallelGC)" os_prio=0 tid=0x00007f649802a000 nid=0x302d runnable 

"GC task thread#7 (ParallelGC)" os_prio=0 tid=0x00007f649802c000 nid=0x302e runnable 

"GC task thread#8 (ParallelGC)" os_prio=0 tid=0x00007f649802d800 nid=0x302f runnable 

"GC task thread#9 (ParallelGC)" os_prio=0 tid=0x00007f649802f800 nid=0x3030 runnable 

"GC task thread#10 (ParallelGC)" os_prio=0 tid=0x00007f6498031000 nid=0x3031 runnable 

"GC task thread#11 (ParallelGC)" os_prio=0 tid=0x00007f6498033000 nid=0x3032 runnable 

"GC task thread#12 (ParallelGC)" os_prio=0 tid=0x00007f6498034800 nid=0x3033 runnable 

"VM Periodic Task Thread" os_prio=0 tid=0x00007f64982cd800 nid=0x3045 waiting on condition 

JNI global references: 88

+ echo '************ END  zombies jstack extract'
************ END  zombies jstack extract
+ JIRA_COMMENT='

     {color:red}-1 core zombie tests{color}.  There are 1 zombie test(s): 	at org.apache.activemq.transport.amqp.JMSClientTest.testConsumerCreateThrowsWhenBrokerStops(JMSClientTest.java:387)'
+ BAD=1
+ jps
+ grep surefirebooter
+ cut -d ' ' -f 1
+ xargs kill -9
POST BUILD TASK : SUCCESS
END OF POST BUILD TASK : 0
Archiving artifacts
Sending artifact delta relative to HBase-1.0 #88
Archived 837 artifacts
Archive block size is 32768
Received 8 blocks and 34689416 bytes
Compression is 0.8%
Took 2 min 21 sec
Recording test results
Updating HBASE-11701

Build failed in Jenkins: HBase-1.0 #90

Posted by Apache Jenkins Server <je...@builds.apache.org>.
See <https://builds.apache.org/job/HBase-1.0/90/changes>

Changes:

[jmhsieh] HBASE-6626 Add a chapter on HDFS in the troubleshooting section of the HBase reference guide (Misty Stanley-Jones)

[stack] HBASE-11678 BucketCache ramCache fills heap after running a few hours

[apurtell] HBASE-11697 Improve the 'Too many blocks' message on UI blockcache status page (Mikhail Antonov)

------------------------------------------
[...truncated 3302 lines...]
	at java.util.TimerThread.mainLoop(Timer.java:526)
	- locked <0x7fd85ac8> (a java.util.TaskQueue)
	at java.util.TimerThread.run(Timer.java:505)

"Timer-23" prio=10 tid=0x5fe23400 nid=0x3c28 in Object.wait() [0x62efe000]
   java.lang.Thread.State: WAITING (on object monitor)
	at java.lang.Object.wait(Native Method)
	- waiting on <0x7fd7fee8> (a java.util.TaskQueue)
	at java.lang.Object.wait(Object.java:503)
	at java.util.TimerThread.mainLoop(Timer.java:526)
	- locked <0x7fd7fee8> (a java.util.TaskQueue)
	at java.util.TimerThread.run(Timer.java:505)

"rs(pomona.apache.org,60259,1407454508388)-procedure-pool15-thread-1" daemon prio=10 tid=0x60e07c00 nid=0x3b87 waiting on condition [0x59692000]
   java.lang.Thread.State: WAITING (parking)
	at sun.misc.Unsafe.park(Native Method)
	- parking to wait for  <0x7f9146f0> (a java.util.concurrent.locks.AbstractQueuedSynchronizer$ConditionObject)
	at java.util.concurrent.locks.LockSupport.park(LockSupport.java:186)
	at java.util.concurrent.locks.AbstractQueuedSynchronizer$ConditionObject.await(AbstractQueuedSynchronizer.java:2043)
	at java.util.concurrent.LinkedBlockingQueue.take(LinkedBlockingQueue.java:442)
	at java.util.concurrent.ThreadPoolExecutor.getTask(ThreadPoolExecutor.java:1068)
	at java.util.concurrent.ThreadPoolExecutor.runWorker(ThreadPoolExecutor.java:1130)
	at java.util.concurrent.ThreadPoolExecutor$Worker.run(ThreadPoolExecutor.java:615)
	at java.lang.Thread.run(Thread.java:724)

"rs(pomona.apache.org,58231,1407454507201)-procedure-pool13-thread-1" daemon prio=10 tid=0x60a0a000 nid=0x3b86 waiting on condition [0x596e3000]
   java.lang.Thread.State: WAITING (parking)
	at sun.misc.Unsafe.park(Native Method)
	- parking to wait for  <0x7f99acc0> (a java.util.concurrent.locks.AbstractQueuedSynchronizer$ConditionObject)
	at java.util.concurrent.locks.LockSupport.park(LockSupport.java:186)
	at java.util.concurrent.locks.AbstractQueuedSynchronizer$ConditionObject.await(AbstractQueuedSynchronizer.java:2043)
	at java.util.concurrent.LinkedBlockingQueue.take(LinkedBlockingQueue.java:442)
	at java.util.concurrent.ThreadPoolExecutor.getTask(ThreadPoolExecutor.java:1068)
	at java.util.concurrent.ThreadPoolExecutor.runWorker(ThreadPoolExecutor.java:1130)
	at java.util.concurrent.ThreadPoolExecutor$Worker.run(ThreadPoolExecutor.java:615)
	at java.lang.Thread.run(Thread.java:724)

"rs(pomona.apache.org,53926,1407454507976)-procedure-pool14-thread-1" daemon prio=10 tid=0x61206400 nid=0x3b85 waiting on condition [0x59734000]
   java.lang.Thread.State: WAITING (parking)
	at sun.misc.Unsafe.park(Native Method)
	- parking to wait for  <0x7f99a688> (a java.util.concurrent.locks.AbstractQueuedSynchronizer$ConditionObject)
	at java.util.concurrent.locks.LockSupport.park(LockSupport.java:186)
	at java.util.concurrent.locks.AbstractQueuedSynchronizer$ConditionObject.await(AbstractQueuedSynchronizer.java:2043)
	at java.util.concurrent.LinkedBlockingQueue.take(LinkedBlockingQueue.java:442)
	at java.util.concurrent.ThreadPoolExecutor.getTask(ThreadPoolExecutor.java:1068)
	at java.util.concurrent.ThreadPoolExecutor.runWorker(ThreadPoolExecutor.java:1130)
	at java.util.concurrent.ThreadPoolExecutor$Worker.run(ThreadPoolExecutor.java:615)
	at java.lang.Thread.run(Thread.java:724)

"(pomona.apache.org,58231,1407454507201)-proc-coordinator-pool5-thread-1" daemon prio=10 tid=0x60006400 nid=0x3b75 waiting on condition [0x5996b000]
   java.lang.Thread.State: WAITING (parking)
	at sun.misc.Unsafe.park(Native Method)
	- parking to wait for  <0x7f898140> (a java.util.concurrent.SynchronousQueue$TransferStack)
	at java.util.concurrent.locks.LockSupport.park(LockSupport.java:186)
	at java.util.concurrent.SynchronousQueue$TransferStack.awaitFulfill(SynchronousQueue.java:458)
	at java.util.concurrent.SynchronousQueue$TransferStack.transfer(SynchronousQueue.java:359)
	at java.util.concurrent.SynchronousQueue.take(SynchronousQueue.java:925)
	at java.util.concurrent.ThreadPoolExecutor.getTask(ThreadPoolExecutor.java:1068)
	at java.util.concurrent.ThreadPoolExecutor.runWorker(ThreadPoolExecutor.java:1130)
	at java.util.concurrent.ThreadPoolExecutor$Worker.run(ThreadPoolExecutor.java:615)
	at java.lang.Thread.run(Thread.java:724)

"HBase-Metrics2-1" daemon prio=10 tid=0x6031a400 nid=0x3a8d waiting on condition [0x5ba53000]
   java.lang.Thread.State: TIMED_WAITING (parking)
	at sun.misc.Unsafe.park(Native Method)
	- parking to wait for  <0x7f887308> (a java.util.concurrent.locks.AbstractQueuedSynchronizer$ConditionObject)
	at java.util.concurrent.locks.LockSupport.parkNanos(LockSupport.java:226)
	at java.util.concurrent.locks.AbstractQueuedSynchronizer$ConditionObject.awaitNanos(AbstractQueuedSynchronizer.java:2082)
	at java.util.concurrent.ScheduledThreadPoolExecutor$DelayedWorkQueue.take(ScheduledThreadPoolExecutor.java:1090)
	at java.util.concurrent.ScheduledThreadPoolExecutor$DelayedWorkQueue.take(ScheduledThreadPoolExecutor.java:807)
	at java.util.concurrent.ThreadPoolExecutor.getTask(ThreadPoolExecutor.java:1068)
	at java.util.concurrent.ThreadPoolExecutor.runWorker(ThreadPoolExecutor.java:1130)
	at java.util.concurrent.ThreadPoolExecutor$Worker.run(ThreadPoolExecutor.java:615)
	at java.lang.Thread.run(Thread.java:724)

"ActiveMasterManager-EventThread" daemon prio=10 tid=0x6aa53800 nid=0x3a67 waiting on condition [0x5c1eb000]
   java.lang.Thread.State: WAITING (parking)
	at sun.misc.Unsafe.park(Native Method)
	- parking to wait for  <0x7f6fc480> (a java.util.concurrent.locks.AbstractQueuedSynchronizer$ConditionObject)
	at java.util.concurrent.locks.LockSupport.park(LockSupport.java:186)
	at java.util.concurrent.locks.AbstractQueuedSynchronizer$ConditionObject.await(AbstractQueuedSynchronizer.java:2043)
	at java.util.concurrent.LinkedBlockingQueue.take(LinkedBlockingQueue.java:442)
	at org.apache.zookeeper.ClientCnxn$EventThread.run(ClientCnxn.java:494)

"ActiveMasterManager-SendThread(localhost:55403)" daemon prio=10 tid=0x6aa53000 nid=0x3a66 waiting on condition [0x5c23c000]
   java.lang.Thread.State: TIMED_WAITING (sleeping)
	at java.lang.Thread.sleep(Native Method)
	at org.apache.zookeeper.ClientCnxn$SendThread.run(ClientCnxn.java:994)

"org.apache.hadoop.hdfs.PeerCache@17b3cca" daemon prio=10 tid=0x6aa17800 nid=0x39f0 waiting on condition [0x5d832000]
   java.lang.Thread.State: TIMED_WAITING (sleeping)
	at java.lang.Thread.sleep(Native Method)
	at org.apache.hadoop.hdfs.PeerCache.run(PeerCache.java:245)
	at org.apache.hadoop.hdfs.PeerCache.access$000(PeerCache.java:41)
	at org.apache.hadoop.hdfs.PeerCache$1.run(PeerCache.java:119)
	at java.lang.Thread.run(Thread.java:724)

"Timer for 'NameNode' metrics system" daemon prio=10 tid=0x6021f400 nid=0x3889 in Object.wait() [0x638fe000]
   java.lang.Thread.State: TIMED_WAITING (on object monitor)
	at java.lang.Object.wait(Native Method)
	at java.util.TimerThread.mainLoop(Timer.java:552)
	- locked <0x7e349a08> (a java.util.TaskQueue)
	at java.util.TimerThread.run(Timer.java:505)

"pool-1-thread-1" prio=10 tid=0x63a8fc00 nid=0x385f sleeping[0x6457d000]
   java.lang.Thread.State: TIMED_WAITING (sleeping)
	at java.lang.Thread.sleep(Native Method)
	at org.apache.hadoop.hbase.util.Threads.sleep(Threads.java:143)
	at org.apache.hadoop.hbase.io.hfile.bucket.TestBucketWriterThread.setUp(TestBucketWriterThread.java:78)
	at sun.reflect.NativeMethodAccessorImpl.invoke0(Native Method)
	at sun.reflect.NativeMethodAccessorImpl.invoke(NativeMethodAccessorImpl.java:57)
	at sun.reflect.DelegatingMethodAccessorImpl.invoke(DelegatingMethodAccessorImpl.java:43)
	at java.lang.reflect.Method.invoke(Method.java:606)
	at org.junit.runners.model.FrameworkMethod$1.runReflectiveCall(FrameworkMethod.java:47)
	at org.junit.internal.runners.model.ReflectiveCallable.run(ReflectiveCallable.java:12)
	at org.junit.runners.model.FrameworkMethod.invokeExplosively(FrameworkMethod.java:44)
	at org.junit.internal.runners.statements.RunBefores.evaluate(RunBefores.java:24)
	at org.junit.internal.runners.statements.RunAfters.evaluate(RunAfters.java:27)
	at org.junit.runners.ParentRunner.runLeaf(ParentRunner.java:271)
	at org.junit.runners.BlockJUnit4ClassRunner.runChild(BlockJUnit4ClassRunner.java:70)
	at org.junit.runners.BlockJUnit4ClassRunner.runChild(BlockJUnit4ClassRunner.java:50)
	at org.junit.runners.ParentRunner$3.run(ParentRunner.java:238)
	at org.junit.runners.ParentRunner$1.schedule(ParentRunner.java:63)
	at org.junit.runners.ParentRunner.runChildren(ParentRunner.java:236)
	at org.junit.runners.ParentRunner.access$000(ParentRunner.java:53)
	at org.junit.runners.ParentRunner$2.evaluate(ParentRunner.java:229)
	at org.junit.runners.ParentRunner.run(ParentRunner.java:309)
	at org.junit.runners.Suite.runChild(Suite.java:127)
	at org.junit.runners.Suite.runChild(Suite.java:26)
	at org.junit.runners.ParentRunner$3.run(ParentRunner.java:238)
	at java.util.concurrent.Executors$RunnableAdapter.call(Executors.java:471)
	at java.util.concurrent.FutureTask$Sync.innerRun(FutureTask.java:334)
	at java.util.concurrent.FutureTask.run(FutureTask.java:166)
	at java.util.concurrent.ThreadPoolExecutor.runWorker(ThreadPoolExecutor.java:1145)
	at java.util.concurrent.ThreadPoolExecutor$Worker.run(ThreadPoolExecutor.java:615)
	at java.lang.Thread.run(Thread.java:724)

"Service Thread" daemon prio=10 tid=0x64df7000 nid=0x37bf runnable [0x00000000]
   java.lang.Thread.State: RUNNABLE

"C2 CompilerThread1" daemon prio=10 tid=0x64df5400 nid=0x37be waiting on condition [0x00000000]
   java.lang.Thread.State: RUNNABLE

"C2 CompilerThread0" daemon prio=10 tid=0x64df3400 nid=0x37bd waiting on condition [0x00000000]
   java.lang.Thread.State: RUNNABLE

"Signal Dispatcher" daemon prio=10 tid=0x64df1800 nid=0x37bc runnable [0x00000000]
   java.lang.Thread.State: RUNNABLE

"Finalizer" daemon prio=10 tid=0x64db7000 nid=0x37bb in Object.wait() [0x6bd7d000]
   java.lang.Thread.State: WAITING (on object monitor)
	at java.lang.Object.wait(Native Method)
	at java.lang.ref.ReferenceQueue.remove(ReferenceQueue.java:135)
	- locked <0x7cc66890> (a java.lang.ref.ReferenceQueue$Lock)
	at java.lang.ref.ReferenceQueue.remove(ReferenceQueue.java:151)
	at java.lang.ref.Finalizer$FinalizerThread.run(Finalizer.java:189)

"Reference Handler" daemon prio=10 tid=0x64db5400 nid=0x37ba in Object.wait() [0x6bf7d000]
   java.lang.Thread.State: WAITING (on object monitor)
	at java.lang.Object.wait(Native Method)
	at java.lang.Object.wait(Object.java:503)
	at java.lang.ref.Reference$ReferenceHandler.run(Reference.java:133)
	- locked <0x7cc66598> (a java.lang.ref.Reference$Lock)

"main" prio=10 tid=0xf6806800 nid=0x37ab waiting on condition [0xf6973000]
   java.lang.Thread.State: WAITING (parking)
	at sun.misc.Unsafe.park(Native Method)
	- parking to wait for  <0x7da74b98> (a java.util.concurrent.FutureTask$Sync)
	at java.util.concurrent.locks.LockSupport.park(LockSupport.java:186)
	at java.util.concurrent.locks.AbstractQueuedSynchronizer.parkAndCheckInterrupt(AbstractQueuedSynchronizer.java:834)
	at java.util.concurrent.locks.AbstractQueuedSynchronizer.doAcquireSharedInterruptibly(AbstractQueuedSynchronizer.java:994)
	at java.util.concurrent.locks.AbstractQueuedSynchronizer.acquireSharedInterruptibly(AbstractQueuedSynchronizer.java:1303)
	at java.util.concurrent.FutureTask$Sync.innerGet(FutureTask.java:248)
	at java.util.concurrent.FutureTask.get(FutureTask.java:111)
	at org.apache.maven.surefire.junitcore.AsynchronousRunner.waitForCompletion(AsynchronousRunner.java:73)
	at org.apache.maven.surefire.junitcore.AsynchronousRunner.finished(AsynchronousRunner.java:58)
	at org.junit.runners.ParentRunner.runChildren(ParentRunner.java:242)
	at org.junit.runners.ParentRunner.access$000(ParentRunner.java:53)
	at org.junit.runners.ParentRunner$2.evaluate(ParentRunner.java:229)
	at org.junit.runners.ParentRunner.run(ParentRunner.java:309)
	at org.junit.runner.JUnitCore.run(JUnitCore.java:160)
	at org.junit.runner.JUnitCore.run(JUnitCore.java:138)
	at org.apache.maven.surefire.junitcore.JUnitCoreWrapper.execute(JUnitCoreWrapper.java:61)
	at org.apache.maven.surefire.junitcore.JUnitCoreProvider.invoke(JUnitCoreProvider.java:137)
	at sun.reflect.NativeMethodAccessorImpl.invoke0(Native Method)
	at sun.reflect.NativeMethodAccessorImpl.invoke(NativeMethodAccessorImpl.java:57)
	at sun.reflect.DelegatingMethodAccessorImpl.invoke(DelegatingMethodAccessorImpl.java:43)
	at java.lang.reflect.Method.invoke(Method.java:606)
	at org.apache.maven.surefire.util.ReflectionUtils.invokeMethodWithArray(ReflectionUtils.java:188)
	at org.apache.maven.surefire.booter.ProviderFactory$ProviderProxy.invoke(ProviderFactory.java:166)
	at org.apache.maven.surefire.booter.ProviderFactory.invokeProvider(ProviderFactory.java:86)
	at org.apache.maven.surefire.booter.ForkedBooter.runSuitesInProcess(ForkedBooter.java:101)
	at org.apache.maven.surefire.booter.ForkedBooter.main(ForkedBooter.java:74)

"VM Thread" prio=10 tid=0x64cf8800 nid=0x37b9 runnable 

"GC task thread#0 (ParallelGC)" prio=10 tid=0xf6810800 nid=0x37ac runnable 

"GC task thread#1 (ParallelGC)" prio=10 tid=0xf6812000 nid=0x37ad runnable 

"GC task thread#2 (ParallelGC)" prio=10 tid=0xf6813800 nid=0x37ae runnable 

"GC task thread#3 (ParallelGC)" prio=10 tid=0xf6815000 nid=0x37af runnable 

"GC task thread#4 (ParallelGC)" prio=10 tid=0xf6816400 nid=0x37b0 runnable 

"GC task thread#5 (ParallelGC)" prio=10 tid=0xf6817c00 nid=0x37b1 runnable 

"GC task thread#6 (ParallelGC)" prio=10 tid=0xf6819400 nid=0x37b2 runnable 

"GC task thread#7 (ParallelGC)" prio=10 tid=0xf681a800 nid=0x37b3 runnable 

"GC task thread#8 (ParallelGC)" prio=10 tid=0xf681c000 nid=0x37b4 runnable 

"GC task thread#9 (ParallelGC)" prio=10 tid=0xf681d800 nid=0x37b5 runnable 

"GC task thread#10 (ParallelGC)" prio=10 tid=0xf681ec00 nid=0x37b6 runnable 

"GC task thread#11 (ParallelGC)" prio=10 tid=0xf6820400 nid=0x37b7 runnable 

"GC task thread#12 (ParallelGC)" prio=10 tid=0xf6821c00 nid=0x37b8 runnable 

"VM Periodic Task Thread" prio=10 tid=0x64df8c00 nid=0x37c0 waiting on condition 

JNI global references: 382

+ echo '************ END  zombies jstack extract'
************ END  zombies jstack extract
+ JIRA_COMMENT='

     {color:red}-1 core zombie tests{color}.  There are 2 zombie test(s): 	at org.apache.activemq.transport.amqp.JMSClientTest.testConsumerCreateThrowsWhenBrokerStops(JMSClientTest.java:387)'
+ BAD=1
+ cut -d ' ' -f 1
+ xargs kill -9
+ jps
+ grep surefirebooter
POST BUILD TASK : SUCCESS
END OF POST BUILD TASK : 0
Archiving artifacts
Sending artifact delta relative to HBase-1.0 #88
Archived 540 artifacts
Archive block size is 32768
Received 8 blocks and 3811966 bytes
Compression is 6.4%
Took 2 min 11 sec
Recording test results
Updating HBASE-6626
Updating HBASE-11678
Updating HBASE-11697