You are viewing a plain text version of this content. The canonical link for it is here.
Posted to dev@lucene.apache.org by Apache Jenkins Server <je...@builds.apache.org> on 2016/09/01 17:13:34 UTC
[JENKINS] Lucene-Solr-Tests-master - Build # 1383 - Still Failing
Build: https://builds.apache.org/job/Lucene-Solr-Tests-master/1383/
2 tests failed.
FAILED: org.apache.solr.cloud.LeaderFailoverAfterPartitionTest.test
Error Message:
org.apache.solr.client.solrj.SolrServerException: No live SolrServers available to handle this request:[http://127.0.0.1:42949/c8n_1x3_lf_shard1_replica2]
Stack Trace:
org.apache.solr.client.solrj.SolrServerException: org.apache.solr.client.solrj.SolrServerException: No live SolrServers available to handle this request:[http://127.0.0.1:42949/c8n_1x3_lf_shard1_replica2]
at __randomizedtesting.SeedInfo.seed([C50AEE012C6EB3D3:4D5ED1DB8292DE2B]:0)
at org.apache.solr.client.solrj.impl.CloudSolrClient.directUpdate(CloudSolrClient.java:769)
at org.apache.solr.client.solrj.impl.CloudSolrClient.sendRequest(CloudSolrClient.java:1161)
at org.apache.solr.client.solrj.impl.CloudSolrClient.requestWithRetryOnStaleState(CloudSolrClient.java:1050)
at org.apache.solr.client.solrj.impl.CloudSolrClient.request(CloudSolrClient.java:992)
at org.apache.solr.cloud.AbstractFullDistribZkTestBase.sendDocsWithRetry(AbstractFullDistribZkTestBase.java:753)
at org.apache.solr.cloud.AbstractFullDistribZkTestBase.sendDocsWithRetry(AbstractFullDistribZkTestBase.java:741)
at org.apache.solr.cloud.LeaderFailoverAfterPartitionTest.testRf3WithLeaderFailover(LeaderFailoverAfterPartitionTest.java:178)
at org.apache.solr.cloud.LeaderFailoverAfterPartitionTest.test(LeaderFailoverAfterPartitionTest.java:57)
at sun.reflect.NativeMethodAccessorImpl.invoke0(Native Method)
at sun.reflect.NativeMethodAccessorImpl.invoke(NativeMethodAccessorImpl.java:62)
at sun.reflect.DelegatingMethodAccessorImpl.invoke(DelegatingMethodAccessorImpl.java:43)
at java.lang.reflect.Method.invoke(Method.java:498)
at com.carrotsearch.randomizedtesting.RandomizedRunner.invoke(RandomizedRunner.java:1764)
at com.carrotsearch.randomizedtesting.RandomizedRunner$8.evaluate(RandomizedRunner.java:871)
at com.carrotsearch.randomizedtesting.RandomizedRunner$9.evaluate(RandomizedRunner.java:907)
at com.carrotsearch.randomizedtesting.RandomizedRunner$10.evaluate(RandomizedRunner.java:921)
at org.apache.solr.BaseDistributedSearchTestCase$ShardsRepeatRule$ShardsFixedStatement.callStatement(BaseDistributedSearchTestCase.java:985)
at org.apache.solr.BaseDistributedSearchTestCase$ShardsRepeatRule$ShardsStatement.evaluate(BaseDistributedSearchTestCase.java:960)
at com.carrotsearch.randomizedtesting.rules.SystemPropertiesRestoreRule$1.evaluate(SystemPropertiesRestoreRule.java:57)
at org.apache.lucene.util.TestRuleSetupTeardownChained$1.evaluate(TestRuleSetupTeardownChained.java:49)
at org.apache.lucene.util.AbstractBeforeAfterRule$1.evaluate(AbstractBeforeAfterRule.java:45)
at org.apache.lucene.util.TestRuleThreadAndTestName$1.evaluate(TestRuleThreadAndTestName.java:48)
at org.apache.lucene.util.TestRuleIgnoreAfterMaxFailures$1.evaluate(TestRuleIgnoreAfterMaxFailures.java:64)
at org.apache.lucene.util.TestRuleMarkFailure$1.evaluate(TestRuleMarkFailure.java:47)
at com.carrotsearch.randomizedtesting.rules.StatementAdapter.evaluate(StatementAdapter.java:36)
at com.carrotsearch.randomizedtesting.ThreadLeakControl$StatementRunner.run(ThreadLeakControl.java:367)
at com.carrotsearch.randomizedtesting.ThreadLeakControl.forkTimeoutingTask(ThreadLeakControl.java:809)
at com.carrotsearch.randomizedtesting.ThreadLeakControl$3.evaluate(ThreadLeakControl.java:460)
at com.carrotsearch.randomizedtesting.RandomizedRunner.runSingleTest(RandomizedRunner.java:880)
at com.carrotsearch.randomizedtesting.RandomizedRunner$5.evaluate(RandomizedRunner.java:781)
at com.carrotsearch.randomizedtesting.RandomizedRunner$6.evaluate(RandomizedRunner.java:816)
at com.carrotsearch.randomizedtesting.RandomizedRunner$7.evaluate(RandomizedRunner.java:827)
at com.carrotsearch.randomizedtesting.rules.StatementAdapter.evaluate(StatementAdapter.java:36)
at com.carrotsearch.randomizedtesting.rules.SystemPropertiesRestoreRule$1.evaluate(SystemPropertiesRestoreRule.java:57)
at org.apache.lucene.util.AbstractBeforeAfterRule$1.evaluate(AbstractBeforeAfterRule.java:45)
at com.carrotsearch.randomizedtesting.rules.StatementAdapter.evaluate(StatementAdapter.java:36)
at org.apache.lucene.util.TestRuleStoreClassName$1.evaluate(TestRuleStoreClassName.java:41)
at com.carrotsearch.randomizedtesting.rules.NoShadowingOrOverridesOnMethodsRule$1.evaluate(NoShadowingOrOverridesOnMethodsRule.java:40)
at com.carrotsearch.randomizedtesting.rules.NoShadowingOrOverridesOnMethodsRule$1.evaluate(NoShadowingOrOverridesOnMethodsRule.java:40)
at com.carrotsearch.randomizedtesting.rules.StatementAdapter.evaluate(StatementAdapter.java:36)
at com.carrotsearch.randomizedtesting.rules.StatementAdapter.evaluate(StatementAdapter.java:36)
at com.carrotsearch.randomizedtesting.rules.StatementAdapter.evaluate(StatementAdapter.java:36)
at org.apache.lucene.util.TestRuleAssertionsRequired$1.evaluate(TestRuleAssertionsRequired.java:53)
at org.apache.lucene.util.TestRuleMarkFailure$1.evaluate(TestRuleMarkFailure.java:47)
at org.apache.lucene.util.TestRuleIgnoreAfterMaxFailures$1.evaluate(TestRuleIgnoreAfterMaxFailures.java:64)
at org.apache.lucene.util.TestRuleIgnoreTestSuites$1.evaluate(TestRuleIgnoreTestSuites.java:54)
at com.carrotsearch.randomizedtesting.rules.StatementAdapter.evaluate(StatementAdapter.java:36)
at com.carrotsearch.randomizedtesting.ThreadLeakControl$StatementRunner.run(ThreadLeakControl.java:367)
at java.lang.Thread.run(Thread.java:745)
Caused by: org.apache.solr.client.solrj.SolrServerException: No live SolrServers available to handle this request:[http://127.0.0.1:42949/c8n_1x3_lf_shard1_replica2]
at org.apache.solr.client.solrj.impl.LBHttpSolrClient.request(LBHttpSolrClient.java:394)
at org.apache.solr.client.solrj.impl.CloudSolrClient.directUpdate(CloudSolrClient.java:763)
... 48 more
Caused by: org.apache.solr.client.solrj.SolrServerException: Server refused connection at: http://127.0.0.1:42949/c8n_1x3_lf_shard1_replica2
at org.apache.solr.client.solrj.impl.HttpSolrClient.executeMethod(HttpSolrClient.java:615)
at org.apache.solr.client.solrj.impl.HttpSolrClient.request(HttpSolrClient.java:261)
at org.apache.solr.client.solrj.impl.HttpSolrClient.request(HttpSolrClient.java:250)
at org.apache.solr.client.solrj.impl.LBHttpSolrClient.doRequest(LBHttpSolrClient.java:415)
at org.apache.solr.client.solrj.impl.LBHttpSolrClient.request(LBHttpSolrClient.java:383)
... 49 more
Caused by: org.apache.http.conn.HttpHostConnectException: Connect to 127.0.0.1:42949 [/127.0.0.1] failed: Connection refused
at org.apache.http.impl.conn.DefaultHttpClientConnectionOperator.connect(DefaultHttpClientConnectionOperator.java:151)
at org.apache.http.impl.conn.PoolingHttpClientConnectionManager.connect(PoolingHttpClientConnectionManager.java:353)
at org.apache.http.impl.execchain.MainClientExec.establishRoute(MainClientExec.java:380)
at org.apache.http.impl.execchain.MainClientExec.execute(MainClientExec.java:236)
at org.apache.http.impl.execchain.ProtocolExec.execute(ProtocolExec.java:184)
at org.apache.http.impl.execchain.RetryExec.execute(RetryExec.java:88)
at org.apache.http.impl.execchain.RedirectExec.execute(RedirectExec.java:110)
at org.apache.http.impl.client.InternalHttpClient.doExecute(InternalHttpClient.java:184)
at org.apache.http.impl.client.CloseableHttpClient.execute(CloseableHttpClient.java:82)
at org.apache.http.impl.client.CloseableHttpClient.execute(CloseableHttpClient.java:55)
at org.apache.solr.client.solrj.impl.HttpSolrClient.executeMethod(HttpSolrClient.java:513)
... 53 more
Caused by: java.net.ConnectException: Connection refused
at java.net.PlainSocketImpl.socketConnect(Native Method)
at java.net.AbstractPlainSocketImpl.doConnect(AbstractPlainSocketImpl.java:350)
at java.net.AbstractPlainSocketImpl.connectToAddress(AbstractPlainSocketImpl.java:206)
at java.net.AbstractPlainSocketImpl.connect(AbstractPlainSocketImpl.java:188)
at java.net.SocksSocketImpl.connect(SocksSocketImpl.java:392)
at java.net.Socket.connect(Socket.java:589)
at org.apache.http.conn.socket.PlainConnectionSocketFactory.connectSocket(PlainConnectionSocketFactory.java:74)
at org.apache.http.impl.conn.DefaultHttpClientConnectionOperator.connect(DefaultHttpClientConnectionOperator.java:134)
... 63 more
FAILED: org.apache.solr.security.BasicAuthIntegrationTest.testBasics
Error Message:
IOException occured when talking to server at: http://127.0.0.1:45031/solr
Stack Trace:
org.apache.solr.client.solrj.SolrServerException: IOException occured when talking to server at: http://127.0.0.1:45031/solr
at __randomizedtesting.SeedInfo.seed([C50AEE012C6EB3D3:F8D2402D1480EDA3]:0)
at org.apache.solr.client.solrj.impl.HttpSolrClient.executeMethod(HttpSolrClient.java:622)
at org.apache.solr.client.solrj.impl.HttpSolrClient.request(HttpSolrClient.java:261)
at org.apache.solr.client.solrj.impl.HttpSolrClient.request(HttpSolrClient.java:250)
at org.apache.solr.client.solrj.impl.LBHttpSolrClient.doRequest(LBHttpSolrClient.java:415)
at org.apache.solr.client.solrj.impl.LBHttpSolrClient.request(LBHttpSolrClient.java:367)
at org.apache.solr.client.solrj.impl.CloudSolrClient.sendRequest(CloudSolrClient.java:1280)
at org.apache.solr.client.solrj.impl.CloudSolrClient.requestWithRetryOnStaleState(CloudSolrClient.java:1050)
at org.apache.solr.client.solrj.impl.CloudSolrClient.request(CloudSolrClient.java:992)
at org.apache.solr.client.solrj.SolrClient.request(SolrClient.java:1219)
at org.apache.solr.security.BasicAuthIntegrationTest.doExtraTests(BasicAuthIntegrationTest.java:116)
at org.apache.solr.cloud.TestMiniSolrCloudClusterBase.testCollectionCreateSearchDelete(TestMiniSolrCloudClusterBase.java:196)
at org.apache.solr.cloud.TestMiniSolrCloudClusterBase.testBasics(TestMiniSolrCloudClusterBase.java:79)
at sun.reflect.NativeMethodAccessorImpl.invoke0(Native Method)
at sun.reflect.NativeMethodAccessorImpl.invoke(NativeMethodAccessorImpl.java:62)
at sun.reflect.DelegatingMethodAccessorImpl.invoke(DelegatingMethodAccessorImpl.java:43)
at java.lang.reflect.Method.invoke(Method.java:498)
at com.carrotsearch.randomizedtesting.RandomizedRunner.invoke(RandomizedRunner.java:1764)
at com.carrotsearch.randomizedtesting.RandomizedRunner$8.evaluate(RandomizedRunner.java:871)
at com.carrotsearch.randomizedtesting.RandomizedRunner$9.evaluate(RandomizedRunner.java:907)
at com.carrotsearch.randomizedtesting.RandomizedRunner$10.evaluate(RandomizedRunner.java:921)
at com.carrotsearch.randomizedtesting.rules.SystemPropertiesRestoreRule$1.evaluate(SystemPropertiesRestoreRule.java:57)
at org.apache.lucene.util.TestRuleSetupTeardownChained$1.evaluate(TestRuleSetupTeardownChained.java:49)
at org.apache.lucene.util.AbstractBeforeAfterRule$1.evaluate(AbstractBeforeAfterRule.java:45)
at org.apache.lucene.util.TestRuleThreadAndTestName$1.evaluate(TestRuleThreadAndTestName.java:48)
at org.apache.lucene.util.TestRuleIgnoreAfterMaxFailures$1.evaluate(TestRuleIgnoreAfterMaxFailures.java:64)
at org.apache.lucene.util.TestRuleMarkFailure$1.evaluate(TestRuleMarkFailure.java:47)
at com.carrotsearch.randomizedtesting.rules.StatementAdapter.evaluate(StatementAdapter.java:36)
at com.carrotsearch.randomizedtesting.ThreadLeakControl$StatementRunner.run(ThreadLeakControl.java:367)
at com.carrotsearch.randomizedtesting.ThreadLeakControl.forkTimeoutingTask(ThreadLeakControl.java:809)
at com.carrotsearch.randomizedtesting.ThreadLeakControl$3.evaluate(ThreadLeakControl.java:460)
at com.carrotsearch.randomizedtesting.RandomizedRunner.runSingleTest(RandomizedRunner.java:880)
at com.carrotsearch.randomizedtesting.RandomizedRunner$5.evaluate(RandomizedRunner.java:781)
at com.carrotsearch.randomizedtesting.RandomizedRunner$6.evaluate(RandomizedRunner.java:816)
at com.carrotsearch.randomizedtesting.RandomizedRunner$7.evaluate(RandomizedRunner.java:827)
at com.carrotsearch.randomizedtesting.rules.StatementAdapter.evaluate(StatementAdapter.java:36)
at com.carrotsearch.randomizedtesting.rules.SystemPropertiesRestoreRule$1.evaluate(SystemPropertiesRestoreRule.java:57)
at org.apache.lucene.util.AbstractBeforeAfterRule$1.evaluate(AbstractBeforeAfterRule.java:45)
at com.carrotsearch.randomizedtesting.rules.StatementAdapter.evaluate(StatementAdapter.java:36)
at org.apache.lucene.util.TestRuleStoreClassName$1.evaluate(TestRuleStoreClassName.java:41)
at com.carrotsearch.randomizedtesting.rules.NoShadowingOrOverridesOnMethodsRule$1.evaluate(NoShadowingOrOverridesOnMethodsRule.java:40)
at com.carrotsearch.randomizedtesting.rules.NoShadowingOrOverridesOnMethodsRule$1.evaluate(NoShadowingOrOverridesOnMethodsRule.java:40)
at com.carrotsearch.randomizedtesting.rules.StatementAdapter.evaluate(StatementAdapter.java:36)
at com.carrotsearch.randomizedtesting.rules.StatementAdapter.evaluate(StatementAdapter.java:36)
at com.carrotsearch.randomizedtesting.rules.StatementAdapter.evaluate(StatementAdapter.java:36)
at org.apache.lucene.util.TestRuleAssertionsRequired$1.evaluate(TestRuleAssertionsRequired.java:53)
at org.apache.lucene.util.TestRuleMarkFailure$1.evaluate(TestRuleMarkFailure.java:47)
at org.apache.lucene.util.TestRuleIgnoreAfterMaxFailures$1.evaluate(TestRuleIgnoreAfterMaxFailures.java:64)
at org.apache.lucene.util.TestRuleIgnoreTestSuites$1.evaluate(TestRuleIgnoreTestSuites.java:54)
at com.carrotsearch.randomizedtesting.rules.StatementAdapter.evaluate(StatementAdapter.java:36)
at com.carrotsearch.randomizedtesting.ThreadLeakControl$StatementRunner.run(ThreadLeakControl.java:367)
at java.lang.Thread.run(Thread.java:745)
Caused by: org.apache.http.NoHttpResponseException: 127.0.0.1:45031 failed to respond
at org.apache.http.impl.conn.DefaultHttpResponseParser.parseHead(DefaultHttpResponseParser.java:143)
at org.apache.http.impl.conn.DefaultHttpResponseParser.parseHead(DefaultHttpResponseParser.java:57)
at org.apache.http.impl.io.AbstractMessageParser.parse(AbstractMessageParser.java:261)
at org.apache.http.impl.DefaultBHttpClientConnection.receiveResponseHeader(DefaultBHttpClientConnection.java:165)
at org.apache.http.impl.conn.CPoolProxy.receiveResponseHeader(CPoolProxy.java:167)
at org.apache.http.protocol.HttpRequestExecutor.doReceiveResponse(HttpRequestExecutor.java:272)
at org.apache.http.protocol.HttpRequestExecutor.execute(HttpRequestExecutor.java:124)
at org.apache.http.impl.execchain.MainClientExec.execute(MainClientExec.java:271)
at org.apache.http.impl.execchain.ProtocolExec.execute(ProtocolExec.java:184)
at org.apache.http.impl.execchain.RetryExec.execute(RetryExec.java:88)
at org.apache.http.impl.execchain.RedirectExec.execute(RedirectExec.java:110)
at org.apache.http.impl.client.InternalHttpClient.doExecute(InternalHttpClient.java:184)
at org.apache.http.impl.client.CloseableHttpClient.execute(CloseableHttpClient.java:82)
at org.apache.http.impl.client.CloseableHttpClient.execute(CloseableHttpClient.java:55)
at org.apache.solr.client.solrj.impl.HttpSolrClient.executeMethod(HttpSolrClient.java:513)
... 50 more
Build Log:
[...truncated 10589 lines...]
[junit4] Suite: org.apache.solr.cloud.LeaderFailoverAfterPartitionTest
[junit4] 2> Creating dataDir: /x1/jenkins/jenkins-slave/workspace/Lucene-Solr-Tests-master/solr/build/solr-core/test/J1/temp/solr.cloud.LeaderFailoverAfterPartitionTest_C50AEE012C6EB3D3-001/init-core-data-001
[junit4] 2> 40143 INFO (SUITE-LeaderFailoverAfterPartitionTest-seed#[C50AEE012C6EB3D3]-worker) [ ] o.a.s.SolrTestCaseJ4 Randomized ssl (false) and clientAuth (false) via: @org.apache.solr.SolrTestCaseJ4$SuppressSSL(bugUrl=https://issues.apache.org/jira/browse/SOLR-5776)
[junit4] 2> 40143 INFO (SUITE-LeaderFailoverAfterPartitionTest-seed#[C50AEE012C6EB3D3]-worker) [ ] o.a.s.BaseDistributedSearchTestCase Setting hostContext system property: /
[junit4] 2> 40157 INFO (TEST-LeaderFailoverAfterPartitionTest.test-seed#[C50AEE012C6EB3D3]) [ ] o.a.s.c.ZkTestServer STARTING ZK TEST SERVER
[junit4] 2> 40159 INFO (Thread-96) [ ] o.a.s.c.ZkTestServer client port:0.0.0.0/0.0.0.0:0
[junit4] 2> 40161 INFO (Thread-96) [ ] o.a.s.c.ZkTestServer Starting server
[junit4] 2> 40258 INFO (TEST-LeaderFailoverAfterPartitionTest.test-seed#[C50AEE012C6EB3D3]) [ ] o.a.s.c.ZkTestServer start zk server on port:35683
[junit4] 2> 40276 INFO (TEST-LeaderFailoverAfterPartitionTest.test-seed#[C50AEE012C6EB3D3]) [ ] o.a.s.c.c.SolrZkClient Using default ZkCredentialsProvider
[junit4] 2> 40316 INFO (TEST-LeaderFailoverAfterPartitionTest.test-seed#[C50AEE012C6EB3D3]) [ ] o.a.s.c.c.ConnectionManager Waiting for client to connect to ZooKeeper
[junit4] 2> 40348 WARN (NIOServerCxn.Factory:0.0.0.0/0.0.0.0:0) [ ] o.a.z.s.NIOServerCnxn Exception causing close of session 0x0 due to java.io.IOException: ZooKeeperServer not running
[junit4] 2> 42102 INFO (zkCallback-30-thread-1) [ ] o.a.s.c.c.ConnectionManager Watcher org.apache.solr.common.cloud.ConnectionManager@7a964573 name:ZooKeeperConnection Watcher:127.0.0.1:35683 got event WatchedEvent state:SyncConnected type:None path:null path:null type:None
[junit4] 2> 42102 INFO (TEST-LeaderFailoverAfterPartitionTest.test-seed#[C50AEE012C6EB3D3]) [ ] o.a.s.c.c.ConnectionManager Client is connected to ZooKeeper
[junit4] 2> 42103 INFO (TEST-LeaderFailoverAfterPartitionTest.test-seed#[C50AEE012C6EB3D3]) [ ] o.a.s.c.c.SolrZkClient Using default ZkACLProvider
[junit4] 2> 42105 INFO (TEST-LeaderFailoverAfterPartitionTest.test-seed#[C50AEE012C6EB3D3]) [ ] o.a.s.c.c.SolrZkClient makePath: /solr
[junit4] 2> 42134 INFO (TEST-LeaderFailoverAfterPartitionTest.test-seed#[C50AEE012C6EB3D3]) [ ] o.a.s.c.c.SolrZkClient Using default ZkCredentialsProvider
[junit4] 2> 42134 INFO (TEST-LeaderFailoverAfterPartitionTest.test-seed#[C50AEE012C6EB3D3]) [ ] o.a.s.c.c.ConnectionManager Waiting for client to connect to ZooKeeper
[junit4] 2> 42142 INFO (zkCallback-31-thread-1) [ ] o.a.s.c.c.ConnectionManager Watcher org.apache.solr.common.cloud.ConnectionManager@5c0ce017 name:ZooKeeperConnection Watcher:127.0.0.1:35683/solr got event WatchedEvent state:SyncConnected type:None path:null path:null type:None
[junit4] 2> 42142 INFO (TEST-LeaderFailoverAfterPartitionTest.test-seed#[C50AEE012C6EB3D3]) [ ] o.a.s.c.c.ConnectionManager Client is connected to ZooKeeper
[junit4] 2> 42143 INFO (TEST-LeaderFailoverAfterPartitionTest.test-seed#[C50AEE012C6EB3D3]) [ ] o.a.s.c.c.SolrZkClient Using default ZkACLProvider
[junit4] 2> 42143 INFO (TEST-LeaderFailoverAfterPartitionTest.test-seed#[C50AEE012C6EB3D3]) [ ] o.a.s.c.c.SolrZkClient makePath: /collections/collection1
[junit4] 2> 42166 INFO (TEST-LeaderFailoverAfterPartitionTest.test-seed#[C50AEE012C6EB3D3]) [ ] o.a.s.c.c.SolrZkClient makePath: /collections/collection1/shards
[junit4] 2> 42169 INFO (TEST-LeaderFailoverAfterPartitionTest.test-seed#[C50AEE012C6EB3D3]) [ ] o.a.s.c.c.SolrZkClient makePath: /collections/control_collection
[junit4] 2> 42172 INFO (TEST-LeaderFailoverAfterPartitionTest.test-seed#[C50AEE012C6EB3D3]) [ ] o.a.s.c.c.SolrZkClient makePath: /collections/control_collection/shards
[junit4] 2> 42179 INFO (TEST-LeaderFailoverAfterPartitionTest.test-seed#[C50AEE012C6EB3D3]) [ ] o.a.s.c.AbstractZkTestCase put /x1/jenkins/jenkins-slave/workspace/Lucene-Solr-Tests-master/solr/core/src/test-files/solr/collection1/conf/solrconfig-tlog.xml to /configs/conf1/solrconfig.xml
[junit4] 2> 42180 INFO (TEST-LeaderFailoverAfterPartitionTest.test-seed#[C50AEE012C6EB3D3]) [ ] o.a.s.c.c.SolrZkClient makePath: /configs/conf1/solrconfig.xml
[junit4] 2> 42197 INFO (TEST-LeaderFailoverAfterPartitionTest.test-seed#[C50AEE012C6EB3D3]) [ ] o.a.s.c.AbstractZkTestCase put /x1/jenkins/jenkins-slave/workspace/Lucene-Solr-Tests-master/solr/core/src/test-files/solr/collection1/conf/schema.xml to /configs/conf1/schema.xml
[junit4] 2> 42198 INFO (TEST-LeaderFailoverAfterPartitionTest.test-seed#[C50AEE012C6EB3D3]) [ ] o.a.s.c.c.SolrZkClient makePath: /configs/conf1/schema.xml
[junit4] 2> 42201 INFO (TEST-LeaderFailoverAfterPartitionTest.test-seed#[C50AEE012C6EB3D3]) [ ] o.a.s.c.AbstractZkTestCase put /x1/jenkins/jenkins-slave/workspace/Lucene-Solr-Tests-master/solr/core/src/test-files/solr/collection1/conf/solrconfig.snippet.randomindexconfig.xml to /configs/conf1/solrconfig.snippet.randomindexconfig.xml
[junit4] 2> 42201 INFO (TEST-LeaderFailoverAfterPartitionTest.test-seed#[C50AEE012C6EB3D3]) [ ] o.a.s.c.c.SolrZkClient makePath: /configs/conf1/solrconfig.snippet.randomindexconfig.xml
[junit4] 2> 42209 INFO (TEST-LeaderFailoverAfterPartitionTest.test-seed#[C50AEE012C6EB3D3]) [ ] o.a.s.c.AbstractZkTestCase put /x1/jenkins/jenkins-slave/workspace/Lucene-Solr-Tests-master/solr/core/src/test-files/solr/collection1/conf/stopwords.txt to /configs/conf1/stopwords.txt
[junit4] 2> 42210 INFO (TEST-LeaderFailoverAfterPartitionTest.test-seed#[C50AEE012C6EB3D3]) [ ] o.a.s.c.c.SolrZkClient makePath: /configs/conf1/stopwords.txt
[junit4] 2> 42212 INFO (TEST-LeaderFailoverAfterPartitionTest.test-seed#[C50AEE012C6EB3D3]) [ ] o.a.s.c.AbstractZkTestCase put /x1/jenkins/jenkins-slave/workspace/Lucene-Solr-Tests-master/solr/core/src/test-files/solr/collection1/conf/protwords.txt to /configs/conf1/protwords.txt
[junit4] 2> 42212 INFO (TEST-LeaderFailoverAfterPartitionTest.test-seed#[C50AEE012C6EB3D3]) [ ] o.a.s.c.c.SolrZkClient makePath: /configs/conf1/protwords.txt
[junit4] 2> 42216 INFO (TEST-LeaderFailoverAfterPartitionTest.test-seed#[C50AEE012C6EB3D3]) [ ] o.a.s.c.AbstractZkTestCase put /x1/jenkins/jenkins-slave/workspace/Lucene-Solr-Tests-master/solr/core/src/test-files/solr/collection1/conf/currency.xml to /configs/conf1/currency.xml
[junit4] 2> 42216 INFO (TEST-LeaderFailoverAfterPartitionTest.test-seed#[C50AEE012C6EB3D3]) [ ] o.a.s.c.c.SolrZkClient makePath: /configs/conf1/currency.xml
[junit4] 2> 42219 INFO (TEST-LeaderFailoverAfterPartitionTest.test-seed#[C50AEE012C6EB3D3]) [ ] o.a.s.c.AbstractZkTestCase put /x1/jenkins/jenkins-slave/workspace/Lucene-Solr-Tests-master/solr/core/src/test-files/solr/collection1/conf/enumsConfig.xml to /configs/conf1/enumsConfig.xml
[junit4] 2> 42219 INFO (TEST-LeaderFailoverAfterPartitionTest.test-seed#[C50AEE012C6EB3D3]) [ ] o.a.s.c.c.SolrZkClient makePath: /configs/conf1/enumsConfig.xml
[junit4] 2> 42222 INFO (TEST-LeaderFailoverAfterPartitionTest.test-seed#[C50AEE012C6EB3D3]) [ ] o.a.s.c.AbstractZkTestCase put /x1/jenkins/jenkins-slave/workspace/Lucene-Solr-Tests-master/solr/core/src/test-files/solr/collection1/conf/open-exchange-rates.json to /configs/conf1/open-exchange-rates.json
[junit4] 2> 42222 INFO (TEST-LeaderFailoverAfterPartitionTest.test-seed#[C50AEE012C6EB3D3]) [ ] o.a.s.c.c.SolrZkClient makePath: /configs/conf1/open-exchange-rates.json
[junit4] 2> 42232 INFO (TEST-LeaderFailoverAfterPartitionTest.test-seed#[C50AEE012C6EB3D3]) [ ] o.a.s.c.AbstractZkTestCase put /x1/jenkins/jenkins-slave/workspace/Lucene-Solr-Tests-master/solr/core/src/test-files/solr/collection1/conf/mapping-ISOLatin1Accent.txt to /configs/conf1/mapping-ISOLatin1Accent.txt
[junit4] 2> 42232 INFO (TEST-LeaderFailoverAfterPartitionTest.test-seed#[C50AEE012C6EB3D3]) [ ] o.a.s.c.c.SolrZkClient makePath: /configs/conf1/mapping-ISOLatin1Accent.txt
[junit4] 2> 42235 INFO (TEST-LeaderFailoverAfterPartitionTest.test-seed#[C50AEE012C6EB3D3]) [ ] o.a.s.c.AbstractZkTestCase put /x1/jenkins/jenkins-slave/workspace/Lucene-Solr-Tests-master/solr/core/src/test-files/solr/collection1/conf/old_synonyms.txt to /configs/conf1/old_synonyms.txt
[junit4] 2> 42235 INFO (TEST-LeaderFailoverAfterPartitionTest.test-seed#[C50AEE012C6EB3D3]) [ ] o.a.s.c.c.SolrZkClient makePath: /configs/conf1/old_synonyms.txt
[junit4] 2> 42239 INFO (TEST-LeaderFailoverAfterPartitionTest.test-seed#[C50AEE012C6EB3D3]) [ ] o.a.s.c.AbstractZkTestCase put /x1/jenkins/jenkins-slave/workspace/Lucene-Solr-Tests-master/solr/core/src/test-files/solr/collection1/conf/synonyms.txt to /configs/conf1/synonyms.txt
[junit4] 2> 42239 INFO (TEST-LeaderFailoverAfterPartitionTest.test-seed#[C50AEE012C6EB3D3]) [ ] o.a.s.c.c.SolrZkClient makePath: /configs/conf1/synonyms.txt
[junit4] 2> 42446 INFO (TEST-LeaderFailoverAfterPartitionTest.test-seed#[C50AEE012C6EB3D3]) [ ] o.a.s.SolrTestCaseJ4 Writing core.properties file to /x1/jenkins/jenkins-slave/workspace/Lucene-Solr-Tests-master/solr/build/solr-core/test/J1/temp/solr.cloud.LeaderFailoverAfterPartitionTest_C50AEE012C6EB3D3-001/control-001/cores/collection1
[junit4] 2> 42450 INFO (TEST-LeaderFailoverAfterPartitionTest.test-seed#[C50AEE012C6EB3D3]) [ ] o.e.j.s.Server jetty-9.3.8.v20160314
[junit4] 2> 42452 INFO (TEST-LeaderFailoverAfterPartitionTest.test-seed#[C50AEE012C6EB3D3]) [ ] o.e.j.s.h.ContextHandler Started o.e.j.s.ServletContextHandler@73619abf{/,null,AVAILABLE}
[junit4] 2> 42455 INFO (TEST-LeaderFailoverAfterPartitionTest.test-seed#[C50AEE012C6EB3D3]) [ ] o.e.j.s.ServerConnector Started ServerConnector@127bd70d{HTTP/1.1,[http/1.1]}{127.0.0.1:48062}
[junit4] 2> 42456 INFO (TEST-LeaderFailoverAfterPartitionTest.test-seed#[C50AEE012C6EB3D3]) [ ] o.e.j.s.Server Started @47771ms
[junit4] 2> 42456 INFO (TEST-LeaderFailoverAfterPartitionTest.test-seed#[C50AEE012C6EB3D3]) [ ] o.a.s.c.s.e.JettySolrRunner Jetty properties: {solr.data.dir=/x1/jenkins/jenkins-slave/workspace/Lucene-Solr-Tests-master/solr/build/solr-core/test/J1/temp/solr.cloud.LeaderFailoverAfterPartitionTest_C50AEE012C6EB3D3-001/tempDir-001/control/data, hostContext=/, hostPort=43811, coreRootDirectory=/x1/jenkins/jenkins-slave/workspace/Lucene-Solr-Tests-master/solr/build/solr-core/test/J1/temp/solr.cloud.LeaderFailoverAfterPartitionTest_C50AEE012C6EB3D3-001/control-001/cores}
[junit4] 2> 42456 INFO (TEST-LeaderFailoverAfterPartitionTest.test-seed#[C50AEE012C6EB3D3]) [ ] o.a.s.s.SolrDispatchFilter SolrDispatchFilter.init(): sun.misc.Launcher$AppClassLoader@73d16e93
[junit4] 2> 42456 INFO (TEST-LeaderFailoverAfterPartitionTest.test-seed#[C50AEE012C6EB3D3]) [ ] o.a.s.c.SolrResourceLoader new SolrResourceLoader for directory: '/x1/jenkins/jenkins-slave/workspace/Lucene-Solr-Tests-master/solr/build/solr-core/test/J1/temp/solr.cloud.LeaderFailoverAfterPartitionTest_C50AEE012C6EB3D3-001/control-001'
[junit4] 2> 42456 INFO (TEST-LeaderFailoverAfterPartitionTest.test-seed#[C50AEE012C6EB3D3]) [ ] o.a.s.c.SolrResourceLoader JNDI not configured for solr (NoInitialContextEx)
[junit4] 2> 42456 INFO (TEST-LeaderFailoverAfterPartitionTest.test-seed#[C50AEE012C6EB3D3]) [ ] o.a.s.c.SolrResourceLoader solr home defaulted to 'solr/' (could not find system property or JNDI)
[junit4] 2> 42457 INFO (TEST-LeaderFailoverAfterPartitionTest.test-seed#[C50AEE012C6EB3D3]) [ ] o.a.s.c.c.SolrZkClient Using default ZkCredentialsProvider
[junit4] 2> 42457 INFO (TEST-LeaderFailoverAfterPartitionTest.test-seed#[C50AEE012C6EB3D3]) [ ] o.a.s.c.c.ConnectionManager Waiting for client to connect to ZooKeeper
[junit4] 2> 42473 INFO (zkCallback-32-thread-1) [ ] o.a.s.c.c.ConnectionManager Watcher org.apache.solr.common.cloud.ConnectionManager@23e84635 name:ZooKeeperConnection Watcher:127.0.0.1:35683/solr got event WatchedEvent state:SyncConnected type:None path:null path:null type:None
[junit4] 2> 42473 INFO (TEST-LeaderFailoverAfterPartitionTest.test-seed#[C50AEE012C6EB3D3]) [ ] o.a.s.c.c.ConnectionManager Client is connected to ZooKeeper
[junit4] 2> 42473 INFO (TEST-LeaderFailoverAfterPartitionTest.test-seed#[C50AEE012C6EB3D3]) [ ] o.a.s.c.c.SolrZkClient Using default ZkACLProvider
[junit4] 2> 42477 INFO (TEST-LeaderFailoverAfterPartitionTest.test-seed#[C50AEE012C6EB3D3]) [ ] o.a.s.s.SolrDispatchFilter Loading solr.xml from SolrHome (not found in ZooKeeper)
[junit4] 2> 42477 INFO (TEST-LeaderFailoverAfterPartitionTest.test-seed#[C50AEE012C6EB3D3]) [ ] o.a.s.c.SolrXmlConfig Loading container configuration from /x1/jenkins/jenkins-slave/workspace/Lucene-Solr-Tests-master/solr/build/solr-core/test/J1/temp/solr.cloud.LeaderFailoverAfterPartitionTest_C50AEE012C6EB3D3-001/control-001/solr.xml
[junit4] 2> 42478 WARN (NIOServerCxn.Factory:0.0.0.0/0.0.0.0:0) [ ] o.a.z.s.NIOServerCnxn caught end of stream exception
[junit4] 2> EndOfStreamException: Unable to read additional data from client sessionid 0x156e6866f9d0002, likely client has closed socket
[junit4] 2> at org.apache.zookeeper.server.NIOServerCnxn.doIO(NIOServerCnxn.java:228)
[junit4] 2> at org.apache.zookeeper.server.NIOServerCnxnFactory.run(NIOServerCnxnFactory.java:208)
[junit4] 2> at java.lang.Thread.run(Thread.java:745)
[junit4] 2> 42483 INFO (TEST-LeaderFailoverAfterPartitionTest.test-seed#[C50AEE012C6EB3D3]) [ ] o.a.s.c.CorePropertiesLocator Config-defined core root directory: /x1/jenkins/jenkins-slave/workspace/Lucene-Solr-Tests-master/solr/build/solr-core/test/J1/temp/solr.cloud.LeaderFailoverAfterPartitionTest_C50AEE012C6EB3D3-001/control-001/cores
[junit4] 2> 42483 INFO (TEST-LeaderFailoverAfterPartitionTest.test-seed#[C50AEE012C6EB3D3]) [ ] o.a.s.c.CoreContainer New CoreContainer 290631998
[junit4] 2> 42483 INFO (TEST-LeaderFailoverAfterPartitionTest.test-seed#[C50AEE012C6EB3D3]) [ ] o.a.s.c.CoreContainer Loading cores into CoreContainer [instanceDir=/x1/jenkins/jenkins-slave/workspace/Lucene-Solr-Tests-master/solr/build/solr-core/test/J1/temp/solr.cloud.LeaderFailoverAfterPartitionTest_C50AEE012C6EB3D3-001/control-001]
[junit4] 2> 42484 WARN (TEST-LeaderFailoverAfterPartitionTest.test-seed#[C50AEE012C6EB3D3]) [ ] o.a.s.c.CoreContainer Couldn't add files from /x1/jenkins/jenkins-slave/workspace/Lucene-Solr-Tests-master/solr/build/solr-core/test/J1/temp/solr.cloud.LeaderFailoverAfterPartitionTest_C50AEE012C6EB3D3-001/control-001/lib to classpath: /x1/jenkins/jenkins-slave/workspace/Lucene-Solr-Tests-master/solr/build/solr-core/test/J1/temp/solr.cloud.LeaderFailoverAfterPartitionTest_C50AEE012C6EB3D3-001/control-001/lib
[junit4] 2> 42484 INFO (TEST-LeaderFailoverAfterPartitionTest.test-seed#[C50AEE012C6EB3D3]) [ ] o.a.s.h.c.HttpShardHandlerFactory created with socketTimeout : 90000,urlScheme : ,connTimeout : 15000,maxConnectionsPerHost : 20,maxConnections : 10000,corePoolSize : 0,maximumPoolSize : 2147483647,maxThreadIdleTime : 5,sizeOfQueue : -1,fairnessPolicy : false,
[junit4] 2> 42487 INFO (TEST-LeaderFailoverAfterPartitionTest.test-seed#[C50AEE012C6EB3D3]) [ ] o.a.s.u.UpdateShardHandler Created UpdateShardHandler HTTP client with params: socketTimeout=340000&connTimeout=45000&maxConnections=100000&maxConnectionsPerHost=100000
[junit4] 2> 42487 INFO (TEST-LeaderFailoverAfterPartitionTest.test-seed#[C50AEE012C6EB3D3]) [ ] o.a.s.l.LogWatcher SLF4J impl is org.slf4j.impl.Log4jLoggerFactory
[junit4] 2> 42487 INFO (TEST-LeaderFailoverAfterPartitionTest.test-seed#[C50AEE012C6EB3D3]) [ ] o.a.s.l.LogWatcher Registering Log Listener [Log4j (org.slf4j.impl.Log4jLoggerFactory)]
[junit4] 2> 42487 INFO (TEST-LeaderFailoverAfterPartitionTest.test-seed#[C50AEE012C6EB3D3]) [ ] o.a.s.c.ZkContainer Zookeeper client=127.0.0.1:35683/solr
[junit4] 2> 42503 INFO (TEST-LeaderFailoverAfterPartitionTest.test-seed#[C50AEE012C6EB3D3]) [ ] o.a.s.c.ZkController zkHost includes chroot
[junit4] 2> 42503 INFO (TEST-LeaderFailoverAfterPartitionTest.test-seed#[C50AEE012C6EB3D3]) [ ] o.a.s.c.c.SolrZkClient Using default ZkCredentialsProvider
[junit4] 2> 42503 INFO (TEST-LeaderFailoverAfterPartitionTest.test-seed#[C50AEE012C6EB3D3]) [ ] o.a.s.c.c.ConnectionManager Waiting for client to connect to ZooKeeper
[junit4] 2> 42506 INFO (zkCallback-35-thread-1) [ ] o.a.s.c.c.ConnectionManager Watcher org.apache.solr.common.cloud.ConnectionManager@597b8586 name:ZooKeeperConnection Watcher:127.0.0.1:35683 got event WatchedEvent state:SyncConnected type:None path:null path:null type:None
[junit4] 2> 42506 INFO (TEST-LeaderFailoverAfterPartitionTest.test-seed#[C50AEE012C6EB3D3]) [ ] o.a.s.c.c.ConnectionManager Client is connected to ZooKeeper
[junit4] 2> 42506 INFO (TEST-LeaderFailoverAfterPartitionTest.test-seed#[C50AEE012C6EB3D3]) [ ] o.a.s.c.c.SolrZkClient Using default ZkACLProvider
[junit4] 2> 42514 INFO (TEST-LeaderFailoverAfterPartitionTest.test-seed#[C50AEE012C6EB3D3]) [n:127.0.0.1:43811_ ] o.a.s.c.ZkController Added new OnReconnect listener org.apache.solr.cloud.ZkController$$Lambda$96/1407113393@7b675f91
[junit4] 2> 42518 INFO (TEST-LeaderFailoverAfterPartitionTest.test-seed#[C50AEE012C6EB3D3]) [n:127.0.0.1:43811_ ] o.a.s.c.c.ConnectionManager Waiting for client to connect to ZooKeeper
[junit4] 2> 42520 INFO (zkCallback-36-thread-1-processing-n:127.0.0.1:43811_) [n:127.0.0.1:43811_ ] o.a.s.c.c.ConnectionManager Watcher org.apache.solr.common.cloud.ConnectionManager@2ad8c48f name:ZooKeeperConnection Watcher:127.0.0.1:35683/solr got event WatchedEvent state:SyncConnected type:None path:null path:null type:None
[junit4] 2> 42520 INFO (TEST-LeaderFailoverAfterPartitionTest.test-seed#[C50AEE012C6EB3D3]) [n:127.0.0.1:43811_ ] o.a.s.c.c.ConnectionManager Client is connected to ZooKeeper
[junit4] 2> 42529 INFO (TEST-LeaderFailoverAfterPartitionTest.test-seed#[C50AEE012C6EB3D3]) [n:127.0.0.1:43811_ ] o.a.s.c.c.SolrZkClient makePath: /overseer/queue
[junit4] 2> 42541 INFO (TEST-LeaderFailoverAfterPartitionTest.test-seed#[C50AEE012C6EB3D3]) [n:127.0.0.1:43811_ ] o.a.s.c.c.SolrZkClient makePath: /overseer/collection-queue-work
[junit4] 2> 42548 INFO (TEST-LeaderFailoverAfterPartitionTest.test-seed#[C50AEE012C6EB3D3]) [n:127.0.0.1:43811_ ] o.a.s.c.c.SolrZkClient makePath: /overseer/collection-map-running
[junit4] 2> 42552 INFO (TEST-LeaderFailoverAfterPartitionTest.test-seed#[C50AEE012C6EB3D3]) [n:127.0.0.1:43811_ ] o.a.s.c.c.SolrZkClient makePath: /overseer/collection-map-completed
[junit4] 2> 42555 INFO (TEST-LeaderFailoverAfterPartitionTest.test-seed#[C50AEE012C6EB3D3]) [n:127.0.0.1:43811_ ] o.a.s.c.c.SolrZkClient makePath: /overseer/collection-map-failure
[junit4] 2> 42565 INFO (TEST-LeaderFailoverAfterPartitionTest.test-seed#[C50AEE012C6EB3D3]) [n:127.0.0.1:43811_ ] o.a.s.c.c.SolrZkClient makePath: /live_nodes
[junit4] 2> 42568 INFO (TEST-LeaderFailoverAfterPartitionTest.test-seed#[C50AEE012C6EB3D3]) [n:127.0.0.1:43811_ ] o.a.s.c.c.SolrZkClient makePath: /aliases.json
[junit4] 2> 42570 INFO (TEST-LeaderFailoverAfterPartitionTest.test-seed#[C50AEE012C6EB3D3]) [n:127.0.0.1:43811_ ] o.a.s.c.c.SolrZkClient makePath: /clusterstate.json
[junit4] 2> 42572 INFO (TEST-LeaderFailoverAfterPartitionTest.test-seed#[C50AEE012C6EB3D3]) [n:127.0.0.1:43811_ ] o.a.s.c.c.SolrZkClient makePath: /security.json
[junit4] 2> 42574 INFO (TEST-LeaderFailoverAfterPartitionTest.test-seed#[C50AEE012C6EB3D3]) [n:127.0.0.1:43811_ ] o.a.s.c.c.ZkStateReader Updating cluster state from ZooKeeper...
[junit4] 2> 42578 INFO (TEST-LeaderFailoverAfterPartitionTest.test-seed#[C50AEE012C6EB3D3]) [n:127.0.0.1:43811_ ] o.a.s.c.c.ZkStateReader Loaded empty cluster properties
[junit4] 2> 42584 INFO (TEST-LeaderFailoverAfterPartitionTest.test-seed#[C50AEE012C6EB3D3]) [n:127.0.0.1:43811_ ] o.a.s.c.c.ZkStateReader Updated live nodes from ZooKeeper... (0) -> (0)
[junit4] 2> 42601 INFO (TEST-LeaderFailoverAfterPartitionTest.test-seed#[C50AEE012C6EB3D3]) [n:127.0.0.1:43811_ ] o.a.s.c.c.SolrZkClient makePath: /overseer_elect
[junit4] 2> 42605 INFO (TEST-LeaderFailoverAfterPartitionTest.test-seed#[C50AEE012C6EB3D3]) [n:127.0.0.1:43811_ ] o.a.s.c.c.SolrZkClient makePath: /overseer_elect/election
[junit4] 2> 42608 INFO (TEST-LeaderFailoverAfterPartitionTest.test-seed#[C50AEE012C6EB3D3]) [n:127.0.0.1:43811_ ] o.a.s.c.Overseer Overseer (id=null) closing
[junit4] 2> 42609 INFO (TEST-LeaderFailoverAfterPartitionTest.test-seed#[C50AEE012C6EB3D3]) [n:127.0.0.1:43811_ ] o.a.s.c.LeaderElector Joined leadership election with path: /overseer_elect/election/96517907107610628-127.0.0.1:43811_-n_0000000000
[junit4] 2> 42611 INFO (TEST-LeaderFailoverAfterPartitionTest.test-seed#[C50AEE012C6EB3D3]) [n:127.0.0.1:43811_ ] o.a.s.c.OverseerElectionContext I am going to be the leader 127.0.0.1:43811_
[junit4] 2> 42611 INFO (TEST-LeaderFailoverAfterPartitionTest.test-seed#[C50AEE012C6EB3D3]) [n:127.0.0.1:43811_ ] o.a.s.c.c.SolrZkClient makePath: /overseer_elect/leader
[junit4] 2> 42613 INFO (TEST-LeaderFailoverAfterPartitionTest.test-seed#[C50AEE012C6EB3D3]) [n:127.0.0.1:43811_ ] o.a.s.c.Overseer Overseer (id=96517907107610628-127.0.0.1:43811_-n_0000000000) starting
[junit4] 2> 42621 INFO (TEST-LeaderFailoverAfterPartitionTest.test-seed#[C50AEE012C6EB3D3]) [n:127.0.0.1:43811_ ] o.a.s.c.c.SolrZkClient makePath: /overseer/queue-work
[junit4] 2> 42735 INFO (TEST-LeaderFailoverAfterPartitionTest.test-seed#[C50AEE012C6EB3D3]) [n:127.0.0.1:43811_ ] o.a.s.c.OverseerAutoReplicaFailoverThread Starting OverseerAutoReplicaFailoverThread autoReplicaFailoverWorkLoopDelay=10000 autoReplicaFailoverWaitAfterExpiration=10000 autoReplicaFailoverBadNodeExpiration=60000
[junit4] 2> 42740 INFO (OverseerCollectionConfigSetProcessor-96517907107610628-127.0.0.1:43811_-n_0000000000) [n:127.0.0.1:43811_ ] o.a.s.c.OverseerTaskProcessor Process current queue of overseer operations
[junit4] 2> 42742 INFO (OverseerStateUpdate-96517907107610628-127.0.0.1:43811_-n_0000000000) [n:127.0.0.1:43811_ ] o.a.s.c.Overseer Starting to work on the main queue
[junit4] 2> 42743 INFO (TEST-LeaderFailoverAfterPartitionTest.test-seed#[C50AEE012C6EB3D3]) [n:127.0.0.1:43811_ ] o.a.s.c.ZkController Register node as live in ZooKeeper:/live_nodes/127.0.0.1:43811_
[junit4] 2> 42743 INFO (TEST-LeaderFailoverAfterPartitionTest.test-seed#[C50AEE012C6EB3D3]) [n:127.0.0.1:43811_ ] o.a.s.c.c.SolrZkClient makePath: /live_nodes/127.0.0.1:43811_
[junit4] 2> 42747 INFO (OverseerStateUpdate-96517907107610628-127.0.0.1:43811_-n_0000000000) [n:127.0.0.1:43811_ ] o.a.s.c.c.ZkStateReader Updated live nodes from ZooKeeper... (0) -> (0)
[junit4] 2> 42751 INFO (zkCallback-36-thread-1-processing-n:127.0.0.1:43811_) [n:127.0.0.1:43811_ ] o.a.s.c.c.ZkStateReader A live node change: [WatchedEvent state:SyncConnected type:NodeChildrenChanged path:/live_nodes], has occurred - updating... (live nodes size: [0])
[junit4] 2> 42755 INFO (zkCallback-36-thread-1-processing-n:127.0.0.1:43811_) [n:127.0.0.1:43811_ ] o.a.s.c.c.ZkStateReader Updated live nodes from ZooKeeper... (0) -> (1)
[junit4] 2> 42826 INFO (TEST-LeaderFailoverAfterPartitionTest.test-seed#[C50AEE012C6EB3D3]) [n:127.0.0.1:43811_ ] o.a.s.c.CoreContainer Security conf doesn't exist. Skipping setup for authorization module.
[junit4] 2> 42826 INFO (TEST-LeaderFailoverAfterPartitionTest.test-seed#[C50AEE012C6EB3D3]) [n:127.0.0.1:43811_ ] o.a.s.c.CoreContainer No authentication plugin used.
[junit4] 2> 42827 INFO (TEST-LeaderFailoverAfterPartitionTest.test-seed#[C50AEE012C6EB3D3]) [n:127.0.0.1:43811_ ] o.a.s.c.CorePropertiesLocator Looking for core definitions underneath /x1/jenkins/jenkins-slave/workspace/Lucene-Solr-Tests-master/solr/build/solr-core/test/J1/temp/solr.cloud.LeaderFailoverAfterPartitionTest_C50AEE012C6EB3D3-001/control-001/cores
[junit4] 2> 42830 INFO (TEST-LeaderFailoverAfterPartitionTest.test-seed#[C50AEE012C6EB3D3]) [n:127.0.0.1:43811_ ] o.a.s.c.CoreDescriptor Created CoreDescriptor: {name=collection1, config=solrconfig.xml, transient=false, schema=schema.xml, loadOnStartup=true, configSetProperties=configsetprops.json, collection=control_collection, coreNodeName=, dataDir=data/, shard=}
[junit4] 2> 42830 INFO (TEST-LeaderFailoverAfterPartitionTest.test-seed#[C50AEE012C6EB3D3]) [n:127.0.0.1:43811_ ] o.a.s.c.CorePropertiesLocator Found core collection1 in /x1/jenkins/jenkins-slave/workspace/Lucene-Solr-Tests-master/solr/build/solr-core/test/J1/temp/solr.cloud.LeaderFailoverAfterPartitionTest_C50AEE012C6EB3D3-001/control-001/cores/collection1
[junit4] 2> 42830 INFO (TEST-LeaderFailoverAfterPartitionTest.test-seed#[C50AEE012C6EB3D3]) [n:127.0.0.1:43811_ ] o.a.s.c.CorePropertiesLocator Found 1 core definitions
[junit4] 2> 42848 INFO (coreLoadExecutor-190-thread-1-processing-n:127.0.0.1:43811_) [n:127.0.0.1:43811_ c:control_collection x:collection1] o.a.s.c.ZkController publishing state=down
[junit4] 2> 42848 INFO (coreLoadExecutor-190-thread-1-processing-n:127.0.0.1:43811_) [n:127.0.0.1:43811_ c:control_collection x:collection1] o.a.s.c.ZkController numShards not found on descriptor - reading it from system property
[junit4] 2> 42848 INFO (TEST-LeaderFailoverAfterPartitionTest.test-seed#[C50AEE012C6EB3D3]) [n:127.0.0.1:43811_ ] o.a.s.s.SolrDispatchFilter user.dir=/x1/jenkins/jenkins-slave/workspace/Lucene-Solr-Tests-master/solr/build/solr-core/test/J1
[junit4] 2> 42848 INFO (TEST-LeaderFailoverAfterPartitionTest.test-seed#[C50AEE012C6EB3D3]) [n:127.0.0.1:43811_ ] o.a.s.s.SolrDispatchFilter SolrDispatchFilter.init() done
[junit4] 2> 42852 INFO (coreLoadExecutor-190-thread-1-processing-n:127.0.0.1:43811_) [n:127.0.0.1:43811_ c:control_collection x:collection1] o.a.s.c.ZkController Collection control_collection not visible yet, but flagging it so a watch is registered when it becomes visible
[junit4] 2> 42852 INFO (OverseerStateUpdate-96517907107610628-127.0.0.1:43811_-n_0000000000) [n:127.0.0.1:43811_ ] o.a.s.c.Overseer processMessage: queueSize: 1, message = {
[junit4] 2> "core":"collection1",
[junit4] 2> "roles":null,
[junit4] 2> "base_url":"http://127.0.0.1:43811",
[junit4] 2> "node_name":"127.0.0.1:43811_",
[junit4] 2> "numShards":"1",
[junit4] 2> "state":"down",
[junit4] 2> "shard":null,
[junit4] 2> "collection":"control_collection",
[junit4] 2> "operation":"state"} current state version: 0
[junit4] 2> 42860 INFO (coreLoadExecutor-190-thread-1-processing-n:127.0.0.1:43811_) [n:127.0.0.1:43811_ c:control_collection x:collection1] o.a.s.c.c.ZkStateReader Deleting data for [control_collection]
[junit4] 2> 42861 INFO (OverseerStateUpdate-96517907107610628-127.0.0.1:43811_-n_0000000000) [n:127.0.0.1:43811_ ] o.a.s.c.o.ReplicaMutator Update state numShards=1 message={
[junit4] 2> "core":"collection1",
[junit4] 2> "roles":null,
[junit4] 2> "base_url":"http://127.0.0.1:43811",
[junit4] 2> "node_name":"127.0.0.1:43811_",
[junit4] 2> "numShards":"1",
[junit4] 2> "state":"down",
[junit4] 2> "shard":null,
[junit4] 2> "collection":"control_collection",
[junit4] 2> "operation":"state"}
[junit4] 2> 42863 INFO (coreLoadExecutor-190-thread-1-processing-n:127.0.0.1:43811_) [n:127.0.0.1:43811_ c:control_collection x:collection1] o.a.s.c.ZkController look for our core node name
[junit4] 2> 42864 INFO (OverseerStateUpdate-96517907107610628-127.0.0.1:43811_-n_0000000000) [n:127.0.0.1:43811_ ] o.a.s.c.o.ClusterStateMutator building a new cName: control_collection
[junit4] 2> 42874 INFO (OverseerStateUpdate-96517907107610628-127.0.0.1:43811_-n_0000000000) [n:127.0.0.1:43811_ ] o.a.s.c.o.ReplicaMutator Assigning new node to shard shard=shard1
[junit4] 2> 42883 INFO (zkCallback-36-thread-1-processing-n:127.0.0.1:43811_) [n:127.0.0.1:43811_ ] o.a.s.c.c.ZkStateReader A cluster state change: [WatchedEvent state:SyncConnected type:NodeDataChanged path:/clusterstate.json], has occurred - updating... (live nodes size: [1])
[junit4] 2> 43864 INFO (coreLoadExecutor-190-thread-1-processing-n:127.0.0.1:43811_) [n:127.0.0.1:43811_ c:control_collection x:collection1] o.a.s.c.ZkController waiting to find shard id in clusterstate for collection1
[junit4] 2> 43864 INFO (coreLoadExecutor-190-thread-1-processing-n:127.0.0.1:43811_) [n:127.0.0.1:43811_ c:control_collection x:collection1] o.a.s.c.ZkController Check for collection zkNode:control_collection
[junit4] 2> 43865 INFO (coreLoadExecutor-190-thread-1-processing-n:127.0.0.1:43811_) [n:127.0.0.1:43811_ c:control_collection x:collection1] o.a.s.c.ZkController Collection zkNode exists
[junit4] 2> 43865 INFO (coreLoadExecutor-190-thread-1-processing-n:127.0.0.1:43811_) [n:127.0.0.1:43811_ c:control_collection x:collection1] o.a.s.c.c.ZkStateReader Load collection config from: [/collections/control_collection]
[junit4] 2> 43870 INFO (coreLoadExecutor-190-thread-1-processing-n:127.0.0.1:43811_) [n:127.0.0.1:43811_ c:control_collection x:collection1] o.a.s.c.c.ZkStateReader path=[/collections/control_collection] [configName]=[conf1] specified config exists in ZooKeeper
[junit4] 2> 43870 INFO (coreLoadExecutor-190-thread-1-processing-n:127.0.0.1:43811_) [n:127.0.0.1:43811_ c:control_collection x:collection1] o.a.s.c.SolrResourceLoader new SolrResourceLoader for directory: '/x1/jenkins/jenkins-slave/workspace/Lucene-Solr-Tests-master/solr/build/solr-core/test/J1/temp/solr.cloud.LeaderFailoverAfterPartitionTest_C50AEE012C6EB3D3-001/control-001/cores/collection1'
[junit4] 2> 43871 INFO (coreLoadExecutor-190-thread-1-processing-n:127.0.0.1:43811_) [n:127.0.0.1:43811_ c:control_collection x:collection1] o.a.s.c.SolrResourceLoader JNDI not configured for solr (NoInitialContextEx)
[junit4] 2> 43871 INFO (coreLoadExecutor-190-thread-1-processing-n:127.0.0.1:43811_) [n:127.0.0.1:43811_ c:control_collection x:collection1] o.a.s.c.SolrResourceLoader solr home defaulted to 'solr/' (could not find system property or JNDI)
[junit4] 2> 43873 INFO (coreLoadExecutor-190-thread-1-processing-n:127.0.0.1:43811_) [n:127.0.0.1:43811_ c:control_collection x:collection1] o.a.s.c.Config loaded config solrconfig.xml with version 0
[junit4] 2> 43885 INFO (coreLoadExecutor-190-thread-1-processing-n:127.0.0.1:43811_) [n:127.0.0.1:43811_ c:control_collection x:collection1] o.a.s.c.SolrConfig current version of requestparams : -1
[junit4] 2> 43889 INFO (coreLoadExecutor-190-thread-1-processing-n:127.0.0.1:43811_) [n:127.0.0.1:43811_ c:control_collection x:collection1] o.a.s.c.SolrConfig Using Lucene MatchVersion: 7.0.0
[junit4] 2> 43924 INFO (coreLoadExecutor-190-thread-1-processing-n:127.0.0.1:43811_) [n:127.0.0.1:43811_ c:control_collection x:collection1] o.a.s.c.SolrConfig Loaded SolrConfig: solrconfig.xml
[junit4] 2> 43954 INFO (coreLoadExecutor-190-thread-1-processing-n:127.0.0.1:43811_) [n:127.0.0.1:43811_ c:control_collection x:collection1] o.a.s.s.IndexSchema [collection1] Schema name=test
[junit4] 2> 44071 INFO (coreLoadExecutor-190-thread-1-processing-n:127.0.0.1:43811_) [n:127.0.0.1:43811_ c:control_collection x:collection1] o.a.s.s.OpenExchangeRatesOrgProvider Initialized with rates=open-exchange-rates.json, refreshInterval=1440.
[junit4] 2> 44078 INFO (coreLoadExecutor-190-thread-1-processing-n:127.0.0.1:43811_) [n:127.0.0.1:43811_ c:control_collection x:collection1] o.a.s.s.IndexSchema default search field in schema is text
[junit4] 2> 44079 INFO (coreLoadExecutor-190-thread-1-processing-n:127.0.0.1:43811_) [n:127.0.0.1:43811_ c:control_collection x:collection1] o.a.s.s.IndexSchema unique key field: id
[junit4] 2> 44095 INFO (coreLoadExecutor-190-thread-1-processing-n:127.0.0.1:43811_) [n:127.0.0.1:43811_ c:control_collection x:collection1] o.a.s.s.FileExchangeRateProvider Reloading exchange rates from file currency.xml
[junit4] 2> 44098 INFO (coreLoadExecutor-190-thread-1-processing-n:127.0.0.1:43811_) [n:127.0.0.1:43811_ c:control_collection x:collection1] o.a.s.s.FileExchangeRateProvider Reloading exchange rates from file currency.xml
[junit4] 2> 44101 INFO (coreLoadExecutor-190-thread-1-processing-n:127.0.0.1:43811_) [n:127.0.0.1:43811_ c:control_collection x:collection1] o.a.s.s.OpenExchangeRatesOrgProvider Reloading exchange rates from open-exchange-rates.json
[junit4] 2> 44102 INFO (coreLoadExecutor-190-thread-1-processing-n:127.0.0.1:43811_) [n:127.0.0.1:43811_ c:control_collection x:collection1] o.a.s.s.OpenExchangeRatesOrgProvider Reloading exchange rates from open-exchange-rates.json
[junit4] 2> 44104 INFO (coreLoadExecutor-190-thread-1-processing-n:127.0.0.1:43811_) [n:127.0.0.1:43811_ c:control_collection x:collection1] o.a.s.c.ConfigSetProperties Did not find ConfigSet properties, assuming default properties: Can't find resource 'configsetprops.json' in classpath or '/configs/conf1', cwd=/x1/jenkins/jenkins-slave/workspace/Lucene-Solr-Tests-master/solr/build/solr-core/test/J1
[junit4] 2> 44104 INFO (coreLoadExecutor-190-thread-1-processing-n:127.0.0.1:43811_) [n:127.0.0.1:43811_ c:control_collection x:collection1] o.a.s.c.CoreContainer Creating SolrCore 'collection1' using configuration from collection control_collection
[junit4] 2> 44104 INFO (coreLoadExecutor-190-thread-1-processing-n:127.0.0.1:43811_) [n:127.0.0.1:43811_ c:control_collection s:shard1 r:core_node1 x:collection1] o.a.s.c.SolrCore org.apache.solr.core.MockDirectoryFactory
[junit4] 2> 44105 INFO (coreLoadExecutor-190-thread-1-processing-n:127.0.0.1:43811_) [n:127.0.0.1:43811_ c:control_collection s:shard1 r:core_node1 x:collection1] o.a.s.c.SolrCore [[collection1] ] Opening new SolrCore at [/x1/jenkins/jenkins-slave/workspace/Lucene-Solr-Tests-master/solr/build/solr-core/test/J1/temp/solr.cloud.LeaderFailoverAfterPartitionTest_C50AEE012C6EB3D3-001/control-001/cores/collection1], dataDir=[/x1/jenkins/jenkins-slave/workspace/Lucene-Solr-Tests-master/solr/build/solr-core/test/J1/temp/solr.cloud.LeaderFailoverAfterPartitionTest_C50AEE012C6EB3D3-001/control-001/cores/collection1/data/]
[junit4] 2> 44105 INFO (coreLoadExecutor-190-thread-1-processing-n:127.0.0.1:43811_) [n:127.0.0.1:43811_ c:control_collection s:shard1 r:core_node1 x:collection1] o.a.s.c.JmxMonitoredMap JMX monitoring is enabled. Adding Solr mbeans to JMX Server: com.sun.jmx.mbeanserver.JmxMBeanServer@48ed7ad4
[junit4] 2> 44111 INFO (coreLoadExecutor-190-thread-1-processing-n:127.0.0.1:43811_) [n:127.0.0.1:43811_ c:control_collection s:shard1 r:core_node1 x:collection1] o.a.s.c.CachingDirectoryFactory return new directory for /x1/jenkins/jenkins-slave/workspace/Lucene-Solr-Tests-master/solr/build/solr-core/test/J1/temp/solr.cloud.LeaderFailoverAfterPartitionTest_C50AEE012C6EB3D3-001/control-001/cores/collection1/data/snapshot_metadata
[junit4] 2> 44111 INFO (coreLoadExecutor-190-thread-1-processing-n:127.0.0.1:43811_) [n:127.0.0.1:43811_ c:control_collection s:shard1 r:core_node1 x:collection1] o.a.s.c.s.SolrSnapshotMetaDataManager Loading from snapshot metadata file...
[junit4] 2> 44112 INFO (coreLoadExecutor-190-thread-1-processing-n:127.0.0.1:43811_) [n:127.0.0.1:43811_ c:control_collection s:shard1 r:core_node1 x:collection1] o.a.s.c.CachingDirectoryFactory return new directory for /x1/jenkins/jenkins-slave/workspace/Lucene-Solr-Tests-master/solr/build/solr-core/test/J1/temp/solr.cloud.LeaderFailoverAfterPartitionTest_C50AEE012C6EB3D3-001/control-001/cores/collection1/data
[junit4] 2> 44112 INFO (coreLoadExecutor-190-thread-1-processing-n:127.0.0.1:43811_) [n:127.0.0.1:43811_ c:control_collection s:shard1 r:core_node1 x:collection1] o.a.s.c.SolrCore New index directory detected: old=null new=/x1/jenkins/jenkins-slave/workspace/Lucene-Solr-Tests-master/solr/build/solr-core/test/J1/temp/solr.cloud.LeaderFailoverAfterPartitionTest_C50AEE012C6EB3D3-001/control-001/cores/collection1/data/index/
[junit4] 2> 44112 WARN (coreLoadExecutor-190-thread-1-processing-n:127.0.0.1:43811_) [n:127.0.0.1:43811_ c:control_collection s:shard1 r:core_node1 x:collection1] o.a.s.c.SolrCore [collection1] Solr index directory '/x1/jenkins/jenkins-slave/workspace/Lucene-Solr-Tests-master/solr/build/solr-core/test/J1/temp/solr.cloud.LeaderFailoverAfterPartitionTest_C50AEE012C6EB3D3-001/control-001/cores/collection1/data/index' doesn't exist. Creating new index...
[junit4] 2> 44112 INFO (coreLoadExecutor-190-thread-1-processing-n:127.0.0.1:43811_) [n:127.0.0.1:43811_ c:control_collection s:shard1 r:core_node1 x:collection1] o.a.s.c.CachingDirectoryFactory return new directory for /x1/jenkins/jenkins-slave/workspace/Lucene-Solr-Tests-master/solr/build/solr-core/test/J1/temp/solr.cloud.LeaderFailoverAfterPartitionTest_C50AEE012C6EB3D3-001/control-001/cores/collection1/data/index
[junit4] 2> 44112 INFO (coreLoadExecutor-190-thread-1-processing-n:127.0.0.1:43811_) [n:127.0.0.1:43811_ c:control_collection s:shard1 r:core_node1 x:collection1] o.a.s.u.RandomMergePolicy RandomMergePolicy wrapping class org.apache.lucene.index.TieredMergePolicy: [TieredMergePolicy: maxMergeAtOnce=12, maxMergeAtOnceExplicit=47, maxMergedSegmentMB=9.06640625, floorSegmentMB=1.9130859375, forceMergeDeletesPctAllowed=7.762843590452114, segmentsPerTier=50.0, maxCFSSegmentSizeMB=8.796093022207999E12, noCFSRatio=0.27496000588066877
[junit4] 2> 44113 INFO (coreLoadExecutor-190-thread-1-processing-n:127.0.0.1:43811_) [n:127.0.0.1:43811_ c:control_collection s:shard1 r:core_node1 x:collection1] o.a.s.c.SolrDeletionPolicy SolrDeletionPolicy.onCommit: commits: num=1
[junit4] 2> commit{dir=MockDirectoryWrapper(RAMDirectory@460359ce lockFactory=org.apache.lucene.store.SingleInstanceLockFactory@7c794d0a),segFN=segments_1,generation=1}
[junit4] 2> 44113 INFO (coreLoadExecutor-190-thread-1-processing-n:127.0.0.1:43811_) [n:127.0.0.1:43811_ c:control_collection s:shard1 r:core_node1 x:collection1] o.a.s.c.SolrDeletionPolicy newest commit generation = 1
[junit4] 2> 44113 INFO (OldIndexDirectoryCleanupThreadForCore-collection1) [n:127.0.0.1:43811_ c:control_collection s:shard1 r:core_node1 x:collection1] o.a.s.c.SolrCore Looking for old index directories to cleanup for core collection1 in /x1/jenkins/jenkins-slave/workspace/Lucene-Solr-Tests-master/solr/build/solr-core/test/J1/temp/solr.cloud.LeaderFailoverAfterPartitionTest_C50AEE012C6EB3D3-001/control-001/cores/collection1/data/
[junit4] 2> 44114 WARN (OldIndexDirectoryCleanupThreadForCore-collection1) [n:127.0.0.1:43811_ c:control_collection s:shard1 r:core_node1 x:collection1] o.a.s.c.DirectoryFactory /x1/jenkins/jenkins-slave/workspace/Lucene-Solr-Tests-master/solr/build/solr-core/test/J1/temp/solr.cloud.LeaderFailoverAfterPartitionTest_C50AEE012C6EB3D3-001/control-001/cores/collection1/data/ does not point to a valid data directory; skipping clean-up of old index directories.
[junit4] 2> 44124 INFO (coreLoadExecutor-190-thread-1-processing-n:127.0.0.1:43811_) [n:127.0.0.1:43811_ c:control_collection s:shard1 r:core_node1 x:collection1] o.a.s.u.p.UpdateRequestProcessorChain creating updateRequestProcessorChain "nodistrib"
[junit4] 2> 44135 INFO (coreLoadExecutor-190-thread-1-processing-n:127.0.0.1:43811_) [n:127.0.0.1:43811_ c:control_collection s:shard1 r:core_node1 x:collection1] o.a.s.u.p.UpdateRequestProcessorChain creating updateRequestProcessorChain "dedupe"
[junit4] 2> 44135 INFO (coreLoadExecutor-190-thread-1-processing-n:127.0.0.1:43811_) [n:127.0.0.1:43811_ c:control_collection s:shard1 r:core_node1 x:collection1] o.a.s.u.p.UpdateRequestProcessorChain inserting DistributedUpdateProcessorFactory into updateRequestProcessorChain "dedupe"
[junit4] 2> 44135 INFO (coreLoadExecutor-190-thread-1-processing-n:127.0.0.1:43811_) [n:127.0.0.1:43811_ c:control_collection s:shard1 r:core_node1 x:collection1] o.a.s.u.p.UpdateRequestProcessorChain creating updateRequestProcessorChain "stored_sig"
[junit4] 2> 44135 INFO (coreLoadExecutor-190-thread-1-processing-n:127.0.0.1:43811_) [n:127.0.0.1:43811_ c:control_collection s:shard1 r:core_node1 x:collection1] o.a.s.u.p.UpdateRequestProcessorChain inserting DistributedUpdateProcessorFactory into updateRequestProcessorChain "stored_sig"
[junit4] 2> 44135 INFO (coreLoadExecutor-190-thread-1-processing-n:127.0.0.1:43811_) [n:127.0.0.1:43811_ c:control_collection s:shard1 r:core_node1 x:collection1] o.a.s.u.p.UpdateRequestProcessorChain creating updateRequestProcessorChain "distrib-dup-test-chain-explicit"
[junit4] 2> 44136 INFO (coreLoadExecutor-190-thread-1-processing-n:127.0.0.1:43811_) [n:127.0.0.1:43811_ c:control_collection s:shard1 r:core_node1 x:collection1] o.a.s.u.p.UpdateRequestProcessorChain creating updateRequestProcessorChain "distrib-dup-test-chain-implicit"
[junit4] 2> 44136 INFO (coreLoadExecutor-190-thread-1-processing-n:127.0.0.1:43811_) [n:127.0.0.1:43811_ c:control_collection s:shard1 r:core_node1 x:collection1] o.a.s.u.p.UpdateRequestProcessorChain inserting DistributedUpdateProcessorFactory into updateRequestProcessorChain "distrib-dup-test-chain-implicit"
[junit4] 2> 44136 INFO (coreLoadExecutor-190-thread-1-processing-n:127.0.0.1:43811_) [n:127.0.0.1:43811_ c:control_collection s:shard1 r:core_node1 x:collection1] o.a.s.c.SolrCore no updateRequestProcessorChain defined as default, creating implicit default
[junit4] 2> 44136 WARN (coreLoadExecutor-190-thread-1-processing-n:127.0.0.1:43811_) [n:127.0.0.1:43811_ c:control_collection s:shard1 r:core_node1 x:collection1] o.a.s.c.RequestHandlers INVALID paramSet a in requestHandler {type = requestHandler,name = /dump,class = DumpRequestHandler,args = {defaults={a=A,b=B}}}
[junit4] 2> 44138 INFO (coreLoadExecutor-190-thread-1-processing-n:127.0.0.1:43811_) [n:127.0.0.1:43811_ c:control_collection s:shard1 r:core_node1 x:collection1] o.a.s.h.l.XMLLoader xsltCacheLifetimeSeconds=60
[junit4] 2> 44141 INFO (coreLoadExecutor-190-thread-1-processing-n:127.0.0.1:43811_) [n:127.0.0.1:43811_ c:control_collection s:shard1 r:core_node1 x:collection1] o.a.s.h.l.XMLLoader xsltCacheLifetimeSeconds=60
[junit4] 2> 44142 INFO (coreLoadExecutor-190-thread-1-processing-n:127.0.0.1:43811_) [n:127.0.0.1:43811_ c:control_collection s:shard1 r:core_node1 x:collection1] o.a.s.h.l.XMLLoader xsltCacheLifetimeSeconds=60
[junit4] 2> 44144 INFO (coreLoadExecutor-190-thread-1-processing-n:127.0.0.1:43811_) [n:127.0.0.1:43811_ c:control_collection s:shard1 r:core_node1 x:collection1] o.a.s.h.l.XMLLoader xsltCacheLifetimeSeconds=60
[junit4] 2> 44159 INFO (coreLoadExecutor-190-thread-1-processing-n:127.0.0.1:43811_) [n:127.0.0.1:43811_ c:control_collection s:shard1 r:core_node1 x:collection1] o.a.s.c.RequestHandlers Registered paths: /admin/mbeans,standard,/update/json/docs,/admin/luke,/export,/get,/admin/properties,/update/json,/admin/threads,/dump,/update/csv,/sql,/graph,/admin/segments,/admin/system,/replication,/config,/stream,/schema,/admin/plugins,/admin/logging,/admin/ping,/update,/admin/file,/terms
[junit4] 2> 44159 INFO (coreLoadExecutor-190-thread-1-processing-n:127.0.0.1:43811_) [n:127.0.0.1:43811_ c:control_collection s:shard1 r:core_node1 x:collection1] o.a.s.c.SolrCore Using default statsCache cache: org.apache.solr.search.stats.LocalStatsCache
[junit4] 2> 44159 INFO (coreLoadExecutor-190-thread-1-processing-n:127.0.0.1:43811_) [n:127.0.0.1:43811_ c:control_collection s:shard1 r:core_node1 x:collection1] o.a.s.u.UpdateHandler Using UpdateLog implementation: org.apache.solr.update.UpdateLog
[junit4] 2> 44159 INFO (coreLoadExecutor-190-thread-1-processing-n:127.0.0.1:43811_) [n:127.0.0.1:43811_ c:control_collection s:shard1 r:core_node1 x:collection1] o.a.s.u.UpdateLog Initializing UpdateLog: dataDir= defaultSyncLevel=FLUSH numRecordsToKeep=100 maxNumLogsToKeep=10 numVersionBuckets=65536
[junit4] 2> 44160 INFO (coreLoadExecutor-190-thread-1-processing-n:127.0.0.1:43811_) [n:127.0.0.1:43811_ c:control_collection s:shard1 r:core_node1 x:collection1] o.a.s.u.CommitTracker Hard AutoCommit: disabled
[junit4] 2> 44160 INFO (coreLoadExecutor-190-thread-1-processing-n:127.0.0.1:43811_) [n:127.0.0.1:43811_ c:control_collection s:shard1 r:core_node1 x:collection1] o.a.s.u.CommitTracker Soft AutoCommit: disabled
[junit4] 2> 44161 INFO (coreLoadExecutor-190-thread-1-processing-n:127.0.0.1:43811_) [n:127.0.0.1:43811_ c:control_collection s:shard1 r:core_node1 x:collection1] o.a.s.u.RandomMergePolicy RandomMergePolicy wrapping class org.apache.lucene.index.TieredMergePolicy: [TieredMergePolicy: maxMergeAtOnce=46, maxMergeAtOnceExplicit=29, maxMergedSegmentMB=27.8935546875, floorSegmentMB=0.2646484375, forceMergeDeletesPctAllowed=21.363613539811936, segmentsPerTier=12.0, maxCFSSegmentSizeMB=8.796093022207999E12, noCFSRatio=0.0
[junit4] 2> 44161 INFO (coreLoadExecutor-190-thread-1-processing-n:127.0.0.1:43811_) [n:127.0.0.1:43811_ c:control_collection s:shard1 r:core_node1 x:collection1] o.a.s.c.SolrDeletionPolicy SolrDeletionPolicy.onInit: commits: num=1
[junit4] 2> commit{dir=MockDirectoryWrapper(RAMDirectory@460359ce lockFactory=org.apache.lucene.store.SingleInstanceLockFactory@7c794d0a),segFN=segments_1,generation=1}
[junit4] 2> 44161 INFO (coreLoadExecutor-190-thread-1-processing-n:127.0.0.1:43811_) [n:127.0.0.1:43811_ c:control_collection s:shard1 r:core_node1 x:collection1] o.a.s.c.SolrDeletionPolicy newest commit generation = 1
[junit4] 2> 44162 INFO (coreLoadExecutor-190-thread-1-processing-n:127.0.0.1:43811_) [n:127.0.0.1:43811_ c:control_collection s:shard1 r:core_node1 x:collection1] o.a.s.s.SolrIndexSearcher Opening [Searcher@7473ba02[collection1] main]
[junit4] 2> 44162 INFO (coreLoadExecutor-190-thread-1-processing-n:127.0.0.1:43811_) [n:127.0.0.1:43811_ c:control_collection s:shard1 r:core_node1 x:collection1] o.a.s.c.c.ZkStateReader Load collection config from: [/collections/control_collection]
[junit4] 2> 44163 INFO (coreLoadExecutor-190-thread-1-processing-n:127.0.0.1:43811_) [n:127.0.0.1:43811_ c:control_collection s:shard1 r:core_node1 x:collection1] o.a.s.c.c.ZkStateReader path=[/collections/control_collection] [configName]=[conf1] specified config exists in ZooKeeper
[junit4] 2> 44163 INFO (coreLoadExecutor-190-thread-1-processing-n:127.0.0.1:43811_) [n:127.0.0.1:43811_ c:control_collection s:shard1 r:core_node1 x:collection1] o.a.s.r.ManagedResourceStorage Setting up ZooKeeper-based storage for the RestManager with znodeBase: /configs/conf1
[junit4] 2> 44166 INFO (coreLoadExecutor-190-thread-1-processing-n:127.0.0.1:43811_) [n:127.0.0.1:43811_ c:control_collection s:shard1 r:core_node1 x:collection1] o.a.s.r.ManagedResourceStorage Configured ZooKeeperStorageIO with znodeBase: /configs/conf1
[junit4] 2> 44166 INFO (coreLoadExecutor-190-thread-1-processing-n:127.0.0.1:43811_) [n:127.0.0.1:43811_ c:control_collection s:shard1 r:core_node1 x:collection1] o.a.s.r.RestManager Initializing RestManager with initArgs: {}
[junit4] 2> 44166 INFO (coreLoadExecutor-190-thread-1-processing-n:127.0.0.1:43811_) [n:127.0.0.1:43811_ c:control_collection s:shard1 r:core_node1 x:collection1] o.a.s.r.ManagedResourceStorage Reading _rest_managed.json using ZooKeeperStorageIO:path=/configs/conf1
[junit4] 2> 44167 INFO (coreLoadExecutor-190-thread-1-processing-n:127.0.0.1:43811_) [n:127.0.0.1:43811_ c:control_collection s:shard1 r:core_node1 x:collection1] o.a.s.r.ManagedResourceStorage No data found for znode /configs/conf1/_rest_managed.json
[junit4] 2> 44167 INFO (coreLoadExecutor-190-thread-1-processing-n:127.0.0.1:43811_) [n:127.0.0.1:43811_ c:control_collection s:shard1 r:core_node1 x:collection1] o.a.s.r.ManagedResourceStorage Loaded null at path _rest_managed.json using ZooKeeperStorageIO:path=/configs/conf1
[junit4] 2> 44167 INFO (coreLoadExecutor-190-thread-1-processing-n:127.0.0.1:43811_) [n:127.0.0.1:43811_ c:control_collection s:shard1 r:core_node1 x:collection1] o.a.s.r.RestManager Initializing 0 registered ManagedResources
[junit4] 2> 44167 INFO (coreLoadExecutor-190-thread-1-processing-n:127.0.0.1:43811_) [n:127.0.0.1:43811_ c:control_collection s:shard1 r:core_node1 x:collection1] o.a.s.h.ReplicationHandler Commits will be reserved for 10000
[junit4] 2> 44168 INFO (coreLoadExecutor-190-thread-1-processing-n:127.0.0.1:43811_) [n:127.0.0.1:43811_ c:control_collection s:shard1 r:core_node1 x:collection1] o.a.s.u.UpdateLog Looking up max value of version field to seed version buckets
[junit4] 2> 44168 INFO (coreLoadExecutor-190-thread-1-processing-n:127.0.0.1:43811_) [n:127.0.0.1:43811_ c:control_collection s:shard1 r:core_node1 x:collection1] o.a.s.u.VersionInfo Refreshing highest value of _version_ for 65536 version buckets from index
[junit4] 2> 44168 INFO (coreLoadExecutor-190-thread-1-processing-n:127.0.0.1:43811_) [n:127.0.0.1:43811_ c:control_collection s:shard1 r:core_node1 x:collection1] o.a.s.u.VersionInfo No terms found for _version_, cannot seed version bucket highest value from index
[junit4] 2> 44168 INFO (coreLoadExecutor-190-thread-1-processing-n:127.0.0.1:43811_) [n:127.0.0.1:43811_ c:control_collection s:shard1 r:core_node1 x:collection1] o.a.s.u.UpdateLog Could not find max version in index or recent updates, using new clock 1544286517860499456
[junit4] 2> 44169 INFO (coreLoadExecutor-190-thread-1-processing-n:127.0.0.1:43811_) [n:127.0.0.1:43811_ c:control_collection s:shard1 r:core_node1 x:collection1] o.a.s.u.UpdateLog Took 1.0ms to seed version buckets with highest version 1544286517860499456
[junit4] 2> 44170 INFO (coreLoadExecutor-190-thread-1-processing-n:127.0.0.1:43811_) [n:127.0.0.1:43811_ c:control_collection s:shard1 r:core_node1 x:collection1] o.a.s.c.ZkController watch zkdir /configs/conf1
[junit4] 2> 44175 INFO (searcherExecutor-191-thread-1-processing-n:127.0.0.1:43811_ x:collection1 s:shard1 c:control_collection r:core_node1) [n:127.0.0.1:43811_ c:control_collection s:shard1 r:core_node1 x:collection1] o.a.s.c.SolrCore [collection1] Registered new searcher Searcher@7473ba02[collection1] main{ExitableDirectoryReader(UninvertingDirectoryReader())}
[junit4] 2> 44176 INFO (coreLoadExecutor-190-thread-1-processing-n:127.0.0.1:43811_) [n:127.0.0.1:43811_ c:control_collection s:shard1 r:core_node1 x:collection1] o.a.s.c.CoreContainer registering core: collection1
[junit4] 2> 44179 INFO (coreZkRegister-183-thread-1-processing-n:127.0.0.1:43811_ x:collection1 s:shard1 c:control_collection r:core_node1) [n:127.0.0.1:43811_ c:control_collection s:shard1 r:core_node1 x:collection1] o.a.s.c.ZkController Register replica - core:collection1 address:http://127.0.0.1:43811 collection:control_collection shard:shard1
[junit4] 2> 44187 INFO (coreZkRegister-183-thread-1-processing-n:127.0.0.1:43811_ x:collection1 s:shard1 c:control_collection r:core_node1) [n:127.0.0.1:43811_ c:control_collection s:shard1 r:core_node1 x:collection1] o.a.s.c.c.SolrZkClient makePath: /collections/control_collection/leader_elect/shard1/election
[junit4] 2> 44207 INFO (coreZkRegister-183-thread-1-processing-n:127.0.0.1:43811_ x:collection1 s:shard1 c:control_collection r:core_node1) [n:127.0.0.1:43811_ c:control_collection s:shard1 r:core_node1 x:collection1] o.a.s.c.LeaderElector Joined leadership election with path: /collections/control_collection/leader_elect/shard1/election/96517907107610628-core_node1-n_0000000000
[junit4] 2> 44208 INFO (coreZkRegister-183-thread-1-processing-n:127.0.0.1:43811_ x:collection1 s:shard1 c:control_collection r:core_node1) [n:127.0.0.1:43811_ c:control_collection s:shard1 r:core_node1 x:collection1] o.a.s.c.ShardLeaderElectionContext Running the leader process for shard=shard1 and weAreReplacement=false and leaderVoteWait=10000
[junit4] 2> 44211 INFO (coreZkRegister-183-thread-1-processing-n:127.0.0.1:43811_ x:collection1 s:shard1 c:control_collection r:core_node1) [n:127.0.0.1:43811_ c:control_collection s:shard1 r:core_node1 x:collection1] o.a.s.c.ShardLeaderElectionContext Enough replicas found to continue.
[junit4] 2> 44211 INFO (coreZkRegister-183-thread-1-processing-n:127.0.0.1:43811_ x:collection1 s:shard1 c:control_collection r:core_node1) [n:127.0.0.1:43811_ c:control_collection s:shard1 r:core_node1 x:collection1] o.a.s.c.ShardLeaderElectionContext I may be the new leader - try and sync
[junit4] 2> 44212 INFO (OverseerStateUpdate-96517907107610628-127.0.0.1:43811_-n_0000000000) [n:127.0.0.1:43811_ ] o.a.s.c.Overseer processMessage: queueSize: 1, message = {
[junit4] 2> "operation":"leader",
[junit4] 2> "shard":"shard1",
[junit4] 2> "collection":"control_collection"} current state version: 1
[junit4] 2> 44213 INFO (coreZkRegister-183-thread-1-processing-n:127.0.0.1:43811_ x:collection1 s:shard1 c:control_collection r:core_node1) [n:127.0.0.1:43811_ c:control_collection s:shard1 r:core_node1 x:collection1] o.a.s.c.SyncStrategy Sync replicas to http://127.0.0.1:43811/collection1/
[junit4] 2> 44213 INFO (coreZkRegister-183-thread-1-processing-n:127.0.0.1:43811_ x:collection1 s:shard1 c:control_collection r:core_node1) [n:127.0.0.1:43811_ c:control_collection s:shard1 r:core_node1 x:collection1] o.a.s.c.SyncStrategy Sync Success - now sync replicas to me
[junit4] 2> 44213 INFO (coreZkRegister-183-thread-1-processing-n:127.0.0.1:43811_ x:collection1 s:shard1 c:control_collection r:core_node1) [n:127.0.0.1:43811_ c:control_collection s:shard1 r:core_node1 x:collection1] o.a.s.c.SyncStrategy http://127.0.0.1:43811/collection1/ has no replicas
[junit4] 2> 44219 INFO (coreZkRegister-183-thread-1-processing-n:127.0.0.1:43811_ x:collection1 s:shard1 c:control_collection r:core_node1) [n:127.0.0.1:43811_ c:control_collection s:shard1 r:core_node1 x:collection1] o.a.s.c.c.SolrZkClient makePath: /collections/control_collection/leaders/shard1
[junit4] 2> 44247 INFO (coreZkRegister-183-thread-1-processing-n:127.0.0.1:43811_ x:collection1 s:shard1 c:control_collection r:core_node1) [n:127.0.0.1:43811_ c:control_collection s:shard1 r:core_node1 x:collection1] o.a.s.c.ShardLeaderElectionContextBase Creating leader registration node /collections/control_collection/leaders/shard1/leader after winning as /collections/control_collection/leader_elect/shard1/election/96517907107610628-core_node1-n_0000000000
[junit4] 2> 44264 INFO (coreZkRegister-183-thread-1-processing-n:127.0.0.1:43811_ x:collection1 s:shard1 c:control_collection r:core_node1) [n:127.0.0.1:43811_ c:control_collection s:shard1 r:core_node1 x:collection1] o.a.s.c.ShardLeaderElectionContext I am the new leader: http://127.0.0.1:43811/collection1/ shard1
[junit4] 2> 44265 INFO (OverseerStateUpdate-96517907107610628-127.0.0.1:43811_-n_0000000000) [n:127.0.0.1:43811_ ] o.a.s.c.Overseer processMessage: queueSize: 1, message = {
[junit4] 2> "operation":"leader",
[junit4] 2> "shard":"shard1",
[junit4] 2> "collection":"control_collection",
[junit4] 2> "base_url":"http://127.0.0.1:43811",
[junit4] 2> "core":"collection1",
[junit4] 2> "state":"active"} current state version: 1
[junit4] 2> 44362 INFO (TEST-LeaderFailoverAfterPartitionTest.test-seed#[C50AEE012C6EB3D3]) [ ] o.a.s.c.c.SolrZkClient Using default ZkCredentialsProvider
[junit4] 2> 44363 INFO (TEST-LeaderFailoverAfterPartitionTest.test-seed#[C50AEE012C6EB3D3]) [ ] o.a.s.c.c.ConnectionManager Waiting for client to connect to ZooKeeper
[junit4] 2> 44365 INFO (zkCallback-40-thread-1) [ ] o.a.s.c.c.ConnectionManager Watcher org.apache.solr.common.cloud.ConnectionManager@629a0c1 name:ZooKeeperConnection Watcher:127.0.0.1:35683/solr got event WatchedEvent state:SyncConnected type:None path:null path:null type:None
[junit4] 2> 44365 INFO (TEST-LeaderFailoverAfterPartitionTest.test-seed#[C50AEE012C6EB3D3]) [ ] o.a.s.c.c.ConnectionManager Client is connected to ZooKeeper
[junit4] 2> 44365 INFO (TEST-LeaderFailoverAfterPartitionTest.test-seed#[C50AEE012C6EB3D3]) [ ] o.a.s.c.c.SolrZkClient Using default ZkACLProvider
[junit4] 2> 44365 INFO (TEST-LeaderFailoverAfterPartitionTest.test-seed#[C50AEE012C6EB3D3]) [ ] o.a.s.c.c.ZkStateReader Updating cluster state from ZooKeeper...
[junit4] 2> 44366 INFO (TEST-LeaderFailoverAfterPartitionTest.test-seed#[C50AEE012C6EB3D3]) [ ] o.a.s.c.c.ZkStateReader Loaded empty cluster properties
[junit4] 2> 44367 INFO (TEST-LeaderFailoverAfterPartitionTest.test-seed#[C50AEE012C6EB3D3]) [ ] o.a.s.c.c.ZkStateReader Updated live nodes from ZooKeeper... (0) -> (1)
[junit4] 2> 44371 INFO (TEST-LeaderFailoverAfterPartitionTest.test-seed#[C50AEE012C6EB3D3]) [ ] o.a.s.c.ChaosMonkey monkey: init - expire sessions:false cause connection loss:false
[junit4] 2> 44371 INFO (TEST-LeaderFailoverAfterPartitionTest.test-seed#[C50AEE012C6EB3D3]) [ ] o.a.s.c.AbstractFullDistribZkTestBase Creating collection1 with stateFormat=2
[junit4] 2> 44371 INFO (TEST-LeaderFailoverAfterPartitionTest.test-seed#[C50AEE012C6EB3D3]) [ ] o.a.s.c.c.SolrZkClient Using default ZkCredentialsProvider
[junit4] 2> 44373 INFO (TEST-LeaderFailoverAfterPartitionTest.test-seed#[C50AEE012C6EB3D3]) [ ] o.a.s.c.c.ConnectionManager Waiting for client to connect to ZooKeeper
[junit4] 2> 44376 INFO (zkCallback-36-thread-1-processing-n:127.0.0.1:43811_) [n:127.0.0.1:43811_ ] o.a.s.c.c.ZkStateReader A cluster state change: [WatchedEvent state:SyncConnected type:NodeDataChanged path:/clusterstate.json], has occurred - updating... (live nodes size: [1])
[junit4] 2> 44377 INFO (zkCallback-40-thread-1) [ ] o.a.s.c.c.ZkStateReader A cluster state change: [WatchedEvent state:SyncConnected type:NodeDataChanged path:/clusterstate.json], has occurred - updating... (live nodes size: [1])
[junit4] 2> 44380 INFO (zkCallback-41-thread-1) [ ] o.a.s.c.c.ConnectionManager Watcher org.apache.solr.common.cloud.ConnectionManager@55642a2a name:ZooKeeperConnection Watcher:127.0.0.1:35683/solr got event WatchedEvent state:SyncConnected type:None path:null path:null type:None
[junit4] 2> 44380 INFO (TEST-LeaderFailoverAfterPartitionTest.test-seed#[C50AEE012C6EB3D3]) [ ] o.a.s.c.c.ConnectionManager Client is connected to ZooKeeper
[junit4] 2> 44380 INFO (TEST-LeaderFailoverAfterPartitionTest.test-seed#[C50AEE012C6EB3D3]) [ ] o.a.s.c.c.SolrZkClient Using default ZkACLProvider
[junit4] 2> 44384 WARN (NIOServerCxn.Factory:0.0.0.0/0.0.0.0:0) [ ] o.a.z.s.NIOServerCnxn caught end of stream exception
[junit4] 2> EndOfStreamException: Unable to read additional data from client sessionid 0x156e6866f9d0006, likely client has closed socket
[junit4] 2> at org.apache.zookeeper.server.NIOServerCnxn.doIO(NIOServerCnxn.java:228)
[junit4] 2> at org.apache.zookeeper.server.NIOServerCnxnFactory.run(NIOServerCnxnFactory.java:208)
[junit4] 2> at java.lang.Thread.run(Thread.java:745)
[junit4] 2> 44393 INFO (OverseerStateUpdate-96517907107610628-127.0.0.1:43811_-n_0000000000) [n:127.0.0.1:43811_ ] o.a.s.c.Overseer processMessage: queueSize: 1, message = {
[junit4] 2> "operation":"create",
[junit4] 2> "name":"collection1",
[junit4] 2> "numShards":"2",
[junit4] 2> "stateFormat":"2"} current state version: 2
[junit4] 2> 44393 INFO (OverseerStateUpdate-96517907107610628-127.0.0.1:43811_-n_0000000000) [n:127.0.0.1:43811_ ] o.a.s.c.o.ClusterStateMutator building a new cName: collection1
[junit4] 2> 44416 INFO (coreZkRegister-183-thread-1-processing-n:127.0.0.1:43811_ x:collection1 s:shard1 c:control_collection r:core_node1) [n:127.0.0.1:43811_ c:control_collection s:shard1 r:core_node1 x:collection1] o.a.s.c.ZkController We are http://127.0.0.1:43811/collection1/ and leader is http://127.0.0.1:43811/collection1/
[junit4] 2> 44416 INFO (coreZkRegister-183-thread-1-processing-n:127.0.0.1:43811_ x:collection1 s:shard1 c:control_collection r:core_node1) [n:127.0.0.1:43811_ c:control_collection s:shard1 r:core_node1 x:collection1] o.a.s.c.ZkController No LogReplay needed for core=collection1 baseURL=http://127.0.0.1:43811
[junit4] 2> 44416 INFO (coreZkRegister-183-thread-1-processing-n:127.0.0.1:43811_ x:collection1 s:shard1 c:control_collection r:core_node1) [n:127.0.0.1:43811_ c:control_collection s:shard1 r:core_node1 x:collection1] o.a.s.c.ZkController I am the leader, no recovery necessary
[junit4] 2> 44416 INFO (coreZkRegister-183-thread-1-processing-n:127.0.0.1:43811_ x:collection1 s:shard1 c:control_collection r:core_node1) [n:127.0.0.1:43811_ c:control_collection s:shard1 r:core_node1 x:collection1] o.a.s.c.ZkController publishing state=active
[junit4] 2> 44416 INFO (coreZkRegister-183-thread-1-processing-n:127.0.0.1:43811_ x:collection1 s:shard1 c:control_collection r:core_node1) [n:127.0.0.1:43811_ c:control_collection s:shard1 r:core_node1 x:collection1] o.a.s.c.ZkController numShards not found on descriptor - reading it from system property
[junit4] 2> 44417 INFO (coreZkRegister-183-thread-1-processing-n:127.0.0.1:43811_ x:collection1 s:shard1 c:control_collection r:core_node1) [n:127.0.0.1:43811_ c:control_collection s:shard1 r:core_node1 x:collection1] o.a.s.c.c.ZkStateReader Checking legacy cluster state for collection control_collection
[junit4] 2> 44419 INFO (OverseerStateUpdate-96517907107610628-127.0.0.1:43811_-n_0000000000) [n:127.0.0.1:43811_ ] o.a.s.c.Overseer processMessage: queueSize: 1, message = {
[junit4] 2> "core":"collection1",
[junit4] 2> "core_node_name":"core_node1",
[junit4] 2> "roles":null,
[junit4] 2> "base_url":"http://127.0.0.1:43811",
[junit4] 2> "node_name":"127.0.0.1:43811_",
[junit4] 2> "numShards":"2",
[junit4] 2> "state":"active",
[junit4] 2> "shard":"shard1",
[junit4] 2> "collection":"control_collection",
[junit4] 2> "operation":"state"} current state version: 2
[junit4] 2> 44419 INFO (OverseerStateUpdate-96517907107610628-127.0.0.1:43811_-n_0000000000) [n:127.0.0.1:43811_ ] o.a.s.c.o.ReplicaMutator Update state numShards=2 message={
[junit4] 2> "core":"collection1",
[junit4] 2> "core_node_name":"core_node1",
[junit4] 2> "roles":null,
[junit4] 2> "base_url":"http://127.0.0.1:43811",
[junit4] 2> "node_name":"127.0.0.1:43811_",
[junit4] 2> "numShards":"2",
[junit4] 2> "state":"active",
[junit4] 2> "shard":"shard1",
[junit4] 2> "collection":"control_collection",
[junit4] 2> "operation":"state"}
[junit4] 2> 44420 INFO (OverseerStateUpdate-96517907107610628-127.0.0.1:43811_-n_0000000000) [n:127.0.0.1:43811_ ] o.a.s.c.o.ZkStateWriter going to create_collection /collections/collection1/state.json
[junit4] 2> 44494 INFO (TEST-LeaderFailoverAfterPartitionTest.test-seed#[C50AEE012C6EB3D3]) [ ] o.a.s.SolrTestCaseJ4 Writing core.properties file to /x1/jenkins/jenkins-slave/workspace/Lucene-Solr-Tests-master/solr/build/solr-core/test/J1/temp/solr.cloud.LeaderFailoverAfterPartitionTest_C50AEE012C6EB3D3-001/shard-1-001/cores/collection1
[junit4] 2> 44495 INFO (TEST-LeaderFailoverAfterPartitionTest.test-seed#[C50AEE012C6EB3D3]) [ ] o.a.s.c.AbstractFullDistribZkTestBase create jetty 1 in directory /x1/jenkins/jenkins-slave/workspace/Lucene-Solr-Tests-master/solr/build/solr-core/test/J1/temp/solr.cloud.LeaderFailoverAfterPartitionTest_C50AEE012C6EB3D3-001/shard-1-001
[junit4] 2> 44495 INFO (TEST-LeaderFailoverAfterPartitionTest.test-seed#[C50AEE012C6EB3D3]) [ ] o.e.j.s.Server jetty-9.3.8.v20160314
[junit4] 2> 44497 INFO (TEST-LeaderFailoverAfterPartitionTest.test-seed#[C50AEE012C6EB3D3]) [ ] o.e.j.s.h.ContextHandler Started o.e.j.s.ServletContextHandler@1e598b7a{/,null,AVAILABLE}
[junit4] 2> 44498 INFO (TEST-LeaderFailoverAfterPartitionTest.test-seed#[C50AEE012C6EB3D3]) [ ] o.e.j.s.ServerConnector Started ServerConnector@330fc2b2{HTTP/1.1,[http/1.1]}{127.0.0.1:60511}
[junit4] 2> 44498 INFO (TEST-LeaderFailoverAfterPartitionTest.test-seed#[C50AEE012C6EB3D3]) [ ] o.e.j.s.Server Started @49814ms
[junit4] 2> 44498 INFO (TEST-LeaderFailoverAfterPartitionTest.test-seed#[C50AEE012C6EB3D3]) [ ] o.a.s.c.s.e.JettySolrRunner Jetty properties: {solr.data.dir=/x1/jenkins/jenkins-slave/workspace/Lucene-Solr-Tests-master/solr/build/solr-core/test/J1/temp/solr.cloud.LeaderFailoverAfterPartitionTest_C50AEE012C6EB3D3-001/tempDir-001/jetty1, solrconfig=solrconfig.xml, hostContext=/, hostPort=35979, coreRootDirectory=/x1/jenkins/jenkins-slave/workspace/Lucene-Solr-Tests-master/solr/build/solr-core/test/J1/temp/solr.cloud.LeaderFailoverAfterPartitionTest_C50AEE012C6EB3D3-001/shard-1-001/cores}
[junit4] 2> 44499 INFO (TEST-LeaderFailoverAfterPartitionTest.test-seed#[C50AEE012C6EB3D3]) [ ] o.a.s.s.SolrDispatchFilter SolrDispatchFilter.init(): sun.misc.Launcher$AppClassLoader@73d16e93
[junit4] 2> 44499 INFO (TEST-LeaderFailoverAfterPartitionTest.test-seed#[C50AEE012C6EB3D3]) [ ] o.a.s.c.SolrResourceLoader new SolrResourceLoader for directory: '/x1/jenkins/jenkins-slave/workspace/Lucene-Solr-Tests-master/solr/build/solr-core/test/J1/temp/solr.cloud.LeaderFailoverAfterPartitionTest_C50AEE012C6EB3D3-001/shard-1-001'
[junit4] 2> 44499 INFO (TEST-LeaderFailoverAfterPartitionTest.test-seed#[C50AEE012C6EB3D3]) [ ] o.a.s.c.SolrResourceLoader JNDI not configured for solr (NoInitialContextEx)
[junit4] 2> 44499 INFO (TEST-LeaderFailoverAfterPartitionTest.test-seed#[C50AEE012C6EB3D3]) [ ] o.a.s.c.SolrResourceLoader solr home defaulted to 'solr/' (could not find system property or JNDI)
[junit4] 2> 44499 INFO (TEST-LeaderFailoverAfterPartitionTest.test-seed#[C50AEE012C6EB3D3]) [ ] o.a.s.c.c.SolrZkClient Using default ZkCredentialsProvider
[junit4] 2> 44500 INFO (TEST-LeaderFailoverAfterPartitionTest.test-seed#[C50AEE012C6EB3D3]) [ ] o.a.s.c.c.ConnectionManager Waiting for client to connect to ZooKeeper
[junit4] 2> 44501 INFO (zkCallback-42-thread-1) [ ] o.a.s.c.c.ConnectionManager Watcher org.apache.solr.common.cloud.ConnectionManager@5d70fc6f name:ZooKeeperConnection Watcher:127.0.0.1:35683/solr got event WatchedEvent state:SyncConnected type:None path:null path:null type:None
[junit4] 2> 44502 INFO (TEST-LeaderFailoverAfterPartitionTest.test-seed#[C50AEE012C6EB3D3]) [ ] o.a.s.c.c.ConnectionManager Client is connected to ZooKeeper
[junit4] 2> 44502 INFO (TEST-LeaderFailoverAfterPartitionTest.test-seed#[C50AEE012C6EB3D3]) [ ] o.a.s.c.c.SolrZkClient Using default ZkACLProvider
[junit4] 2> 44504 INFO (TEST-LeaderFailoverAfterPartitionTest.test-seed#[C50AEE012C6EB3D3]) [ ] o.a.s.s.SolrDispatchFilter Loading solr.xml from SolrHome (not found in ZooKeeper)
[junit4] 2> 44504 INFO (TEST-LeaderFailoverAfterPartitionTest.test-seed#[C50AEE012C6EB3D3]) [ ] o.a.s.c.SolrXmlConfig Loading container configuration from /x1/jenkins/jenkins-slave/workspace/Lucene-Solr-Tests-master/solr/build/solr-core/test/J1/temp/solr.cloud.LeaderFailoverAfterPartitionTest_C50AEE012C6EB3D3-001/shard-1-001/solr.xml
[junit4] 2> 44509 INFO (TEST-LeaderFailoverAfterPartitionTest.test-seed#[C50AEE012C6EB3D3]) [ ] o.a.s.c.CorePropertiesLocator Config-defined core root directory: /x1/jenkins/jenkins-slave/workspace/Lucene-Solr-Tests-master/solr/build/solr-core/test/J1/temp/solr.cloud.LeaderFailoverAfterPartitionTest_C50AEE012C6EB3D3-001/shard-1-001/cores
[junit4] 2> 44509 INFO (TEST-LeaderFailoverAfterPartitionTest.test-seed#[C50AEE012C6EB3D3]) [ ] o.a.s.c.CoreContainer New CoreContainer 710429759
[junit4] 2> 44509 INFO (TEST-LeaderFailoverAfterPartitionTest.test-seed#[C50AEE012C6EB3D3]) [ ] o.a.s.c.CoreContainer Loading cores into CoreContainer [instanceDir=/x1/jenkins/jenkins-slave/workspace/Lucene-Solr-Tests-master/solr/build/solr-core/test/J1/temp/solr.cloud.LeaderFailoverAfterPartitionTest_C50AEE012C6EB3D3-001/shard-1-001]
[junit4] 2> 44510 WARN (TEST-LeaderFailoverAfterPartitionTest.test-seed#[C50AEE012C6EB3D3]) [ ] o.a.s.c.CoreContainer Couldn't add files from /x1/jenkins/jenkins-slave/workspace/Lucene-Solr-Tests-master/solr/build/solr-core/test/J1/temp/solr.cloud.LeaderFailoverAfterPartitionTest_C50AEE012C6EB3D3-001/shard-1-001/lib to classpath: /x1/jenkins/jenkins-slave/workspace/Lucene-Solr-Tests-master/solr/build/solr-core/test/J1/temp/solr.cloud.LeaderFailoverAfterPartitionTest_C50AEE012C6EB3D3-001/shard-1-001/lib
[junit4] 2> 44510 INFO (TEST-LeaderFailoverAfterPartitionTest.test-seed#[C50AEE012C6EB3D3]) [ ] o.a.s.h.c.HttpShardHandlerFactory created with socketTimeout : 90000,urlScheme : ,connTimeout : 15000,maxConnectionsPerHost : 20,maxConnections : 10000,corePoolSize : 0,maximumPoolSize : 2147483647,maxThreadIdleTime : 5,sizeOfQueue : -1,fairnessPolicy : false,
[junit4] 2> 44512 INFO (TEST-LeaderFailoverAfterPartitionTest.test-seed#[C50AEE012C6EB3D3]) [ ] o.a.s.u.UpdateShardHandler Created UpdateShardHandler HTTP client with params: socketTimeout=340000&connTimeout=45000&maxConnections=100000&maxConnectionsPerHost=100000
[junit4] 2> 44512 INFO (TEST-LeaderFailoverAfterPartitionTest.test-seed#[C50AEE012C6EB3D3]) [ ] o.a.s.l.LogWatcher SLF4J impl is org.slf4j.impl.Log4jLoggerFactory
[junit4] 2> 44512 INFO (TEST-LeaderFailoverAfterPartitionTest.test-seed#[C50AEE012C6EB3D3]) [ ] o.a.s.l.LogWatcher Registering Log Listener [Log4j (org.slf4j.impl.Log4jLoggerFactory)]
[junit4] 2> 44513 INFO (TEST-LeaderFailoverAfterPartitionTest.test-seed#[C50AEE012C6EB3D3]) [ ] o.a.s.c.ZkContainer Zookeeper client=127.0.0.1:35683/solr
[junit4] 2> 44513 INFO (TEST-LeaderFailoverAfterPartitionTest.test-seed#[C50AEE012C6EB3D3]) [ ] o.a.s.c.ZkController zkHost includes chroot
[junit4] 2> 44513 INFO (TEST-LeaderFailoverAfterPartitionTest.test-seed#[C50AEE012C6EB3D3]) [ ] o.a.s.c.c.SolrZkClient Using default ZkCredentialsProvider
[junit4] 2> 44513 INFO (TEST-LeaderFailoverAfterPartitionTest.test-seed#[C50AEE012C6EB3D3]) [ ] o.a.s.c.c.ConnectionManager Waiting for client to connect to ZooKeeper
[junit4] 2> 44515 INFO (zkCallback-45-thread-1) [ ] o.a.s.c.c.ConnectionManager Watcher org.apache.solr.common.cloud.ConnectionManager@259c46c1 name:ZooKeeperConnection Watcher:127.0.0.1:35683 got event WatchedEvent state:SyncConnected type:None path:null path:null type:None
[junit4] 2> 44515 INFO (TEST-LeaderFailoverAfterPartitionTest.test-seed#[C50AEE012C6EB3D3]) [ ] o.a.s.c.c.ConnectionManager Client is connected to ZooKeeper
[junit4] 2> 44516 INFO (TEST-LeaderFailoverAfterPartitionTest.test-seed#[C50AEE012C6EB3D3]) [ ] o.a.s.c.c.SolrZkClient Using default ZkACLProvider
[junit4] 2> 44517 INFO (TEST-LeaderFailoverAfterPartitionTest.test-seed#[C50AEE012C6EB3D3]) [n:127.0.0.1:35979_ ] o.a.s.c.ZkController Added new OnReconnect listener org.apache.solr.cloud.ZkController$$Lambda$96/1407113393@39ede6ac
[junit4] 2> 44522 INFO (TEST-LeaderFailoverAfterPartitionTest.test-seed#[C50AEE012C6EB3D3]) [n:127.0.0.1:35979_ ] o.a.s.c.c.ConnectionManager Waiting for client to connect to ZooKeeper
[junit4] 2> 44525 INFO (zkCallback-46-thread-1-processing-n:127.0.0.1:35979_) [n:127.0.0.1:35979_ ] o.a.s.c.c.ConnectionManager Watcher org.apache.solr.common.cloud.ConnectionManager@3b23e8ad name:ZooKeeperConnection Watcher:127.0.0.1:35683/solr got event WatchedEvent state:SyncConnected type:None path:null path:null type:None
[junit4] 2> 44525 INFO (TEST-LeaderFailoverAfterPartitionTest.test-seed#[C50AEE012C6EB3D3]) [n:127.0.0.1:35979_ ] o.a.s.c.c.ConnectionManager Client is connected to ZooKeeper
[junit4] 2> 44536 INFO (zkCallback-36-thread-3-processing-n:127.0.0.1:43811_) [n:127.0.0.1:43811_ ] o.a.s.c.c.ZkStateReader A cluster state change: [WatchedEvent state:SyncConnected type:NodeDataChanged path:/clusterstate.json], has occurred - updating... (live nodes size: [1])
[junit4] 2> 44536 INFO (zkCallback-40-thread-1) [ ] o.a.s.c.c.ZkStateReader A cluster state change: [WatchedEvent state:SyncConnected type:NodeDataChanged path:/clusterstate.json], has occurred - updating... (live nodes size: [1])
[junit4] 2> 44542 INFO (TEST-LeaderFailoverAfterPartitionTest.test-seed#[C50AEE012C6EB3D3]) [n:127.0.0.1:35979_ ] o.a.s.c.c.ZkStateReader Updating cluster state from ZooKeeper...
[junit4] 2> 44542 INFO (TEST-LeaderFailoverAfterPartitionTest.test-seed#[C50AEE012C6EB3D3]) [n:127.0.0.1:35979_ ] o.a.s.c.c.ZkStateReader Loaded empty cluster properties
[junit4] 2> 44543 INFO (TEST-LeaderFailoverAfterPartitionTest.test-seed#[C50AEE012C6EB3D3]) [n:127.0.0.1:35979_ ] o.a.s.c.c.ZkStateReader Updated live nodes from ZooKeeper... (0) -> (1)
[junit4] 2> 44547 INFO (TEST-LeaderFailoverAfterPartitionTest.test-seed#[C50AEE012C6EB3D3]) [n:127.0.0.1:35979_ ] o.a.s.c.Overseer Overseer (id=null) closing
[junit4] 2> 44548 INFO (TEST-LeaderFailoverAfterPartitionTest.test-seed#[C50AEE012C6EB3D3]) [n:127.0.0.1:35979_ ] o.a.s.c.LeaderElector Joined leadership election with path: /overseer_elect/election/96517907107610633-127.0.0.1:35979_-n_0000000001
[junit4] 2> 44550 INFO (TEST-LeaderFailoverAfterPartitionTest.test-seed#[C50AEE012C6EB3D3]) [n:127.0.0.1:35979_ ] o.a.s.c.LeaderElector Watching path /overseer_elect/election/96517907107610628-127.0.0.1:43811_-n_0000000000 to know if I could be the leader
[junit4] 2> 44550 INFO (TEST-LeaderFailoverAft
[...truncated too long message...]
------
[ecj-lint] 11. WARNING in /x1/jenkins/jenkins-slave/workspace/Lucene-Solr-Tests-master/solr/core/src/java/org/apache/solr/core/HdfsDirectoryFactory.java (at line 227)
[ecj-lint] dir = new BlockDirectory(path, hdfsDir, cache, null, blockCacheReadEnabled, false, cacheMerges, cacheReadOnce);
[ecj-lint] ^^^^^^^^^^^^^^^^^^^^^^^^^^^^^^^^^^^^^^^^^^^^^^^^^^^^^^^^^^^^^^^^^^^^^^^^^^^^^^^^^^^^^^^^^^^^^^^^^^^^^^^^^^^^^^
[ecj-lint] Resource leak: 'dir' is never closed
[ecj-lint] ----------
[ecj-lint] ----------
[ecj-lint] 12. WARNING in /x1/jenkins/jenkins-slave/workspace/Lucene-Solr-Tests-master/solr/core/src/java/org/apache/solr/handler/AnalysisRequestHandlerBase.java (at line 120)
[ecj-lint] reader = cfiltfac.create(reader);
[ecj-lint] ^^^^^^^^^^^^^^^^^^^^^^^^^^^^^^^^
[ecj-lint] Resource leak: 'reader' is not closed at this location
[ecj-lint] ----------
[ecj-lint] 13. WARNING in /x1/jenkins/jenkins-slave/workspace/Lucene-Solr-Tests-master/solr/core/src/java/org/apache/solr/handler/AnalysisRequestHandlerBase.java (at line 144)
[ecj-lint] return namedList;
[ecj-lint] ^^^^^^^^^^^^^^^^^
[ecj-lint] Resource leak: 'listBasedTokenStream' is not closed at this location
[ecj-lint] ----------
[ecj-lint] ----------
[ecj-lint] 14. WARNING in /x1/jenkins/jenkins-slave/workspace/Lucene-Solr-Tests-master/solr/core/src/java/org/apache/solr/handler/ReplicationHandler.java (at line 1250)
[ecj-lint] DirectoryReader reader = s==null ? null : s.get().getIndexReader();
[ecj-lint] ^^^^^^
[ecj-lint] Resource leak: 'reader' is never closed
[ecj-lint] ----------
[ecj-lint] ----------
[ecj-lint] 15. WARNING in /x1/jenkins/jenkins-slave/workspace/Lucene-Solr-Tests-master/solr/core/src/java/org/apache/solr/handler/SQLHandler.java (at line 253)
[ecj-lint] ParallelStream parallelStream = new ParallelStream(workerZkHost, workerCollection, tupleStream, numWorkers, comp);
[ecj-lint] ^^^^^^^^^^^^^^
[ecj-lint] Resource leak: 'parallelStream' is never closed
[ecj-lint] ----------
[ecj-lint] 16. WARNING in /x1/jenkins/jenkins-slave/workspace/Lucene-Solr-Tests-master/solr/core/src/java/org/apache/solr/handler/SQLHandler.java (at line 392)
[ecj-lint] ParallelStream parallelStream = new ParallelStream(workerZkHost, workerCollection, tupleStream, numWorkers, comp);
[ecj-lint] ^^^^^^^^^^^^^^
[ecj-lint] Resource leak: 'parallelStream' is never closed
[ecj-lint] ----------
[ecj-lint] ----------
[ecj-lint] 17. WARNING in /x1/jenkins/jenkins-slave/workspace/Lucene-Solr-Tests-master/solr/core/src/java/org/apache/solr/handler/component/ExpandComponent.java (at line 223)
[ecj-lint] UninvertingReader uninvertingReader = new UninvertingReader(new ReaderWrapper(searcher.getLeafReader(), field), mapping);
[ecj-lint] ^^^^^^^^^^^^^^^^^
[ecj-lint] Resource leak: 'uninvertingReader' is never closed
[ecj-lint] ----------
[ecj-lint] ----------
[ecj-lint] 18. WARNING in /x1/jenkins/jenkins-slave/workspace/Lucene-Solr-Tests-master/solr/core/src/java/org/apache/solr/highlight/DefaultSolrHighlighter.java (at line 544)
[ecj-lint] tvWindowStream = new OffsetWindowTokenFilter(tvStream);
[ecj-lint] ^^^^^^^^^^^^^^^^^^^^^^^^^^^^^^^^^^^^^^^^^^^^^^^^^^^^^^
[ecj-lint] Resource leak: 'tvWindowStream' is never closed
[ecj-lint] ----------
[ecj-lint] ----------
[ecj-lint] 19. WARNING in /x1/jenkins/jenkins-slave/workspace/Lucene-Solr-Tests-master/solr/core/src/java/org/apache/solr/request/SimpleFacets.java (at line 829)
[ecj-lint] fastForRandomSet = new HashDocSet(sset.getDocs(), 0, sset.size());
[ecj-lint] ^^^^^^^^^^^^^^^^^^^^^^^^^^^^^^^^^^^^^^^^^^^^^^^^^^^^^^^^^^^^^^^^^
[ecj-lint] Resource leak: 'fastForRandomSet' is never closed
[ecj-lint] ----------
[ecj-lint] ----------
[ecj-lint] 20. WARNING in /x1/jenkins/jenkins-slave/workspace/Lucene-Solr-Tests-master/solr/core/src/java/org/apache/solr/schema/OpenExchangeRatesOrgProvider.java (at line 146)
[ecj-lint] ratesJsonStream = resourceLoader.openResource(ratesFileLocation);
[ecj-lint] ^^^^^^^^^^^^^^^^^^^^^^^^^^^^^^^^^^^^^^^^^^^^^^^^^^^^^^^^^^^^^^^^
[ecj-lint] Resource leak: 'ratesJsonStream' is not closed at this location
[ecj-lint] ----------
[ecj-lint] ----------
[ecj-lint] 21. WARNING in /x1/jenkins/jenkins-slave/workspace/Lucene-Solr-Tests-master/solr/core/src/java/org/apache/solr/search/CollapsingQParserPlugin.java (at line 1177)
[ecj-lint] UninvertingReader uninvertingReader = new UninvertingReader(new ReaderWrapper(searcher.getLeafReader(), collapseField), mapping);
[ecj-lint] ^^^^^^^^^^^^^^^^^
[ecj-lint] Resource leak: 'uninvertingReader' is never closed
[ecj-lint] ----------
[ecj-lint] ----------
[ecj-lint] 22. WARNING in /x1/jenkins/jenkins-slave/workspace/Lucene-Solr-Tests-master/solr/core/src/java/org/apache/solr/search/DocSlice.java (at line 145)
[ecj-lint] HashDocSet h = new HashDocSet(docs,offset,len);
[ecj-lint] ^
[ecj-lint] Resource leak: 'h' is never closed
[ecj-lint] ----------
[ecj-lint] 23. WARNING in /x1/jenkins/jenkins-slave/workspace/Lucene-Solr-Tests-master/solr/core/src/java/org/apache/solr/search/DocSlice.java (at line 154)
[ecj-lint] HashDocSet h = new HashDocSet(docs,offset,len);
[ecj-lint] ^
[ecj-lint] Resource leak: 'h' is never closed
[ecj-lint] ----------
[ecj-lint] 24. WARNING in /x1/jenkins/jenkins-slave/workspace/Lucene-Solr-Tests-master/solr/core/src/java/org/apache/solr/search/DocSlice.java (at line 163)
[ecj-lint] HashDocSet h = new HashDocSet(docs,offset,len);
[ecj-lint] ^
[ecj-lint] Resource leak: 'h' is never closed
[ecj-lint] ----------
[ecj-lint] ----------
[ecj-lint] 25. WARNING in /x1/jenkins/jenkins-slave/workspace/Lucene-Solr-Tests-master/solr/core/src/java/org/apache/solr/search/function/OrdFieldSource.java (at line 78)
[ecj-lint] SolrIndexSearcher is = (SolrIndexSearcher) o;
[ecj-lint] ^^
[ecj-lint] Resource leak: 'is' is never closed
[ecj-lint] ----------
[ecj-lint] ----------
[ecj-lint] 26. WARNING in /x1/jenkins/jenkins-slave/workspace/Lucene-Solr-Tests-master/solr/core/src/java/org/apache/solr/search/function/ReverseOrdFieldSource.java (at line 78)
[ecj-lint] SolrIndexSearcher is = (SolrIndexSearcher) o;
[ecj-lint] ^^
[ecj-lint] Resource leak: 'is' is never closed
[ecj-lint] ----------
[ecj-lint] ----------
[ecj-lint] 27. WARNING in /x1/jenkins/jenkins-slave/workspace/Lucene-Solr-Tests-master/solr/core/src/java/org/apache/solr/servlet/SolrDispatchFilter.java (at line 184)
[ecj-lint] throw new SolrException(ErrorCode.SERVER_ERROR, "Error occurred while loading solr.xml from zookeeper", e);
[ecj-lint] ^^^^^^^^^^^^^^^^^^^^^^^^^^^^^^^^^^^^^^^^^^^^^^^^^^^^^^^^^^^^^^^^^^^^^^^^^^^^^^^^^^^^^^^^^^^^^^^^^^^^^^^^^^^
[ecj-lint] Resource leak: 'loader' is not closed at this location
[ecj-lint] ----------
[ecj-lint] ----------
[ecj-lint] 28. WARNING in /x1/jenkins/jenkins-slave/workspace/Lucene-Solr-Tests-master/solr/core/src/java/org/apache/solr/update/CdcrTransactionLog.java (at line 98)
[ecj-lint] ChannelFastInputStream is = new ChannelFastInputStream(channel, pos);
[ecj-lint] ^^
[ecj-lint] Resource leak: 'is' is never closed
[ecj-lint] ----------
[ecj-lint] ----------
[ecj-lint] 29. WARNING in /x1/jenkins/jenkins-slave/workspace/Lucene-Solr-Tests-master/solr/core/src/java/org/apache/solr/update/TransactionLog.java (at line 226)
[ecj-lint] ChannelFastInputStream is = new ChannelFastInputStream(channel, pos);
[ecj-lint] ^^
[ecj-lint] Resource leak: 'is' is never closed
[ecj-lint] ----------
[ecj-lint] 30. WARNING in /x1/jenkins/jenkins-slave/workspace/Lucene-Solr-Tests-master/solr/core/src/java/org/apache/solr/update/TransactionLog.java (at line 226)
[ecj-lint] ChannelFastInputStream is = new ChannelFastInputStream(channel, pos);
[ecj-lint] ^^
[ecj-lint] Resource leak: 'is' is never closed
[ecj-lint] ----------
[ecj-lint] ----------
[ecj-lint] 31. WARNING in /x1/jenkins/jenkins-slave/workspace/Lucene-Solr-Tests-master/solr/core/src/java/org/apache/solr/util/SimplePostTool.java (at line 640)
[ecj-lint] BAOS bos = new BAOS();
[ecj-lint] ^^^
[ecj-lint] Resource leak: 'bos' is never closed
[ecj-lint] ----------
[ecj-lint] 32. WARNING in /x1/jenkins/jenkins-slave/workspace/Lucene-Solr-Tests-master/solr/core/src/java/org/apache/solr/util/SimplePostTool.java (at line 640)
[ecj-lint] BAOS bos = new BAOS();
[ecj-lint] ^^^
[ecj-lint] Resource leak: 'bos' is never closed
[ecj-lint] ----------
[ecj-lint] ----------
[ecj-lint] 33. WARNING in /x1/jenkins/jenkins-slave/workspace/Lucene-Solr-Tests-master/solr/core/src/java/org/apache/solr/util/SolrLogLayout.java (at line 149)
[ecj-lint] SolrQueryRequest req = requestInfo == null ? null : requestInfo.getReq();
[ecj-lint] ^^^
[ecj-lint] Resource leak: 'req' is never closed
[ecj-lint] ----------
[ecj-lint] 33 problems (4 errors, 29 warnings)
BUILD FAILED
/x1/jenkins/jenkins-slave/workspace/Lucene-Solr-Tests-master/build.xml:763: The following error occurred while executing this line:
/x1/jenkins/jenkins-slave/workspace/Lucene-Solr-Tests-master/build.xml:101: The following error occurred while executing this line:
/x1/jenkins/jenkins-slave/workspace/Lucene-Solr-Tests-master/solr/build.xml:652: The following error occurred while executing this line:
/x1/jenkins/jenkins-slave/workspace/Lucene-Solr-Tests-master/lucene/common-build.xml:1992: The following error occurred while executing this line:
/x1/jenkins/jenkins-slave/workspace/Lucene-Solr-Tests-master/lucene/common-build.xml:2031: Compile failed; see the compiler error output for details.
Total time: 91 minutes 47 seconds
Build step 'Invoke Ant' marked build as failure
Archiving artifacts
Recording test results
Email was triggered for: Failure - Any
Sending email for trigger: Failure - Any