You are viewing a plain text version of this content. The canonical link for it is here.
Posted to dev@jmeter.apache.org by Apache Jenkins Server <je...@builds.apache.org> on 2019/09/30 12:14:49 UTC
Build failed in Jenkins: JMeter-trunk #7416
See <https://builds.apache.org/job/JMeter-trunk/7416/display/redirect?page=changes>
Changes:
[sitnikov.vladimir] Fix formatting in src/licenses/build.gradle.kts
------------------------------------------
[...truncated 183.78 KB...]
> Task :src:dist:javadocAggregate
> Task :src:functions:test
Gradle Test Executor 51 STANDARD_OUT
Setting JMeterHome: <https://builds.apache.org/job/JMeter-trunk/ws/src/functions/../../.>
Initializing Properties: ../.././bin/jmeter.properties
JMeterVersion=5.2.0-SNAPSHOT e179409
java.version=1.8.0_191
java.vm.name=Java HotSpot(TM) 64-Bit Server VM
java.vendor=Oracle Corporation
java.home=/usr/local/asfpackages/java/jdk1.8.0_191/jre
file.encoding=ISO-8859-1
default encoding=ISO-8859-1
user.home=/home/jenkins
user.dir=<https://builds.apache.org/job/JMeter-trunk/ws/src/functions>
user.language=en
user.region=null
user.country=US
user.variant=
Locale=en_US
java.class.version=52.0
java.awt.headless=true
os.name=Linux
os.version=4.4.0-164-generic
os.arch=amd64
> Task :src:functions:check
> Task :src:functions:assemble UP-TO-DATE
> Task :src:protocol:http:spotbugsMain
SpotBugs rule violations were found. See the report at: file://<https://builds.apache.org/job/JMeter-trunk/ws/src/protocol/http/build/reports/spotbugs/main.xml>
> Task :src:protocol:http:spotbugsTest
SpotBugs rule violations were found. See the report at: file://<https://builds.apache.org/job/JMeter-trunk/ws/src/protocol/http/build/reports/spotbugs/test.xml>
> Task :src:protocol:http:test
Gradle Test Executor 53 STANDARD_OUT
Setting JMeterHome: <https://builds.apache.org/job/JMeter-trunk/ws/src/protocol/http/../../../.>
Initializing Properties: ../../.././bin/jmeter.properties
JMeterVersion=5.2.0-SNAPSHOT e179409
java.version=1.8.0_191
java.vm.name=Java HotSpot(TM) 64-Bit Server VM
java.vendor=Oracle Corporation
java.home=/usr/local/asfpackages/java/jdk1.8.0_191/jre
file.encoding=ISO-8859-1
default encoding=ISO-8859-1
user.home=/home/jenkins
user.dir=<https://builds.apache.org/job/JMeter-trunk/ws/src/protocol/http>
user.language=en
user.region=null
user.country=US
user.variant=
Locale=en_US
java.class.version=52.0
java.awt.headless=true
os.name=Linux
os.version=4.4.0-164-generic
os.arch=amd64
> Task :src:protocol:http:check
> Task :src:protocol:http:assemble
> Task :src:dist:compileTestJava NO-SOURCE
> Task :src:dist:testClasses UP-TO-DATE
> Task :src:dist:checkstyleTest NO-SOURCE
> Task :src:dist:spotbugsMain NO-SOURCE
> Task :src:dist:spotbugsTest NO-SOURCE
> Task :src:dist:test NO-SOURCE
> Task :src:dist:check
> Task :src:dist:populateLibs
> Task :src:dist:copyBinLibs UP-TO-DATE
> Task :src:dist:copyLibs
> Task :src:dist:createDist
> Task :src:dist-check:copyExtraTestLibs
> Task :src:dist-check:batchBUG_62847
> Task :src:dist:distTar
> Task :src:dist:distTarSha512
> Task :src:dist-check:batchBatchTestLocal
> Task :src:dist:distZip
> Task :src:dist:distZipSha512
> Task :src:dist:signDistTar SKIPPED
> Task :src:dist:signDistZip SKIPPED
> Task :src:dist:assemble
> Task :src:dist-check:batchBug50898
> Task :src:dist-check:batchBug52968
> Task :src:dist-check:batchBug54685
> Task :src:dist-check:batchBug55375
> Task :src:dist-check:batchBug56243
> Task :src:dist-check:batchBug56811
> Task :src:dist-check:batchBug62239
> Task :src:dist-check:batchFTP_TESTS
> Task :src:dist-check:batchHTMLParserTestFile_2
> Task :src:dist-check:batchHttp4ImplDigestAuth
> Task :src:dist-check:batchHttp4ImplPreemptiveBasicAuth
> Task :src:dist-check:batchHttp4ImplPreemptiveBasicAuthJava
> Task :src:dist-check:batchJDBC_TESTS
> Task :src:dist-check:batchJMS_TESTS
> Task :src:dist-check:batchOS_TESTS
> Task :src:dist-check:batchResponseDecompression
> Task :src:dist-check:batchServerBatchTestLocal
> Task :src:dist-check:batchSlowCharsFeatureHttpClient4
> Task :src:dist-check:batchSlowCharsFeatureJava
> Task :src:dist-check:batchTCP_TESTS
> Task :src:dist-check:batchTEST_HTTPHttpClient4
> Task :src:dist-check:batchTEST_HTTPJava
> Task :src:dist-check:batchTEST_HTTPS
> Task :src:dist-check:batchTestCookieManager
> Task :src:dist-check:batchTestHeaderManagerHttpClient4
> Task :src:dist-check:batchTestHeaderManagerJava
> Task :src:dist-check:batchTestKeepAlive
> Task :src:dist-check:batchTestRedirectionPolicies
> Task :src:dist-check:batchTestResultStatusAction
> Task :src:dist-check:batchTestSchedulerWithTimer
> Task :src:dist-check:batchTests
> Task :src:dist-check:test
Gradle Test Executor 54 STANDARD_OUT
Setting JMeterHome: <https://builds.apache.org/job/JMeter-trunk/ws/src/dist-check/../../.>
Initializing Properties: ../.././bin/jmeter.properties
JMeterVersion=5.2.0-SNAPSHOT e179409
java.version=1.8.0_191
java.vm.name=Java HotSpot(TM) 64-Bit Server VM
java.vendor=Oracle Corporation
java.home=/usr/local/asfpackages/java/jdk1.8.0_191/jre
file.encoding=ISO-8859-1
default encoding=ISO-8859-1
user.home=/home/jenkins
user.dir=<https://builds.apache.org/job/JMeter-trunk/ws/src/dist-check>
user.language=en
user.region=null
user.country=US
user.variant=
Locale=en_US
java.class.version=52.0
java.awt.headless=true
os.name=Linux
os.version=4.4.0-164-generic
os.arch=amd64
o.a.j.junit.JMeterTest INFO: JMeterGUIComponent: skipping some tests org.apache.jmeter.testbeans.gui.TestBeanGUI
o.a.j.junit.JMeterTest Error creating org.apache.jmeter.SplashScreen java.awt.HeadlessException
o.a.j.junit.JMeterTest Error creating org.apache.jmeter.config.gui.RowDetailDialog java.awt.HeadlessException
o.a.j.junit.JMeterTest Error creating org.apache.jmeter.functions.gui.FunctionHelper java.awt.HeadlessException
o.a.j.junit.JMeterTest WARN: java.io.Serializable: NoSuchMethodException org.apache.jmeter.gui.GlobalUndoableEdit, missing empty Constructor or Constructor with Object parameter
o.a.j.junit.JMeterTest Error creating org.apache.jmeter.gui.MainFrame java.awt.HeadlessException
o.a.j.junit.JMeterTest Error creating org.apache.jmeter.gui.SavePropertyDialog java.awt.HeadlessException
o.a.j.junit.JMeterTest Error creating org.apache.jmeter.gui.action.SearchTreeDialog java.awt.HeadlessException
o.a.j.junit.JMeterTest Error creating org.apache.jmeter.gui.action.SelectTemplatesDialog java.awt.HeadlessException
o.a.j.junit.JMeterTest Error creating org.apache.jmeter.gui.util.EscapeDialog java.awt.HeadlessException
o.a.j.junit.JMeterTest Error creating org.apache.jmeter.gui.util.JSyntaxTextArea java.awt.HeadlessException
o.a.j.junit.JMeterTest Error creating org.apache.jmeter.protocol.http.proxy.gui.RecorderDialog java.awt.HeadlessException
o.a.j.junit.JMeterTest WARN: java.io.Serializable: NoSuchMethodException org.apache.jmeter.rmi.RMIServerSocketFactoryImpl, missing empty Constructor or Constructor with Object parameter
o.a.j.junit.JMeterTest WARN: java.io.Serializable: NoSuchMethodException org.apache.jmeter.rmi.SSLRMIServerSocketFactory, missing empty Constructor or Constructor with Object parameter
o.a.j.junit.JMeterTest WARN: Error creating org.apache.jmeter.threads.RemoteThreadsListenerImpl java.rmi.server.ExportException: Listen failed on port: 0; nested exception is:
java.io.FileNotFoundException: rmi_keystore.jks (No such file or directory)
> Task :src:dist-check:check
> Task :jacocoReport
> Task :sonarqube
Classes not found during the analysis : [org.bouncycastle.cert.X509CertificateHolder, org.bouncycastle.cms.CMSException, org.bouncycastle.mail.smime.SMIMESignedParser]
SpotBugs report not found: <https://builds.apache.org/job/JMeter-trunk/ws/src/testkit/build/reports/spotbugs/testFixtures.xml>
Classes not found during the analysis : [org.apache.commons.collections.map.LinkedMap]
Classes not found during the analysis : [org.apache.commons.collections.ArrayStack]
> Task :sonarqube FAILED
checksum-dependency elapsed time: 15069ms, configurations processed: 785 (add -PchecksumTimingsPrint to print detailed timings)
FAILURE: Build failed with an exception.
* What went wrong:
Execution failed for task ':sonarqube'.
> Metaspace
* Try:
Run with --info or --debug option to get more log output. Run with --scan to get full insights.
* Exception is:
org.gradle.api.tasks.TaskExecutionException: Execution failed for task ':sonarqube'.
at org.gradle.api.internal.tasks.execution.ExecuteActionsTaskExecuter$3.accept(ExecuteActionsTaskExecuter.java:166)
at org.gradle.api.internal.tasks.execution.ExecuteActionsTaskExecuter$3.accept(ExecuteActionsTaskExecuter.java:163)
at org.gradle.internal.Try$Failure.ifSuccessfulOrElse(Try.java:191)
at org.gradle.api.internal.tasks.execution.ExecuteActionsTaskExecuter.execute(ExecuteActionsTaskExecuter.java:156)
at org.gradle.api.internal.tasks.execution.ValidatingTaskExecuter.execute(ValidatingTaskExecuter.java:62)
at org.gradle.api.internal.tasks.execution.SkipEmptySourceFilesTaskExecuter.execute(SkipEmptySourceFilesTaskExecuter.java:108)
at org.gradle.api.internal.tasks.execution.ResolveBeforeExecutionOutputsTaskExecuter.execute(ResolveBeforeExecutionOutputsTaskExecuter.java:67)
at org.gradle.api.internal.tasks.execution.ResolveAfterPreviousExecutionStateTaskExecuter.execute(ResolveAfterPreviousExecutionStateTaskExecuter.java:46)
at org.gradle.api.internal.tasks.execution.CleanupStaleOutputsExecuter.execute(CleanupStaleOutputsExecuter.java:94)
at org.gradle.api.internal.tasks.execution.FinalizePropertiesTaskExecuter.execute(FinalizePropertiesTaskExecuter.java:46)
at org.gradle.api.internal.tasks.execution.ResolveTaskExecutionModeExecuter.execute(ResolveTaskExecutionModeExecuter.java:95)
at org.gradle.api.internal.tasks.execution.SkipTaskWithNoActionsExecuter.execute(SkipTaskWithNoActionsExecuter.java:57)
at org.gradle.api.internal.tasks.execution.SkipOnlyIfTaskExecuter.execute(SkipOnlyIfTaskExecuter.java:56)
at org.gradle.api.internal.tasks.execution.CatchExceptionTaskExecuter.execute(CatchExceptionTaskExecuter.java:36)
at org.gradle.api.internal.tasks.execution.EventFiringTaskExecuter$1.executeTask(EventFiringTaskExecuter.java:77)
at org.gradle.api.internal.tasks.execution.EventFiringTaskExecuter$1.call(EventFiringTaskExecuter.java:55)
at org.gradle.api.internal.tasks.execution.EventFiringTaskExecuter$1.call(EventFiringTaskExecuter.java:52)
at org.gradle.internal.operations.DefaultBuildOperationExecutor$CallableBuildOperationWorker.execute(DefaultBuildOperationExecutor.java:416)
at org.gradle.internal.operations.DefaultBuildOperationExecutor$CallableBuildOperationWorker.execute(DefaultBuildOperationExecutor.java:406)
at org.gradle.internal.operations.DefaultBuildOperationExecutor$1.execute(DefaultBuildOperationExecutor.java:165)
at org.gradle.internal.operations.DefaultBuildOperationExecutor.execute(DefaultBuildOperationExecutor.java:250)
at org.gradle.internal.operations.DefaultBuildOperationExecutor.execute(DefaultBuildOperationExecutor.java:158)
at org.gradle.internal.operations.DefaultBuildOperationExecutor.call(DefaultBuildOperationExecutor.java:102)
at org.gradle.internal.operations.DelegatingBuildOperationExecutor.call(DelegatingBuildOperationExecutor.java:36)
at org.gradle.api.internal.tasks.execution.EventFiringTaskExecuter.execute(EventFiringTaskExecuter.java:52)
at org.gradle.execution.plan.LocalTaskNodeExecutor.execute(LocalTaskNodeExecutor.java:43)
at org.gradle.execution.taskgraph.DefaultTaskExecutionGraph$InvokeNodeExecutorsAction.execute(DefaultTaskExecutionGraph.java:355)
at org.gradle.execution.taskgraph.DefaultTaskExecutionGraph$InvokeNodeExecutorsAction.execute(DefaultTaskExecutionGraph.java:343)
at org.gradle.execution.taskgraph.DefaultTaskExecutionGraph$BuildOperationAwareExecutionAction.execute(DefaultTaskExecutionGraph.java:336)
at org.gradle.execution.taskgraph.DefaultTaskExecutionGraph$BuildOperationAwareExecutionAction.execute(DefaultTaskExecutionGraph.java:322)
at org.gradle.execution.plan.DefaultPlanExecutor$ExecutorWorker$1.execute(DefaultPlanExecutor.java:134)
at org.gradle.execution.plan.DefaultPlanExecutor$ExecutorWorker$1.execute(DefaultPlanExecutor.java:129)
at org.gradle.execution.plan.DefaultPlanExecutor$ExecutorWorker.execute(DefaultPlanExecutor.java:202)
at org.gradle.execution.plan.DefaultPlanExecutor$ExecutorWorker.executeNextNode(DefaultPlanExecutor.java:193)
at org.gradle.execution.plan.DefaultPlanExecutor$ExecutorWorker.run(DefaultPlanExecutor.java:129)
at org.gradle.internal.concurrent.ExecutorPolicy$CatchAndRecordFailures.onExecute(ExecutorPolicy.java:64)
at org.gradle.internal.concurrent.ManagedExecutorImpl$1.run(ManagedExecutorImpl.java:48)
at org.gradle.internal.concurrent.ThreadFactoryImpl$ManagedThreadRunnable.run(ThreadFactoryImpl.java:56)
Caused by: java.lang.OutOfMemoryError: Metaspace
at com.B.A.A.C.A.A(Unknown Source)
at com.B.A.B.A.D.<init>(Unknown Source)
at com.sonarsource.tsql.B.F.Q.<init>(Unknown Source)
at com.sonarsource.tsql.A.XA.<init>(Unknown Source)
at org.sonar.api.batch.rule.Checks.instantiate(Checks.java:160)
at org.sonar.api.batch.rule.Checks.addAnnotatedChecks(Checks.java:136)
at com.sonarsource.tsql.plugin.B.<init>(Unknown Source)
at org.picocontainer.injectors.AbstractInjector.newInstance(AbstractInjector.java:145)
at org.picocontainer.injectors.ConstructorInjector$1.run(ConstructorInjector.java:342)
at org.picocontainer.injectors.AbstractInjector$ThreadLocalCyclicDependencyGuard.observe(AbstractInjector.java:270)
at org.picocontainer.injectors.ConstructorInjector.getComponentInstance(ConstructorInjector.java:364)
at org.picocontainer.injectors.AbstractInjectionFactory$LifecycleAdapter.getComponentInstance(AbstractInjectionFactory.java:56)
* Get more help at https://help.gradle.org
Deprecated Gradle features were used in this build, making it incompatible with Gradle 6.0.
Use '--warning-mode all' to show the individual deprecation warnings.
See https://docs.gradle.org/5.6.2/userguide/command_line_interface.html#sec:command_line_warnings
BUILD FAILED in 12m 45s
356 actionable tasks: 258 executed, 98 up-to-date
See the profiling report at: file://<https://builds.apache.org/job/JMeter-trunk/ws/build/reports/profile/profile-2019-09-30-12-01-48.html>
A fine-grained performance profile is available: use the --scan option.
Build step 'Invoke Gradle script' changed build result to FAILURE
Build step 'Invoke Gradle script' marked build as failure
Archiving artifacts
[Fast Archiver] Compressed 164.08 MB of artifacts by 71.7% relative to #7414
Recording test results
Jenkins build is back to normal : JMeter-trunk #7417
Posted by Apache Jenkins Server <je...@builds.apache.org>.
See <https://builds.apache.org/job/JMeter-trunk/7417/display/redirect>