You are viewing a plain text version of this content. The canonical link for it is here.
Posted to issues@flink.apache.org by "JunboWang (Jira)" <ji...@apache.org> on 2025/02/12 03:36:00 UTC

[jira] [Created] (FLINK-37307) Flink CDC CI failed due to OceanBaseE2eITCase

JunboWang created FLINK-37307:
---------------------------------

             Summary: Flink CDC CI failed due to OceanBaseE2eITCase
                 Key: FLINK-37307
                 URL: https://issues.apache.org/jira/browse/FLINK-37307
             Project: Flink
          Issue Type: Improvement
          Components: Flink CDC
    Affects Versions: cdc-3.4.0
            Reporter: JunboWang


[https://github.com/apache/flink-cdc/actions/runs/13260216427/job/37067737782?pr=3914]
{code:java}
// code placeholder
Error:  Tests run: 1, Failures: 1, Errors: 0, Skipped: 0, Time elapsed: 541.368 s <<< FAILURE! - in org.apache.flink.cdc.connectors.tests.OceanBaseE2eITCase
8360Error:  OceanBaseE2eITCase.testOceanBaseCDC  Time elapsed: 324.912 s  <<< FAILURE!
8361array lengths differed, expected.length=10 actual.length=11; arrays first differed at element [10]; expected:<end of array> but was:<111,scooter,Big 2-wheel scooter ,5.18,null,null>
8362	at org.junit.internal.ComparisonCriteria.arrayEquals(ComparisonCriteria.java:89)
8363	at org.junit.internal.ComparisonCriteria.arrayEquals(ComparisonCriteria.java:28)
8364	at org.junit.Assert.internalArrayEquals(Assert.java:534)
8365	at org.junit.Assert.assertArrayEquals(Assert.java:285)
8366	at org.junit.Assert.assertArrayEquals(Assert.java:300)
8367	at org.apache.flink.cdc.common.test.utils.JdbcProxy.checkResult(JdbcProxy.java:70)
8368	at org.apache.flink.cdc.common.test.utils.JdbcProxy.checkResultWithTimeout(JdbcProxy.java:93)
8369	at org.apache.flink.cdc.connectors.tests.OceanBaseE2eITCase.testOceanBaseCDC(OceanBaseE2eITCase.java:179)
8370	at java.lang.reflect.Method.invoke(Method.java:498)
8371	at org.apache.flink.util.TestNameProvider$1.evaluate(TestNameProvider.java:45)
8372	at org.testcontainers.containers.FailureDetectingExternalResource$1.evaluate(FailureDetectingExternalResource.java:29)
8373	at org.testcontainers.containers.FailureDetectingExternalResource$1.evaluate(FailureDetectingExternalResource.java:29)
8374	at org.testcontainers.containers.FailureDetectingExternalResource$1.evaluate(FailureDetectingExternalResource.java:29)
8375Caused by: java.lang.AssertionError: expected:<end of array> but was:<111,scooter,Big 2-wheel scooter ,5.18,null,null>
8376	at org.junit.Assert.fail(Assert.java:89)
8377	at org.junit.Assert.failNotEquals(Assert.java:835)
8378	at org.junit.Assert.assertEquals(Assert.java:120)
8379	at org.junit.Assert.assertEquals(Assert.java:146)
8380	at org.junit.internal.ComparisonCriteria.arrayEquals(ComparisonCriteria.java:87)
8381	... 12 more {code}
 



--
This message was sent by Atlassian Jira
(v8.20.10#820010)