You are viewing a plain text version of this content. The canonical link for it is here.
Posted to builds@solr.apache.org by Apache Jenkins Server <je...@builds.apache.org> on 2025/03/29 22:05:39 UTC

[JENKINS] Solr » Solr-Test-main-s390x - Build # 919 - Still Failing!

Build: https://ci-builds.apache.org/job/Solr/job/Solr-Test-main-s390x/919/

No tests ran.

Build Log:
[...truncated 58 lines...]
BUILD FAILED in 1m 19s
4 actionable tasks: 4 executed

Publishing build scan...
https://develocity.apache.org/s/nhmcotpenvfpe

Build step 'Invoke Gradle script' changed build result to FAILURE
Build step 'Invoke Gradle script' marked build as failure
Archiving artifacts
Recording test results
ERROR: Step ‘Publish JUnit test result report’ failed: No test report files were found. Configuration error?
Email was triggered for: Failure - Any
Sending email for trigger: Failure - Any

[JENKINS] Solr » Solr-Test-main-s390x - Build # 924 - Still Failing!

Posted by Apache Jenkins Server <je...@builds.apache.org>.
Build: https://ci-builds.apache.org/job/Solr/job/Solr-Test-main-s390x/924/

No tests ran.

Build Log:
[...truncated 58 lines...]
BUILD FAILED in 49s
4 actionable tasks: 4 executed

Publishing build scan...
https://develocity.apache.org/s/sd4mdjtfiagau

Build step 'Invoke Gradle script' changed build result to FAILURE
Build step 'Invoke Gradle script' marked build as failure
Archiving artifacts
Recording test results
ERROR: Step ‘Publish JUnit test result report’ failed: No test report files were found. Configuration error?
Email was triggered for: Failure - Any
Sending email for trigger: Failure - Any

[JENKINS] Solr » Solr-Test-main-s390x - Build # 923 - Still Failing!

Posted by Apache Jenkins Server <je...@builds.apache.org>.
Build: https://ci-builds.apache.org/job/Solr/job/Solr-Test-main-s390x/923/

No tests ran.

Build Log:
[...truncated 58 lines...]
BUILD FAILED in 1m 17s
4 actionable tasks: 4 executed

Publishing build scan...
https://develocity.apache.org/s/ujdxux5xl4lts

Build step 'Invoke Gradle script' changed build result to FAILURE
Build step 'Invoke Gradle script' marked build as failure
Archiving artifacts
Recording test results
ERROR: Step ‘Publish JUnit test result report’ failed: No test report files were found. Configuration error?
Email was triggered for: Failure - Any
Sending email for trigger: Failure - Any

[JENKINS] Solr » Solr-Test-main-s390x - Build # 922 - Still Failing!

Posted by Apache Jenkins Server <je...@builds.apache.org>.
Build: https://ci-builds.apache.org/job/Solr/job/Solr-Test-main-s390x/922/

No tests ran.

Build Log:
[...truncated 58 lines...]
BUILD FAILED in 24s
4 actionable tasks: 4 executed

Publishing build scan...
https://develocity.apache.org/s/6z7tozkx2u7ms

Build step 'Invoke Gradle script' changed build result to FAILURE
Build step 'Invoke Gradle script' marked build as failure
Archiving artifacts
Recording test results
ERROR: Step ‘Publish JUnit test result report’ failed: No test report files were found. Configuration error?
Email was triggered for: Failure - Any
Sending email for trigger: Failure - Any

[JENKINS] Solr » Solr-Test-main-s390x - Build # 921 - Still Failing!

Posted by Apache Jenkins Server <je...@builds.apache.org>.
Build: https://ci-builds.apache.org/job/Solr/job/Solr-Test-main-s390x/921/

No tests ran.

Build Log:
[...truncated 58 lines...]
BUILD FAILED in 1m 1s
4 actionable tasks: 4 executed

Publishing build scan...
https://develocity.apache.org/s/dnfkr2rq5yngc

Build step 'Invoke Gradle script' changed build result to FAILURE
Build step 'Invoke Gradle script' marked build as failure
Archiving artifacts
Recording test results
ERROR: Step ‘Publish JUnit test result report’ failed: No test report files were found. Configuration error?
Email was triggered for: Failure - Any
Sending email for trigger: Failure - Any

[JENKINS] Solr » Solr-Test-main-s390x - Build # 920 - Still Failing!

Posted by Apache Jenkins Server <je...@builds.apache.org>.
Build: https://ci-builds.apache.org/job/Solr/job/Solr-Test-main-s390x/920/

No tests ran.

Build Log:
[...truncated 57 lines...]
BUILD FAILED in 43s
4 actionable tasks: 4 executed

Publishing build scan...
https://develocity.apache.org/s/b5ani7ekn5pi2

Build step 'Invoke Gradle script' changed build result to FAILURE
Build step 'Invoke Gradle script' marked build as failure
Archiving artifacts
Recording test results
ERROR: Step ‘Publish JUnit test result report’ failed: No test report files were found. Configuration error?
Email was triggered for: Failure - Any
Sending email for trigger: Failure - Any