You are viewing a plain text version of this content. The canonical link for it is here.
Posted to commits@sling.apache.org by Apache Jenkins Server <je...@builds.apache.org> on 2017/06/02 09:55:35 UTC

Build failed in Jenkins: sling-bundles-extensions-models-integration-tests-1.7 #57

See <https://builds.apache.org/job/sling-bundles-extensions-models-integration-tests-1.7/57/display/redirect>

------------------------------------------
[...truncated 17.58 KB...]
main:
Setting Bundle-RequiredExecutionEnvironment=JavaSE-1.7 from sling.java.version=7
[INFO] Executed tasks
[INFO] 
[INFO] --- maven-remote-resources-plugin:1.5:process (default) @ org.apache.sling.models.integration-tests ---
[INFO] 
[INFO] --- maven-resources-plugin:2.7:resources (default-resources) @ org.apache.sling.models.integration-tests ---
[INFO] Using 'UTF-8' encoding to copy filtered resources.
[INFO] Copying 1 resource
[INFO] Copying 3 resources
[INFO] 
[INFO] --- maven-antrun-plugin:1.8:run (check-memory-task) @ org.apache.sling.models.integration-tests ---
[INFO] Executing tasks

main:
     [echo] **************** WARNING (SLING-443/SLING-1782) ******************************
     [echo] On most platforms, you'll get OutOfMemoryErrors when building unless you set
     [echo] on 32bit platforms: MAVEN_OPTS="-Xmx256M -XX:MaxPermSize=256M", see SLING-443
     [echo] on 64bit platforms: MAVEN_OPTS="-Xmx512M -XX:MaxPermSize=512M", see SLING-1782
     [echo] ******************************************************************************
[INFO] Executed tasks
[INFO] 
[INFO] --- maven-dependency-plugin:2.10:copy-dependencies (copy-runnable-jar) @ org.apache.sling.models.integration-tests ---
[INFO] Copying org.apache.sling.launchpad-7-standalone.jar to <https://builds.apache.org/job/sling-bundles-extensions-models-integration-tests-1.7/ws/target/dependency/org.apache.sling.launchpad-7-standalone.jar>
[INFO] 
[INFO] --- maven-dependency-plugin:2.10:copy-dependencies (copy-additional-bundles) @ org.apache.sling.models.integration-tests ---
[INFO] Copying org.osgi.core-4.1.0.jar to <https://builds.apache.org/job/sling-bundles-extensions-models-integration-tests-1.7/ws/target/sling/additional-bundles/org.osgi.core-4.1.0.jar>
[INFO] Copying commons-io-1.4.jar to <https://builds.apache.org/job/sling-bundles-extensions-models-integration-tests-1.7/ws/target/sling/additional-bundles/commons-io-1.4.jar>
[INFO] Copying org.apache.sling.engine-2.2.0.jar to <https://builds.apache.org/job/sling-bundles-extensions-models-integration-tests-1.7/ws/target/sling/additional-bundles/org.apache.sling.engine-2.2.0.jar>
[INFO] Copying geronimo-atinject_1.0_spec-1.0.jar to <https://builds.apache.org/job/sling-bundles-extensions-models-integration-tests-1.7/ws/target/sling/additional-bundles/geronimo-atinject_1.0_spec-1.0.jar>
[INFO] Copying jackson-annotations-2.3.2.jar to <https://builds.apache.org/job/sling-bundles-extensions-models-integration-tests-1.7/ws/target/sling/additional-bundles/jackson-annotations-2.3.2.jar>
[INFO] Copying slf4j-simple-1.5.2.jar to <https://builds.apache.org/job/sling-bundles-extensions-models-integration-tests-1.7/ws/target/sling/additional-bundles/slf4j-simple-1.5.2.jar>
[INFO] Copying bndlib-1.50.0.jar to <https://builds.apache.org/job/sling-bundles-extensions-models-integration-tests-1.7/ws/target/sling/additional-bundles/bndlib-1.50.0.jar>
[INFO] Copying org.apache.sling.models.api-1.3.5-SNAPSHOT.jar to <https://builds.apache.org/job/sling-bundles-extensions-models-integration-tests-1.7/ws/target/sling/additional-bundles/org.apache.sling.models.api-1.3.5-SNAPSHOT.jar>
[INFO] Copying httpcore-osgi-4.1.2.jar to <https://builds.apache.org/job/sling-bundles-extensions-models-integration-tests-1.7/ws/target/sling/additional-bundles/httpcore-osgi-4.1.2.jar>
[INFO] Copying org.apache.felix.scr.annotations-1.9.12.jar to <https://builds.apache.org/job/sling-bundles-extensions-models-integration-tests-1.7/ws/target/sling/additional-bundles/org.apache.felix.scr.annotations-1.9.12.jar>
[INFO] Copying org.apache.sling.models.jacksonexporter-1.0.7-SNAPSHOT.jar to <https://builds.apache.org/job/sling-bundles-extensions-models-integration-tests-1.7/ws/target/sling/additional-bundles/org.apache.sling.models.jacksonexporter-1.0.7-SNAPSHOT.jar>
[INFO] Copying jackson-databind-2.3.2.jar to <https://builds.apache.org/job/sling-bundles-extensions-models-integration-tests-1.7/ws/target/sling/additional-bundles/jackson-databind-2.3.2.jar>
[INFO] Copying org.apache.sling.models.impl-1.4.3-SNAPSHOT.jar to <https://builds.apache.org/job/sling-bundles-extensions-models-integration-tests-1.7/ws/target/sling/additional-bundles/org.apache.sling.models.impl-1.4.3-SNAPSHOT.jar>
[INFO] Copying jcr-1.0.jar to <https://builds.apache.org/job/sling-bundles-extensions-models-integration-tests-1.7/ws/target/sling/additional-bundles/jcr-1.0.jar>
[INFO] Copying org.apache.sling.api-2.4.0.jar to <https://builds.apache.org/job/sling-bundles-extensions-models-integration-tests-1.7/ws/target/sling/additional-bundles/org.apache.sling.api-2.4.0.jar>
[INFO] Copying commons-lang-2.5.jar to <https://builds.apache.org/job/sling-bundles-extensions-models-integration-tests-1.7/ws/target/sling/additional-bundles/commons-lang-2.5.jar>
[INFO] Copying jackson-core-2.3.2.jar to <https://builds.apache.org/job/sling-bundles-extensions-models-integration-tests-1.7/ws/target/sling/additional-bundles/jackson-core-2.3.2.jar>
[INFO] Copying slf4j-api-1.5.2.jar to <https://builds.apache.org/job/sling-bundles-extensions-models-integration-tests-1.7/ws/target/sling/additional-bundles/slf4j-api-1.5.2.jar>
[INFO] Copying httpclient-osgi-4.1.2.jar to <https://builds.apache.org/job/sling-bundles-extensions-models-integration-tests-1.7/ws/target/sling/additional-bundles/httpclient-osgi-4.1.2.jar>
[INFO] Copying org.osgi.compendium-4.1.0.jar to <https://builds.apache.org/job/sling-bundles-extensions-models-integration-tests-1.7/ws/target/sling/additional-bundles/org.osgi.compendium-4.1.0.jar>
[INFO] Copying org.apache.sling.junit.remote-1.0.11-SNAPSHOT.jar to <https://builds.apache.org/job/sling-bundles-extensions-models-integration-tests-1.7/ws/target/sling/additional-bundles/org.apache.sling.junit.remote-1.0.11-SNAPSHOT.jar>
[INFO] Copying junit-4.12.jar to <https://builds.apache.org/job/sling-bundles-extensions-models-integration-tests-1.7/ws/target/sling/additional-bundles/junit-4.12.jar>
[INFO] Copying org.apache.sling.commons.johnzon-1.0.0.jar to <https://builds.apache.org/job/sling-bundles-extensions-models-integration-tests-1.7/ws/target/sling/additional-bundles/org.apache.sling.commons.johnzon-1.0.0.jar>
[INFO] Copying servlet-api-2.4.jar to <https://builds.apache.org/job/sling-bundles-extensions-models-integration-tests-1.7/ws/target/sling/additional-bundles/servlet-api-2.4.jar>
[INFO] Copying org.apache.sling.launchpad-7-standalone.jar to <https://builds.apache.org/job/sling-bundles-extensions-models-integration-tests-1.7/ws/target/sling/additional-bundles/org.apache.sling.launchpad-7-standalone.jar>
[INFO] 
[INFO] --- build-helper-maven-plugin:1.9.1:reserve-network-port (reserve-server-port) @ org.apache.sling.models.integration-tests ---
[INFO] Reserved port 38974 for http.port
[INFO] 
[INFO] --- maven-compiler-plugin:3.2:compile (default-compile) @ org.apache.sling.models.integration-tests ---
[INFO] Changes detected - recompiling the module!
[INFO] Compiling 55 source files to <https://builds.apache.org/job/sling-bundles-extensions-models-integration-tests-1.7/ws/target/classes>
[INFO] <https://builds.apache.org/job/sling-bundles-extensions-models-integration-tests-1.7/ws/src/main/java/org/apache/sling/models/it/ImplementsExtendsTest.java>: Some input files use or override a deprecated API.
[INFO] <https://builds.apache.org/job/sling-bundles-extensions-models-integration-tests-1.7/ws/src/main/java/org/apache/sling/models/it/ImplementsExtendsTest.java>: Recompile with -Xlint:deprecation for details.
[INFO] <https://builds.apache.org/job/sling-bundles-extensions-models-integration-tests-1.7/ws/src/main/java/org/apache/sling/models/it/exporter/ExporterTest.java>: <https://builds.apache.org/job/sling-bundles-extensions-models-integration-tests-1.7/ws/src/main/java/org/apache/sling/models/it/exporter/ExporterTest.java> uses unchecked or unsafe operations.
[INFO] <https://builds.apache.org/job/sling-bundles-extensions-models-integration-tests-1.7/ws/src/main/java/org/apache/sling/models/it/exporter/ExporterTest.java>: Recompile with -Xlint:unchecked for details.
[INFO] 
[INFO] --- maven-scr-plugin:1.21.0:scr (generate-scr-scrdescriptor) @ org.apache.sling.models.integration-tests ---
[INFO] Writing 1 Service Component Descriptors to <https://builds.apache.org/job/sling-bundles-extensions-models-integration-tests-1.7/ws/target/classes/OSGI-INF/org.apache.sling.models.it.implpicker.CustomLastImplementationPicker.xml>
[INFO] Writing 1 Service Component Descriptors to <https://builds.apache.org/job/sling-bundles-extensions-models-integration-tests-1.7/ws/target/classes/OSGI-INF/org.apache.sling.models.it.services.TestBindingsValuesProvider.xml>
[INFO] Writing 1 Service Component Descriptors to <https://builds.apache.org/job/sling-bundles-extensions-models-integration-tests-1.7/ws/target/classes/OSGI-INF/org.apache.sling.models.it.services.AnotherTestBindingsValuesProvider.xml>
[INFO] 
[INFO] --- maven-resources-plugin:2.7:testResources (default-testResources) @ org.apache.sling.models.integration-tests ---
[INFO] Using 'UTF-8' encoding to copy filtered resources.
[INFO] skip non existing resourceDirectory <https://builds.apache.org/job/sling-bundles-extensions-models-integration-tests-1.7/ws/src/test/resources>
[INFO] Copying 3 resources
[INFO] 
[INFO] --- maven-compiler-plugin:3.2:testCompile (default-testCompile) @ org.apache.sling.models.integration-tests ---
[INFO] Changes detected - recompiling the module!
[INFO] Compiling 1 source file to <https://builds.apache.org/job/sling-bundles-extensions-models-integration-tests-1.7/ws/target/test-classes>
[INFO] 
[INFO] --- maven-surefire-plugin:2.18.1:test (default-test) @ org.apache.sling.models.integration-tests ---
[JENKINS] Recording test results[INFO] 
[INFO] --- animal-sniffer-maven-plugin:1.14:check (default) @ org.apache.sling.models.integration-tests ---

[INFO] Checking unresolved references to org.codehaus.mojo.signature:java17:1.0
[INFO] 
[INFO] --- maven-bundle-plugin:3.0.1:bundle (default-bundle) @ org.apache.sling.models.integration-tests ---
[INFO] 
[INFO] >>> maven-source-plugin:2.4:jar (attach-sources) > generate-sources @ org.apache.sling.models.integration-tests >>>
[INFO] 
[INFO] --- maven-enforcer-plugin:1.3.1:enforce (enforce-java) @ org.apache.sling.models.integration-tests ---
[INFO] 
[INFO] --- maven-antrun-plugin:1.8:run (set-bundle-required-execution-environment) @ org.apache.sling.models.integration-tests ---
[INFO] Executing tasks

main:
Setting Bundle-RequiredExecutionEnvironment=JavaSE-1.7 from sling.java.version=7
[INFO] Executed tasks
[WARNING] Failed to getClass for org.apache.maven.plugin.source.SourceJarMojo
[INFO] 
[INFO] <<< maven-source-plugin:2.4:jar (attach-sources) < generate-sources @ org.apache.sling.models.integration-tests <<<
[INFO] 
[INFO] --- maven-source-plugin:2.4:jar (attach-sources) @ org.apache.sling.models.integration-tests ---
[INFO] Building jar: <https://builds.apache.org/job/sling-bundles-extensions-models-integration-tests-1.7/ws/target/org.apache.sling.models.integration-tests-0.0.1-SNAPSHOT-sources.jar>
[INFO] 
[INFO] --- maven-site-plugin:3.4:attach-descriptor (attach-descriptor) @ org.apache.sling.models.integration-tests ---
[INFO] 
[INFO] --- maven-failsafe-plugin:2.18.1:integration-test (integration-test) @ org.apache.sling.models.integration-tests ---
[INFO] Failsafe report directory: <https://builds.apache.org/job/sling-bundles-extensions-models-integration-tests-1.7/ws/target/failsafe-reports>

-------------------------------------------------------
 T E S T S
-------------------------------------------------------
103 [main] INFO org.apache.sling.models.it.RemoteIT - Server base URL=http://localhost:38974
116 [main] INFO org.apache.sling.testing.tools.jarexec.JarExecutor - Executable jar options: -p 38974
117 [main] INFO org.apache.sling.testing.tools.jarexec.JarExecutor - Executing asynchronously: /usr/local/asfpackages/java/jdk1.7.0_80/jre/bin/java -Xmx512m -jar <https://builds.apache.org/job/sling-bundles-extensions-models-integration-tests-1.7/ws/target/dependency/org.apache.sling.launchpad-7-standalone.jar> -p 38974
118 [main] INFO org.apache.sling.testing.tools.jarexec.JarExecutor - Setting up ProcessDestroyer with waitOnShutdown=false
120 [main] INFO org.apache.sling.testing.tools.sling.TimeoutsProvider - Timeout factor set to 1.0 from system property sling.testing.timeout.multiplier
121 [main] INFO org.apache.sling.models.it.RemoteIT - Will wait up to 60 seconds for server to become ready
123 [main] INFO org.apache.sling.models.it.RemoteIT - Checking that GET requests return expected content (timeout=60 seconds): [/:script src="system/sling.js", /.explorer.html:href="/libs/sling/explorer/css/explorer.css", /sling-test/sling/sling-test.html:Sling client library tests]
02.06.2017 09:54:37.281 *INFO * [main] Setting sling.home=sling (default)
02.06.2017 09:54:37.282 *INFO * [main] Starting Apache Sling in <https://builds.apache.org/job/sling-bundles-extensions-models-integration-tests-1.7/ws/sling>
02.06.2017 09:54:37.286 *INFO * [main] Sling  Extension Lib Home : <https://builds.apache.org/job/sling-bundles-extensions-models-integration-tests-1.7/ws/sling/ext>
02.06.2017 09:54:37.287 *INFO * [main] Checking launcher JAR in folder <https://builds.apache.org/job/sling-bundles-extensions-models-integration-tests-1.7/ws/sling>
02.06.2017 09:54:37.299 *INFO * [main] Installing new launcher: jar:<https://builds.apache.org/job/sling-bundles-extensions-models-integration-tests-1.7/ws/target/dependency/org.apache.sling.launchpad-7-standalone.jar!/resources/org.apache.sling.launchpad.base.jar,> 4.4.1.2_5_2 (org.apache.sling.launchpad.base.jar.1496397277299)
02.06.2017 09:54:37.301 *INFO * [main] Loading launcher class org.apache.sling.launchpad.base.app.MainDelegate from org.apache.sling.launchpad.base.jar.1496397277299
02.06.2017 09:54:37.301 *INFO * [main] External Libs Home (ext) is null or does not exists.
02.06.2017 09:54:37.318 *INFO * [main] Setting sling.launchpad=<https://builds.apache.org/job/sling-bundles-extensions-models-integration-tests-1.7/ws/sling>
02.06.2017 09:54:37.318 *INFO * [main] Setting org.osgi.service.http.port=38974
02.06.2017 09:54:37.318 *INFO * [main] Starting launcher ...
02.06.2017 09:54:37.319 *INFO * [main] HTTP server port: 38974
02.06.2017 09:54:38.050 *INFO* [FelixStartLevel] org.apache.sling.settings.impl.SlingSettingsServiceImpl Active run modes: [jackrabbit]
02.06.2017 09:54:38.148 *INFO* [OsgiInstallerImpl] org.apache.sling.installer.core.impl.OsgiInstallerImpl Apache Sling OSGi Installer Service started.
02.06.2017 09:54:38.207 *INFO* [FelixStartLevel] org.apache.sling.commons.log.logback.internal.Activator LogbackManager initialized at bundle startup
02.06.2017 09:54:38.251 *INFO* [FelixStartLevel] org.apache.sling.launchpad.installer.impl.LaunchpadConfigInstaller Activating launchpad config installer, configuration path=resources/config, install path=resources/install
02.06.2017 09:54:38.523 *INFO * [main] Startup completed
13971 [main] INFO org.apache.sling.models.it.RemoteIT - All 3 paths return expected content, server ready
15062 [main] INFO org.apache.sling.testing.tools.osgi.WebconsoleClient - Installing bundle org.apache.sling.models.integration-tests-0.0.1-SNAPSHOT.jar at default start level
15121 [main] INFO org.apache.sling.testing.tools.sling.BundlesInstaller - Installed: org.apache.sling.models.integration-tests
15164 [main] INFO org.apache.sling.testing.tools.sling.BundlesInstaller - Reinstalling (due to SNAPSHOT version): org.apache.sling.models.api
15259 [main] INFO org.apache.sling.testing.tools.osgi.WebconsoleClient - Uninstalling bundle org.apache.sling.models.api with bundleId 94
16077 [main] INFO org.apache.sling.testing.tools.osgi.WebconsoleClient - Installing bundle org.apache.sling.models.api-1.3.5-SNAPSHOT.jar at default start level
16096 [main] INFO org.apache.sling.testing.tools.sling.BundlesInstaller - Installed: org.apache.sling.models.api
16134 [main] INFO org.apache.sling.testing.tools.sling.BundlesInstaller - Reinstalling (due to SNAPSHOT version): org.apache.sling.models.impl
16163 [main] INFO org.apache.sling.testing.tools.osgi.WebconsoleClient - Uninstalling bundle org.apache.sling.models.impl with bundleId 95
17027 [main] INFO org.apache.sling.testing.tools.osgi.WebconsoleClient - Installing bundle org.apache.sling.models.impl-1.4.3-SNAPSHOT.jar at default start level
17051 [main] INFO org.apache.sling.testing.tools.sling.BundlesInstaller - Installed: org.apache.sling.models.impl
18079 [main] INFO org.apache.sling.testing.tools.osgi.WebconsoleClient - Installing bundle org.apache.sling.models.jacksonexporter-1.0.7-SNAPSHOT.jar at default start level
18096 [main] INFO org.apache.sling.testing.tools.sling.BundlesInstaller - Installed: org.apache.sling.models.jacksonexporter
19122 [main] INFO org.apache.sling.testing.tools.osgi.WebconsoleClient - Installing bundle jackson-annotations-2.3.2.jar at default start level
19141 [main] INFO org.apache.sling.testing.tools.sling.BundlesInstaller - Installed: com.fasterxml.jackson.core.jackson-annotations
20166 [main] INFO org.apache.sling.testing.tools.osgi.WebconsoleClient - Installing bundle jackson-core-2.3.2.jar at default start level
20185 [main] INFO org.apache.sling.testing.tools.sling.BundlesInstaller - Installed: com.fasterxml.jackson.core.jackson-core
21209 [main] INFO org.apache.sling.testing.tools.osgi.WebconsoleClient - Installing bundle jackson-databind-2.3.2.jar at default start level
21242 [main] INFO org.apache.sling.testing.tools.sling.BundlesInstaller - Installed: com.fasterxml.jackson.core.jackson-databind
22265 [main] INFO org.apache.sling.testing.tools.osgi.WebconsoleClient - Installing bundle geronimo-atinject_1.0_spec-1.0.jar at default start level
22280 [main] INFO org.apache.sling.testing.tools.sling.BundlesInstaller - Installed: org.apache.geronimo.specs.geronimo-atinject_1.0_spec
23301 [main] INFO org.apache.sling.testing.tools.osgi.WebconsoleClient - Installing bundle org.apache.sling.commons.johnzon-1.0.0.jar at default start level
23318 [main] INFO org.apache.sling.testing.tools.sling.BundlesInstaller - Installed: org.apache.sling.commons.johnzon
23318 [main] INFO org.apache.sling.testing.tools.osgi.WebconsoleClient - Refresh packages.
24213 [main] INFO org.apache.sling.testing.tools.sling.BundlesInstaller - 9 additional bundles installed
24220 [main] INFO org.apache.sling.testing.tools.sling.BundlesInstaller - Checking that bundles are installed (timeout 20 seconds): [org.apache.sling.models.integration-tests, org.apache.sling.models.api, org.apache.sling.models.impl, org.apache.sling.models.jacksonexporter, com.fasterxml.jackson.core.jackson-annotations, com.fasterxml.jackson.core.jackson-core, com.fasterxml.jackson.core.jackson-databind, org.apache.geronimo.specs.geronimo-atinject_1.0_spec, org.apache.sling.commons.johnzon]
24350 [main] INFO org.apache.sling.testing.tools.sling.BundlesInstaller - Starting bundles (timeout 30 seconds): [org.apache.sling.models.integration-tests, org.apache.sling.models.api, org.apache.sling.models.impl, org.apache.sling.models.jacksonexporter, com.fasterxml.jackson.core.jackson-annotations, com.fasterxml.jackson.core.jackson-core, com.fasterxml.jackson.core.jackson-databind, org.apache.geronimo.specs.geronimo-atinject_1.0_spec, org.apache.sling.commons.johnzon]
24366 [main] INFO org.apache.sling.testing.tools.osgi.WebconsoleClient - Starting bundle org.apache.sling.models.integration-tests via /system/console/bundles/org.apache.sling.models.integration-tests
25702 [main] INFO org.apache.sling.testing.tools.osgi.WebconsoleClient - Starting bundle org.apache.sling.models.integration-tests via /system/console/bundles/org.apache.sling.models.integration-tests
27037 [main] INFO org.apache.sling.testing.tools.osgi.WebconsoleClient - Starting bundle org.apache.sling.models.integration-tests via /system/console/bundles/org.apache.sling.models.integration-tests
28370 [main] INFO org.apache.sling.testing.tools.osgi.WebconsoleClient - Starting bundle org.apache.sling.models.integration-tests via /system/console/bundles/org.apache.sling.models.integration-tests
29702 [main] INFO org.apache.sling.testing.tools.osgi.WebconsoleClient - Starting bundle org.apache.sling.models.integration-tests via /system/console/bundles/org.apache.sling.models.integration-tests
31038 [main] INFO org.apache.sling.testing.tools.osgi.WebconsoleClient - Starting bundle org.apache.sling.models.integration-tests via /system/console/bundles/org.apache.sling.models.integration-tests
32370 [main] INFO org.apache.sling.testing.tools.osgi.WebconsoleClient - Starting bundle org.apache.sling.models.integration-tests via /system/console/bundles/org.apache.sling.models.integration-tests
33704 [main] INFO org.apache.sling.testing.tools.osgi.WebconsoleClient - Starting bundle org.apache.sling.models.integration-tests via /system/console/bundles/org.apache.sling.models.integration-tests
35040 [main] INFO org.apache.sling.testing.tools.osgi.WebconsoleClient - Starting bundle org.apache.sling.models.integration-tests via /system/console/bundles/org.apache.sling.models.integration-tests
36376 [main] INFO org.apache.sling.testing.tools.osgi.WebconsoleClient - Starting bundle org.apache.sling.models.integration-tests via /system/console/bundles/org.apache.sling.models.integration-tests
37712 [main] INFO org.apache.sling.testing.tools.osgi.WebconsoleClient - Starting bundle org.apache.sling.models.integration-tests via /system/console/bundles/org.apache.sling.models.integration-tests
39044 [main] INFO org.apache.sling.testing.tools.osgi.WebconsoleClient - Starting bundle org.apache.sling.models.integration-tests via /system/console/bundles/org.apache.sling.models.integration-tests
40376 [main] INFO org.apache.sling.testing.tools.osgi.WebconsoleClient - Starting bundle org.apache.sling.models.integration-tests via /system/console/bundles/org.apache.sling.models.integration-tests
41712 [main] INFO org.apache.sling.testing.tools.osgi.WebconsoleClient - Starting bundle org.apache.sling.models.integration-tests via /system/console/bundles/org.apache.sling.models.integration-tests
43043 [main] INFO org.apache.sling.testing.tools.osgi.WebconsoleClient - Starting bundle org.apache.sling.models.integration-tests via /system/console/bundles/org.apache.sling.models.integration-tests
44373 [main] INFO org.apache.sling.testing.tools.osgi.WebconsoleClient - Starting bundle org.apache.sling.models.integration-tests via /system/console/bundles/org.apache.sling.models.integration-tests
45703 [main] INFO org.apache.sling.testing.tools.osgi.WebconsoleClient - Starting bundle org.apache.sling.models.integration-tests via /system/console/bundles/org.apache.sling.models.integration-tests
47036 [main] INFO org.apache.sling.testing.tools.osgi.WebconsoleClient - Starting bundle org.apache.sling.models.integration-tests via /system/console/bundles/org.apache.sling.models.integration-tests
48366 [main] INFO org.apache.sling.testing.tools.osgi.WebconsoleClient - Starting bundle org.apache.sling.models.integration-tests via /system/console/bundles/org.apache.sling.models.integration-tests
49695 [main] INFO org.apache.sling.testing.tools.osgi.WebconsoleClient - Starting bundle org.apache.sling.models.integration-tests via /system/console/bundles/org.apache.sling.models.integration-tests
51027 [main] INFO org.apache.sling.testing.tools.osgi.WebconsoleClient - Starting bundle org.apache.sling.models.integration-tests via /system/console/bundles/org.apache.sling.models.integration-tests
52357 [main] INFO org.apache.sling.testing.tools.osgi.WebconsoleClient - Starting bundle org.apache.sling.models.integration-tests via /system/console/bundles/org.apache.sling.models.integration-tests
53690 [main] INFO org.apache.sling.testing.tools.osgi.WebconsoleClient - Starting bundle org.apache.sling.models.integration-tests via /system/console/bundles/org.apache.sling.models.integration-tests
55005 [main] INFO org.apache.sling.models.it.RemoteIT - Exception while installing additional bundles
java.lang.AssertionError: Some bundles did not start: [org.apache.sling.models.integration-tests]
	at org.junit.Assert.fail(Assert.java:88)
	at org.apache.sling.testing.tools.sling.BundlesInstaller.startAllBundles(BundlesInstaller.java:155)
	at org.apache.sling.testing.tools.sling.SlingTestBase.installAdditionalBundles(SlingTestBase.java:193)
	at org.apache.sling.testing.tools.sling.SlingTestBase.startServerIfNeeded(SlingTestBase.java:170)
	at org.apache.sling.testing.tools.sling.SlingTestBase.getServerBaseUrl(SlingTestBase.java:231)
	at org.apache.sling.models.it.RemoteIT.getJunitServletUrl(RemoteIT.java:28)
	at org.apache.sling.junit.remote.testrunner.SlingRemoteTestRunner.maybeExecuteTests(SlingRemoteTestRunner.java:103)
	at org.apache.sling.junit.remote.testrunner.SlingRemoteTestRunner.getChildren(SlingRemoteTestRunner.java:146)
	at org.junit.runners.ParentRunner.getFilteredChildren(ParentRunner.java:426)
	at org.junit.runners.ParentRunner.getDescription(ParentRunner.java:351)
	at org.junit.runners.Suite.describeChild(Suite.java:123)
	at org.junit.runners.Suite.describeChild(Suite.java:27)
	at org.junit.runners.ParentRunner.getDescription(ParentRunner.java:352)
	at org.apache.maven.surefire.common.junit4.JUnit4ProviderUtil.createSuiteDescription(JUnit4ProviderUtil.java:113)
	at org.apache.maven.surefire.junit4.JUnit4Provider.createTestsDescription(JUnit4Provider.java:257)
	at org.apache.maven.surefire.junit4.JUnit4Provider.invoke(JUnit4Provider.java:124)
	at org.apache.maven.surefire.booter.ForkedBooter.invokeProviderInSameClassLoader(ForkedBooter.java:203)
	at org.apache.maven.surefire.booter.ForkedBooter.runSuitesInProcess(ForkedBooter.java:155)
	at org.apache.maven.surefire.booter.ForkedBooter.main(ForkedBooter.java:103)

Results :

Tests run: 0, Failures: 0, Errors: 0, Skipped: 0

[JENKINS] Recording test results
[JENKINS] Archiving disabled
[JENKINS] Archiving disabled[INFO] ------------------------------------------------------------------------
[INFO] BUILD FAILURE
[INFO] ------------------------------------------------------------------------
[INFO] Total time: 01:19 min
[INFO] Finished at: 2017-06-02T09:55:33+00:00

[INFO] Final Memory: 44M/451M
[INFO] ------------------------------------------------------------------------
Waiting for Jenkins to finish collecting data
[ERROR] Failed to execute goal org.apache.maven.plugins:maven-failsafe-plugin:2.18.1:integration-test (integration-test) on project org.apache.sling.models.integration-tests: Execution integration-test of goal org.apache.maven.plugins:maven-failsafe-plugin:2.18.1:integration-test failed: There was an error in the forked process
[ERROR] java.lang.AssertionError: Could not start all installed bundles:[<https://builds.apache.org/job/sling-bundles-extensions-models-integration-tests-1.7/ws/target/org.apache.sling.models.integration-tests-0.0.1-SNAPSHOT.jar,> <https://builds.apache.org/job/sling-bundles-extensions-models-integration-tests-1.7/ws/target/sling/additional-bundles/org.apache.sling.models.api-1.3.5-SNAPSHOT.jar,> <https://builds.apache.org/job/sling-bundles-extensions-models-integration-tests-1.7/ws/target/sling/additional-bundles/org.apache.sling.models.impl-1.4.3-SNAPSHOT.jar,> <https://builds.apache.org/job/sling-bundles-extensions-models-integration-tests-1.7/ws/target/sling/additional-bundles/org.apache.sling.models.jacksonexporter-1.0.7-SNAPSHOT.jar,> <https://builds.apache.org/job/sling-bundles-extensions-models-integration-tests-1.7/ws/target/sling/additional-bundles/jackson-annotations-2.3.2.jar,> <https://builds.apache.org/job/sling-bundles-extensions-models-integration-tests-1.7/ws/target/sling/additional-bundles/jackson-core-2.3.2.jar,> <https://builds.apache.org/job/sling-bundles-extensions-models-integration-tests-1.7/ws/target/sling/additional-bundles/jackson-databind-2.3.2.jar,> <https://builds.apache.org/job/sling-bundles-extensions-models-integration-tests-1.7/ws/target/sling/additional-bundles/geronimo-atinject_1.0_spec-1.0.jar,> <https://builds.apache.org/job/sling-bundles-extensions-models-integration-tests-1.7/ws/target/sling/additional-bundles/org.apache.sling.commons.johnzon-1.0.0.jar]>
[ERROR] at org.junit.Assert.fail(Assert.java:88)
[ERROR] at org.apache.sling.testing.tools.sling.SlingTestBase.installAdditionalBundles(SlingTestBase.java:203)
[ERROR] at org.apache.sling.testing.tools.sling.SlingTestBase.startServerIfNeeded(SlingTestBase.java:170)
[ERROR] at org.apache.sling.testing.tools.sling.SlingTestBase.getServerBaseUrl(SlingTestBase.java:231)
[ERROR] at org.apache.sling.models.it.RemoteIT.getJunitServletUrl(RemoteIT.java:28)
[ERROR] at org.apache.sling.junit.remote.testrunner.SlingRemoteTestRunner.maybeExecuteTests(SlingRemoteTestRunner.java:103)
[ERROR] at org.apache.sling.junit.remote.testrunner.SlingRemoteTestRunner.getChildren(SlingRemoteTestRunner.java:146)
[ERROR] at org.junit.runners.ParentRunner.getFilteredChildren(ParentRunner.java:426)
[ERROR] at org.junit.runners.ParentRunner.getDescription(ParentRunner.java:351)
[ERROR] at org.junit.runners.Suite.describeChild(Suite.java:123)
[ERROR] at org.junit.runners.Suite.describeChild(Suite.java:27)
[ERROR] at org.junit.runners.ParentRunner.getDescription(ParentRunner.java:352)
[ERROR] at org.apache.maven.surefire.common.junit4.JUnit4ProviderUtil.createSuiteDescription(JUnit4ProviderUtil.java:113)
[ERROR] at org.apache.maven.surefire.junit4.JUnit4Provider.createTestsDescription(JUnit4Provider.java:257)
[ERROR] at org.apache.maven.surefire.junit4.JUnit4Provider.invoke(JUnit4Provider.java:124)
[ERROR] at org.apache.maven.surefire.booter.ForkedBooter.invokeProviderInSameClassLoader(ForkedBooter.java:203)
[ERROR] at org.apache.maven.surefire.booter.ForkedBooter.runSuitesInProcess(ForkedBooter.java:155)
[ERROR] at org.apache.maven.surefire.booter.ForkedBooter.main(ForkedBooter.java:103)
[ERROR] -> [Help 1]
[ERROR] 
[ERROR] To see the full stack trace of the errors, re-run Maven with the -e switch.
[ERROR] Re-run Maven using the -X switch to enable full debug logging.
[ERROR] 
[ERROR] For more information about the errors and possible solutions, please read the following articles:
[ERROR] [Help 1] http://cwiki.apache.org/confluence/display/MAVEN/PluginExecutionException
channel stopped
Recording test results

Jenkins build is back to normal : sling-bundles-extensions-models-integration-tests-1.7 #59

Posted by Apache Jenkins Server <je...@builds.apache.org>.
See <https://builds.apache.org/job/sling-bundles-extensions-models-integration-tests-1.7/59/display/redirect?page=changes>


Build failed in Jenkins: sling-bundles-extensions-models-integration-tests-1.7 #58

Posted by Apache Jenkins Server <je...@builds.apache.org>.
See <https://builds.apache.org/job/sling-bundles-extensions-models-integration-tests-1.7/58/display/redirect?page=changes>

Changes:

[pauls] Update to latest junit core release 1.0.26.

------------------------------------------
Started by an SCM change
[EnvInject] - Loading node environment variables.
Building remotely on ubuntu-1 (ubuntu trusty) in workspace <https://builds.apache.org/job/sling-bundles-extensions-models-integration-tests-1.7/ws/>
Updating https://svn.apache.org/repos/asf/sling/trunk/bundles/extensions/models/integration-tests at revision '2017-06-06T11:01:12.626 +0000'
U         src/main/java/org/apache/sling/models/it/exporter/ExporterTest.java
U         pom.xml
At revision 1797773

Parsing POMs
Modules changed, recalculating dependency graph
Established TCP socket on 58339
maven33-agent.jar already up to date
maven33-interceptor.jar already up to date
maven3-interceptor-commons.jar already up to date
[sling-bundles-extensions-models-integration-tests-1.7] $ /home/jenkins/tools/java/latest1.7/bin/java -Xmx2g -Xms256m -cp /home/jenkins/jenkins-slave/maven33-agent.jar:/home/jenkins/tools/maven/apache-maven-3.3.9/boot/plexus-classworlds-2.5.2.jar:/home/jenkins/tools/maven/apache-maven-3.3.9/conf/logging jenkins.maven3.agent.Maven33Main /home/jenkins/tools/maven/apache-maven-3.3.9 /home/jenkins/jenkins-slave/slave.jar /home/jenkins/jenkins-slave/maven33-interceptor.jar /home/jenkins/jenkins-slave/maven3-interceptor-commons.jar 58339
<===[JENKINS REMOTING CAPACITY]===>   channel started
Executing Maven:  -B -f <https://builds.apache.org/job/sling-bundles-extensions-models-integration-tests-1.7/ws/pom.xml> -Dmaven.repo.local=/home/jenkins/jenkins-slave/maven-repositories/0 -U clean deploy
[INFO] Scanning for projects...
[INFO]                                                                         
[INFO] ------------------------------------------------------------------------
[INFO] Building Apache Sling Models Integration Tests 0.0.1-SNAPSHOT
[INFO] ------------------------------------------------------------------------
[INFO] Downloading: https://repo.maven.apache.org/maven2/org/apache/sling/org.apache.sling.junit.core/1.0.26/org.apache.sling.junit.core-1.0.26.pom
[WARNING] The POM for org.apache.sling:org.apache.sling.junit.core:jar:1.0.26 is missing, no dependency information available
[INFO] Downloading: http://repository.apache.org/snapshots/org/apache/sling/org.apache.sling.junit.remote/1.0.11-SNAPSHOT/maven-metadata.xml
[INFO] Downloaded: http://repository.apache.org/snapshots/org/apache/sling/org.apache.sling.junit.remote/1.0.11-SNAPSHOT/maven-metadata.xml (2 KB at 2.5 KB/sec)
[INFO] Downloading: http://repository.apache.org/snapshots/org/apache/sling/org.apache.sling.junit.remote/1.0.11-SNAPSHOT/org.apache.sling.junit.remote-1.0.11-20170602.094638-2492.pom
[INFO] Downloaded: http://repository.apache.org/snapshots/org/apache/sling/org.apache.sling.junit.remote/1.0.11-SNAPSHOT/org.apache.sling.junit.remote-1.0.11-20170602.094638-2492.pom (6 KB at 14.3 KB/sec)
[INFO] Downloading: http://repository.apache.org/snapshots/org/apache/sling/org.apache.sling.junit.core/1.0.25-SNAPSHOT/maven-metadata.xml
[INFO] Downloaded: http://repository.apache.org/snapshots/org/apache/sling/org.apache.sling.junit.core/1.0.25-SNAPSHOT/maven-metadata.xml (1011 B at 2.4 KB/sec)
[INFO] Downloading: http://repository.apache.org/snapshots/org/apache/sling/org.apache.sling.junit.core/1.0.25-SNAPSHOT/org.apache.sling.junit.core-1.0.25-20170601.214902-3.pom
[INFO] Downloaded: http://repository.apache.org/snapshots/org/apache/sling/org.apache.sling.junit.core/1.0.25-SNAPSHOT/org.apache.sling.junit.core-1.0.25-20170601.214902-3.pom (9 KB at 23.4 KB/sec)
[INFO] Downloading: http://repository.apache.org/snapshots/org/apache/sling/org.apache.sling.testing.tools/1.0.17-SNAPSHOT/maven-metadata.xml
[INFO] Downloaded: http://repository.apache.org/snapshots/org/apache/sling/org.apache.sling.testing.tools/1.0.17-SNAPSHOT/maven-metadata.xml (1014 B at 2.7 KB/sec)
[INFO] Downloading: http://repository.apache.org/snapshots/org/apache/sling/org.apache.sling.testing.tools/1.0.17-SNAPSHOT/org.apache.sling.testing.tools-1.0.17-20170602.113544-3.pom
[INFO] Downloaded: http://repository.apache.org/snapshots/org/apache/sling/org.apache.sling.testing.tools/1.0.17-SNAPSHOT/org.apache.sling.testing.tools-1.0.17-20170602.113544-3.pom (6 KB at 14.1 KB/sec)
[INFO] Downloading: http://repository.apache.org/snapshots/org/apache/sling/org.apache.sling.models.api/1.3.5-SNAPSHOT/maven-metadata.xml
[INFO] Downloaded: http://repository.apache.org/snapshots/org/apache/sling/org.apache.sling.models.api/1.3.5-SNAPSHOT/maven-metadata.xml (1007 B at 2.7 KB/sec)
[INFO] Downloading: http://repository.apache.org/snapshots/org/apache/sling/org.apache.sling.models.impl/1.4.3-SNAPSHOT/maven-metadata.xml
[INFO] Downloaded: http://repository.apache.org/snapshots/org/apache/sling/org.apache.sling.models.impl/1.4.3-SNAPSHOT/maven-metadata.xml (1008 B at 2.6 KB/sec)
[INFO] Downloading: http://repository.apache.org/snapshots/org/apache/sling/org.apache.sling.models.impl/1.4.3-SNAPSHOT/org.apache.sling.models.impl-1.4.3-20170511.122035-1.pom
[INFO] Downloaded: http://repository.apache.org/snapshots/org/apache/sling/org.apache.sling.models.impl/1.4.3-SNAPSHOT/org.apache.sling.models.impl-1.4.3-20170511.122035-1.pom (9 KB at 20.7 KB/sec)
[INFO] Downloading: http://repository.apache.org/snapshots/org/apache/sling/org.apache.sling.models.jacksonexporter/1.0.7-SNAPSHOT/maven-metadata.xml
[INFO] Downloaded: http://repository.apache.org/snapshots/org/apache/sling/org.apache.sling.models.jacksonexporter/1.0.7-SNAPSHOT/maven-metadata.xml (1019 B at 2.6 KB/sec)
[INFO] Downloading: https://repo.maven.apache.org/maven2/org/apache/sling/org.apache.sling.junit.core/1.0.26/org.apache.sling.junit.core-1.0.26.jar
[INFO] Downloading: http://repository.apache.org/snapshots/org/apache/sling/org.apache.sling.junit.remote/1.0.11-SNAPSHOT/org.apache.sling.junit.remote-1.0.11-20170602.094638-2492.jar
[INFO] Downloading: http://repository.apache.org/snapshots/org/apache/sling/org.apache.sling.testing.tools/1.0.17-SNAPSHOT/org.apache.sling.testing.tools-1.0.17-20170602.113544-3.jar
[INFO] Downloading: http://repository.apache.org/snapshots/org/apache/sling/org.apache.sling.models.impl/1.4.3-SNAPSHOT/org.apache.sling.models.impl-1.4.3-20170511.122035-1.jar
[INFO] Downloaded: http://repository.apache.org/snapshots/org/apache/sling/org.apache.sling.junit.remote/1.0.11-SNAPSHOT/org.apache.sling.junit.remote-1.0.11-20170602.094638-2492.jar (34 KB at 70.9 KB/sec)
[INFO] Downloaded: http://repository.apache.org/snapshots/org/apache/sling/org.apache.sling.testing.tools/1.0.17-SNAPSHOT/org.apache.sling.testing.tools-1.0.17-20170602.113544-3.jar (79 KB at 139.1 KB/sec)
[INFO] Downloaded: http://repository.apache.org/snapshots/org/apache/sling/org.apache.sling.models.impl/1.4.3-SNAPSHOT/org.apache.sling.models.impl-1.4.3-20170511.122035-1.jar (356 KB at 485.2 KB/sec)
[JENKINS] Archiving disabled
[JENKINS] Archiving disabled[INFO] ------------------------------------------------------------------------
[INFO] BUILD FAILURE
[INFO] ------------------------------------------------------------------------
[INFO] Total time: 10.977 s
[INFO] Finished at: 2017-06-06T11:02:14+00:00

[INFO] Final Memory: 18M/310M
[INFO] ------------------------------------------------------------------------
[ERROR] Failed to execute goal on project org.apache.sling.models.integration-tests: Could not resolve dependencies for project org.apache.sling:org.apache.sling.models.integration-tests:bundle:0.0.1-SNAPSHOT: Could not find artifact org.apache.sling:org.apache.sling.junit.core:jar:1.0.26 in central (https://repo.maven.apache.org/maven2) -> [Help 1]
[ERROR] 
[ERROR] To see the full stack trace of the errors, re-run Maven with the -e switch.
[ERROR] Re-run Maven using the -X switch to enable full debug logging.
[ERROR] 
[ERROR] For more information about the errors and possible solutions, please read the following articles:
[ERROR] [Help 1] http://cwiki.apache.org/confluence/display/MAVEN/DependencyResolutionException
channel stopped
Recording test results
ERROR: Step ?Publish JUnit test result report? failed: Test reports were found but none of them are new. Did tests run? 
For example, <https://builds.apache.org/job/sling-bundles-extensions-models-integration-tests-1.7/ws/target/failsafe-reports/TEST-org.apache.sling.models.it.RemoteIT.xml> is 21 days old