You are viewing a plain text version of this content. The canonical link for it is here.
Posted to builds@lucene.apache.org by Policeman Jenkins Server <je...@thetaphi.de> on 2019/10/29 11:07:10 UTC
[JENKINS] Lucene-Solr-master-MacOSX (64bit/jdk-13) - Build # 5410 -
Unstable!
Build: https://jenkins.thetaphi.de/job/Lucene-Solr-master-MacOSX/5410/
Java: 64bit/jdk-13 -XX:-UseCompressedOops -XX:+UseParallelGC
2 tests failed.
FAILED: org.apache.solr.cloud.SyncSliceTest.test
Error Message:
expected:<5> but was:<4>
Stack Trace:
java.lang.AssertionError: expected:<5> but was:<4>
at __randomizedtesting.SeedInfo.seed([F8E3B768E16E848D:70B788B24F92E975]:0)
at org.junit.Assert.fail(Assert.java:88)
at org.junit.Assert.failNotEquals(Assert.java:834)
at org.junit.Assert.assertEquals(Assert.java:645)
at org.junit.Assert.assertEquals(Assert.java:631)
at org.apache.solr.cloud.SyncSliceTest.test(SyncSliceTest.java:150)
at java.base/jdk.internal.reflect.NativeMethodAccessorImpl.invoke0(Native Method)
at java.base/jdk.internal.reflect.NativeMethodAccessorImpl.invoke(NativeMethodAccessorImpl.java:62)
at java.base/jdk.internal.reflect.DelegatingMethodAccessorImpl.invoke(DelegatingMethodAccessorImpl.java:43)
at java.base/java.lang.reflect.Method.invoke(Method.java:567)
at com.carrotsearch.randomizedtesting.RandomizedRunner.invoke(RandomizedRunner.java:1750)
at com.carrotsearch.randomizedtesting.RandomizedRunner$8.evaluate(RandomizedRunner.java:938)
at com.carrotsearch.randomizedtesting.RandomizedRunner$9.evaluate(RandomizedRunner.java:974)
at com.carrotsearch.randomizedtesting.RandomizedRunner$10.evaluate(RandomizedRunner.java:988)
at org.apache.solr.BaseDistributedSearchTestCase$ShardsRepeatRule$ShardsFixedStatement.callStatement(BaseDistributedSearchTestCase.java:1082)
at org.apache.solr.BaseDistributedSearchTestCase$ShardsRepeatRule$ShardsStatement.evaluate(BaseDistributedSearchTestCase.java:1054)
at com.carrotsearch.randomizedtesting.rules.SystemPropertiesRestoreRule$1.evaluate(SystemPropertiesRestoreRule.java:57)
at org.apache.lucene.util.TestRuleSetupTeardownChained$1.evaluate(TestRuleSetupTeardownChained.java:49)
at org.apache.lucene.util.AbstractBeforeAfterRule$1.evaluate(AbstractBeforeAfterRule.java:45)
at org.apache.lucene.util.TestRuleThreadAndTestName$1.evaluate(TestRuleThreadAndTestName.java:48)
at org.apache.lucene.util.TestRuleIgnoreAfterMaxFailures$1.evaluate(TestRuleIgnoreAfterMaxFailures.java:64)
at org.apache.lucene.util.TestRuleMarkFailure$1.evaluate(TestRuleMarkFailure.java:47)
at com.carrotsearch.randomizedtesting.rules.StatementAdapter.evaluate(StatementAdapter.java:36)
at com.carrotsearch.randomizedtesting.ThreadLeakControl$StatementRunner.run(ThreadLeakControl.java:368)
at com.carrotsearch.randomizedtesting.ThreadLeakControl.forkTimeoutingTask(ThreadLeakControl.java:817)
at com.carrotsearch.randomizedtesting.ThreadLeakControl$3.evaluate(ThreadLeakControl.java:468)
at com.carrotsearch.randomizedtesting.RandomizedRunner.runSingleTest(RandomizedRunner.java:947)
at com.carrotsearch.randomizedtesting.RandomizedRunner$5.evaluate(RandomizedRunner.java:832)
at com.carrotsearch.randomizedtesting.RandomizedRunner$6.evaluate(RandomizedRunner.java:883)
at com.carrotsearch.randomizedtesting.RandomizedRunner$7.evaluate(RandomizedRunner.java:894)
at com.carrotsearch.randomizedtesting.rules.StatementAdapter.evaluate(StatementAdapter.java:36)
at com.carrotsearch.randomizedtesting.rules.SystemPropertiesRestoreRule$1.evaluate(SystemPropertiesRestoreRule.java:57)
at org.apache.lucene.util.AbstractBeforeAfterRule$1.evaluate(AbstractBeforeAfterRule.java:45)
at com.carrotsearch.randomizedtesting.rules.StatementAdapter.evaluate(StatementAdapter.java:36)
at org.apache.lucene.util.TestRuleStoreClassName$1.evaluate(TestRuleStoreClassName.java:41)
at com.carrotsearch.randomizedtesting.rules.NoShadowingOrOverridesOnMethodsRule$1.evaluate(NoShadowingOrOverridesOnMethodsRule.java:40)
at com.carrotsearch.randomizedtesting.rules.NoShadowingOrOverridesOnMethodsRule$1.evaluate(NoShadowingOrOverridesOnMethodsRule.java:40)
at com.carrotsearch.randomizedtesting.rules.StatementAdapter.evaluate(StatementAdapter.java:36)
at com.carrotsearch.randomizedtesting.rules.StatementAdapter.evaluate(StatementAdapter.java:36)
at org.apache.lucene.util.TestRuleAssertionsRequired$1.evaluate(TestRuleAssertionsRequired.java:53)
at org.apache.lucene.util.TestRuleMarkFailure$1.evaluate(TestRuleMarkFailure.java:47)
at org.apache.lucene.util.TestRuleIgnoreAfterMaxFailures$1.evaluate(TestRuleIgnoreAfterMaxFailures.java:64)
at org.apache.lucene.util.TestRuleIgnoreTestSuites$1.evaluate(TestRuleIgnoreTestSuites.java:54)
at com.carrotsearch.randomizedtesting.rules.StatementAdapter.evaluate(StatementAdapter.java:36)
at com.carrotsearch.randomizedtesting.ThreadLeakControl$StatementRunner.run(ThreadLeakControl.java:368)
at java.base/java.lang.Thread.run(Thread.java:830)
FAILED: org.apache.solr.cloud.SyncSliceTest.test
Error Message:
expected:<5> but was:<4>
Stack Trace:
java.lang.AssertionError: expected:<5> but was:<4>
at __randomizedtesting.SeedInfo.seed([F8E3B768E16E848D:70B788B24F92E975]:0)
at org.junit.Assert.fail(Assert.java:88)
at org.junit.Assert.failNotEquals(Assert.java:834)
at org.junit.Assert.assertEquals(Assert.java:645)
at org.junit.Assert.assertEquals(Assert.java:631)
at org.apache.solr.cloud.SyncSliceTest.test(SyncSliceTest.java:150)
at java.base/jdk.internal.reflect.NativeMethodAccessorImpl.invoke0(Native Method)
at java.base/jdk.internal.reflect.NativeMethodAccessorImpl.invoke(NativeMethodAccessorImpl.java:62)
at java.base/jdk.internal.reflect.DelegatingMethodAccessorImpl.invoke(DelegatingMethodAccessorImpl.java:43)
at java.base/java.lang.reflect.Method.invoke(Method.java:567)
at com.carrotsearch.randomizedtesting.RandomizedRunner.invoke(RandomizedRunner.java:1750)
at com.carrotsearch.randomizedtesting.RandomizedRunner$8.evaluate(RandomizedRunner.java:938)
at com.carrotsearch.randomizedtesting.RandomizedRunner$9.evaluate(RandomizedRunner.java:974)
at com.carrotsearch.randomizedtesting.RandomizedRunner$10.evaluate(RandomizedRunner.java:988)
at org.apache.solr.BaseDistributedSearchTestCase$ShardsRepeatRule$ShardsFixedStatement.callStatement(BaseDistributedSearchTestCase.java:1082)
at org.apache.solr.BaseDistributedSearchTestCase$ShardsRepeatRule$ShardsStatement.evaluate(BaseDistributedSearchTestCase.java:1054)
at com.carrotsearch.randomizedtesting.rules.SystemPropertiesRestoreRule$1.evaluate(SystemPropertiesRestoreRule.java:57)
at org.apache.lucene.util.TestRuleSetupTeardownChained$1.evaluate(TestRuleSetupTeardownChained.java:49)
at org.apache.lucene.util.AbstractBeforeAfterRule$1.evaluate(AbstractBeforeAfterRule.java:45)
at org.apache.lucene.util.TestRuleThreadAndTestName$1.evaluate(TestRuleThreadAndTestName.java:48)
at org.apache.lucene.util.TestRuleIgnoreAfterMaxFailures$1.evaluate(TestRuleIgnoreAfterMaxFailures.java:64)
at org.apache.lucene.util.TestRuleMarkFailure$1.evaluate(TestRuleMarkFailure.java:47)
at com.carrotsearch.randomizedtesting.rules.StatementAdapter.evaluate(StatementAdapter.java:36)
at com.carrotsearch.randomizedtesting.ThreadLeakControl$StatementRunner.run(ThreadLeakControl.java:368)
at com.carrotsearch.randomizedtesting.ThreadLeakControl.forkTimeoutingTask(ThreadLeakControl.java:817)
at com.carrotsearch.randomizedtesting.ThreadLeakControl$3.evaluate(ThreadLeakControl.java:468)
at com.carrotsearch.randomizedtesting.RandomizedRunner.runSingleTest(RandomizedRunner.java:947)
at com.carrotsearch.randomizedtesting.RandomizedRunner$5.evaluate(RandomizedRunner.java:832)
at com.carrotsearch.randomizedtesting.RandomizedRunner$6.evaluate(RandomizedRunner.java:883)
at com.carrotsearch.randomizedtesting.RandomizedRunner$7.evaluate(RandomizedRunner.java:894)
at com.carrotsearch.randomizedtesting.rules.StatementAdapter.evaluate(StatementAdapter.java:36)
at com.carrotsearch.randomizedtesting.rules.SystemPropertiesRestoreRule$1.evaluate(SystemPropertiesRestoreRule.java:57)
at org.apache.lucene.util.AbstractBeforeAfterRule$1.evaluate(AbstractBeforeAfterRule.java:45)
at com.carrotsearch.randomizedtesting.rules.StatementAdapter.evaluate(StatementAdapter.java:36)
at org.apache.lucene.util.TestRuleStoreClassName$1.evaluate(TestRuleStoreClassName.java:41)
at com.carrotsearch.randomizedtesting.rules.NoShadowingOrOverridesOnMethodsRule$1.evaluate(NoShadowingOrOverridesOnMethodsRule.java:40)
at com.carrotsearch.randomizedtesting.rules.NoShadowingOrOverridesOnMethodsRule$1.evaluate(NoShadowingOrOverridesOnMethodsRule.java:40)
at com.carrotsearch.randomizedtesting.rules.StatementAdapter.evaluate(StatementAdapter.java:36)
at com.carrotsearch.randomizedtesting.rules.StatementAdapter.evaluate(StatementAdapter.java:36)
at org.apache.lucene.util.TestRuleAssertionsRequired$1.evaluate(TestRuleAssertionsRequired.java:53)
at org.apache.lucene.util.TestRuleMarkFailure$1.evaluate(TestRuleMarkFailure.java:47)
at org.apache.lucene.util.TestRuleIgnoreAfterMaxFailures$1.evaluate(TestRuleIgnoreAfterMaxFailures.java:64)
at org.apache.lucene.util.TestRuleIgnoreTestSuites$1.evaluate(TestRuleIgnoreTestSuites.java:54)
at com.carrotsearch.randomizedtesting.rules.StatementAdapter.evaluate(StatementAdapter.java:36)
at com.carrotsearch.randomizedtesting.ThreadLeakControl$StatementRunner.run(ThreadLeakControl.java:368)
at java.base/java.lang.Thread.run(Thread.java:830)
Build Log:
[...truncated 14661 lines...]
[junit4] Suite: org.apache.solr.cloud.SyncSliceTest
[junit4] 2> 2946994 INFO (SUITE-SyncSliceTest-seed#[F8E3B768E16E848D]-worker) [ ] o.a.s.SolrTestCaseJ4 Created dataDir: /Users/jenkins/workspace/Lucene-Solr-master-MacOSX/solr/build/solr-core/test/J0/temp/solr.cloud.SyncSliceTest_F8E3B768E16E848D-001/data-dir-276-001
[junit4] 2> 2946994 INFO (SUITE-SyncSliceTest-seed#[F8E3B768E16E848D]-worker) [ ] o.a.s.SolrTestCaseJ4 Using PointFields (NUMERIC_POINTS_SYSPROP=true) w/NUMERIC_DOCVALUES_SYSPROP=false
[junit4] 2> 2946995 INFO (SUITE-SyncSliceTest-seed#[F8E3B768E16E848D]-worker) [ ] o.a.s.SolrTestCaseJ4 Randomized ssl (false) and clientAuth (false) via: @org.apache.solr.util.RandomizeSSL(reason="", value=0.0/0.0, ssl=0.0/0.0, clientAuth=0.0/0.0) w/ MAC_OS_X supressed clientAuth
[junit4] 2> 2946995 INFO (SUITE-SyncSliceTest-seed#[F8E3B768E16E848D]-worker) [ ] o.a.s.SolrTestCaseJ4 SecureRandom sanity checks: test.solr.allowed.securerandom=null & java.security.egd=file:/dev/./urandom
[junit4] 2> 2946996 INFO (SUITE-SyncSliceTest-seed#[F8E3B768E16E848D]-worker) [ ] o.a.s.BaseDistributedSearchTestCase Setting hostContext system property: /_fe/ne
[junit4] 2> 2946998 INFO (TEST-SyncSliceTest.test-seed#[F8E3B768E16E848D]) [ ] o.a.s.c.ZkTestServer STARTING ZK TEST SERVER
[junit4] 2> 2946998 INFO (ZkTestServer Run Thread) [ ] o.a.s.c.ZkTestServer client port:0.0.0.0/0.0.0.0:0
[junit4] 2> 2946998 INFO (ZkTestServer Run Thread) [ ] o.a.s.c.ZkTestServer Starting server
[junit4] 2> 2947099 INFO (TEST-SyncSliceTest.test-seed#[F8E3B768E16E848D]) [ ] o.a.s.c.ZkTestServer start zk server on port:55977
[junit4] 2> 2947099 INFO (TEST-SyncSliceTest.test-seed#[F8E3B768E16E848D]) [ ] o.a.s.c.ZkTestServer waitForServerUp: 127.0.0.1:55977
[junit4] 2> 2947099 INFO (TEST-SyncSliceTest.test-seed#[F8E3B768E16E848D]) [ ] o.a.s.c.ZkTestServer parse host and port list: 127.0.0.1:55977
[junit4] 2> 2947099 INFO (TEST-SyncSliceTest.test-seed#[F8E3B768E16E848D]) [ ] o.a.s.c.ZkTestServer connecting to 127.0.0.1 55977
[junit4] 2> 2947101 INFO (TEST-SyncSliceTest.test-seed#[F8E3B768E16E848D]) [ ] o.a.s.c.c.ConnectionManager Waiting for client to connect to ZooKeeper
[junit4] 2> 2947113 INFO (zkConnectionManagerCallback-17364-thread-1) [ ] o.a.s.c.c.ConnectionManager zkClient has connected
[junit4] 2> 2947113 INFO (TEST-SyncSliceTest.test-seed#[F8E3B768E16E848D]) [ ] o.a.s.c.c.ConnectionManager Client is connected to ZooKeeper
[junit4] 2> 2947116 INFO (TEST-SyncSliceTest.test-seed#[F8E3B768E16E848D]) [ ] o.a.s.c.c.ConnectionManager Waiting for client to connect to ZooKeeper
[junit4] 2> 2947118 INFO (zkConnectionManagerCallback-17366-thread-1) [ ] o.a.s.c.c.ConnectionManager zkClient has connected
[junit4] 2> 2947118 INFO (TEST-SyncSliceTest.test-seed#[F8E3B768E16E848D]) [ ] o.a.s.c.c.ConnectionManager Client is connected to ZooKeeper
[junit4] 2> 2947120 INFO (TEST-SyncSliceTest.test-seed#[F8E3B768E16E848D]) [ ] o.a.s.c.ZkTestServer put /Users/jenkins/workspace/Lucene-Solr-master-MacOSX/solr/core/src/test-files/solr/collection1/conf/solrconfig-tlog.xml to /configs/conf1/solrconfig.xml
[junit4] 2> 2947123 INFO (TEST-SyncSliceTest.test-seed#[F8E3B768E16E848D]) [ ] o.a.s.c.ZkTestServer put /Users/jenkins/workspace/Lucene-Solr-master-MacOSX/solr/core/src/test-files/solr/collection1/conf/schema.xml to /configs/conf1/schema.xml
[junit4] 2> 2947125 INFO (TEST-SyncSliceTest.test-seed#[F8E3B768E16E848D]) [ ] o.a.s.c.ZkTestServer put /Users/jenkins/workspace/Lucene-Solr-master-MacOSX/solr/core/src/test-files/solr/collection1/conf/solrconfig.snippet.randomindexconfig.xml to /configs/conf1/solrconfig.snippet.randomindexconfig.xml
[junit4] 2> 2947127 INFO (TEST-SyncSliceTest.test-seed#[F8E3B768E16E848D]) [ ] o.a.s.c.ZkTestServer put /Users/jenkins/workspace/Lucene-Solr-master-MacOSX/solr/core/src/test-files/solr/collection1/conf/stopwords.txt to /configs/conf1/stopwords.txt
[junit4] 2> 2947130 INFO (TEST-SyncSliceTest.test-seed#[F8E3B768E16E848D]) [ ] o.a.s.c.ZkTestServer put /Users/jenkins/workspace/Lucene-Solr-master-MacOSX/solr/core/src/test-files/solr/collection1/conf/protwords.txt to /configs/conf1/protwords.txt
[junit4] 2> 2947132 INFO (TEST-SyncSliceTest.test-seed#[F8E3B768E16E848D]) [ ] o.a.s.c.ZkTestServer put /Users/jenkins/workspace/Lucene-Solr-master-MacOSX/solr/core/src/test-files/solr/collection1/conf/currency.xml to /configs/conf1/currency.xml
[junit4] 2> 2947135 INFO (TEST-SyncSliceTest.test-seed#[F8E3B768E16E848D]) [ ] o.a.s.c.ZkTestServer put /Users/jenkins/workspace/Lucene-Solr-master-MacOSX/solr/core/src/test-files/solr/collection1/conf/enumsConfig.xml to /configs/conf1/enumsConfig.xml
[junit4] 2> 2947136 INFO (TEST-SyncSliceTest.test-seed#[F8E3B768E16E848D]) [ ] o.a.s.c.ZkTestServer put /Users/jenkins/workspace/Lucene-Solr-master-MacOSX/solr/core/src/test-files/solr/collection1/conf/open-exchange-rates.json to /configs/conf1/open-exchange-rates.json
[junit4] 2> 2947138 INFO (TEST-SyncSliceTest.test-seed#[F8E3B768E16E848D]) [ ] o.a.s.c.ZkTestServer put /Users/jenkins/workspace/Lucene-Solr-master-MacOSX/solr/core/src/test-files/solr/collection1/conf/mapping-ISOLatin1Accent.txt to /configs/conf1/mapping-ISOLatin1Accent.txt
[junit4] 2> 2947140 INFO (TEST-SyncSliceTest.test-seed#[F8E3B768E16E848D]) [ ] o.a.s.c.ZkTestServer put /Users/jenkins/workspace/Lucene-Solr-master-MacOSX/solr/core/src/test-files/solr/collection1/conf/old_synonyms.txt to /configs/conf1/old_synonyms.txt
[junit4] 2> 2947142 INFO (TEST-SyncSliceTest.test-seed#[F8E3B768E16E848D]) [ ] o.a.s.c.ZkTestServer put /Users/jenkins/workspace/Lucene-Solr-master-MacOSX/solr/core/src/test-files/solr/collection1/conf/synonyms.txt to /configs/conf1/synonyms.txt
[junit4] 2> 2947144 INFO (TEST-SyncSliceTest.test-seed#[F8E3B768E16E848D]) [ ] o.a.s.c.AbstractFullDistribZkTestBase Will use NRT replicas unless explicitly asked otherwise
[junit4] 2> 2947669 WARN (TEST-SyncSliceTest.test-seed#[F8E3B768E16E848D]) [ ] o.e.j.s.AbstractConnector Ignoring deprecated socket close linger time
[junit4] 2> 2947670 INFO (TEST-SyncSliceTest.test-seed#[F8E3B768E16E848D]) [ ] o.a.s.c.s.e.JettySolrRunner Start Jetty (configured port=0, binding port=0)
[junit4] 2> 2947670 INFO (TEST-SyncSliceTest.test-seed#[F8E3B768E16E848D]) [ ] o.a.s.c.s.e.JettySolrRunner Trying to start Jetty on port 0 try number 1 ...
[junit4] 2> 2947670 INFO (TEST-SyncSliceTest.test-seed#[F8E3B768E16E848D]) [ ] o.e.j.s.Server jetty-9.4.19.v20190610; built: 2019-06-10T16:30:51.723Z; git: afcf563148970e98786327af5e07c261fda175d3; jvm 13+33
[junit4] 2> 2947671 INFO (TEST-SyncSliceTest.test-seed#[F8E3B768E16E848D]) [ ] o.e.j.s.session DefaultSessionIdManager workerName=node0
[junit4] 2> 2947671 INFO (TEST-SyncSliceTest.test-seed#[F8E3B768E16E848D]) [ ] o.e.j.s.session No SessionScavenger set, using defaults
[junit4] 2> 2947671 INFO (TEST-SyncSliceTest.test-seed#[F8E3B768E16E848D]) [ ] o.e.j.s.session node0 Scavenging every 600000ms
[junit4] 2> 2947673 INFO (TEST-SyncSliceTest.test-seed#[F8E3B768E16E848D]) [ ] o.e.j.s.h.ContextHandler Started o.e.j.s.ServletContextHandler@de3386b{/_fe/ne,null,AVAILABLE}
[junit4] 2> 2947674 INFO (TEST-SyncSliceTest.test-seed#[F8E3B768E16E848D]) [ ] o.e.j.s.AbstractConnector Started ServerConnector@37c716bb{HTTP/1.1,[http/1.1, h2c]}{127.0.0.1:55981}
[junit4] 2> 2947674 INFO (TEST-SyncSliceTest.test-seed#[F8E3B768E16E848D]) [ ] o.e.j.s.Server Started @2947730ms
[junit4] 2> 2947674 INFO (TEST-SyncSliceTest.test-seed#[F8E3B768E16E848D]) [ ] o.a.s.c.s.e.JettySolrRunner Jetty properties: {hostContext=/_fe/ne, solr.data.dir=/Users/jenkins/workspace/Lucene-Solr-master-MacOSX/solr/build/solr-core/test/J0/temp/solr.cloud.SyncSliceTest_F8E3B768E16E848D-001/tempDir-001/control/data, hostPort=55981, coreRootDirectory=/Users/jenkins/workspace/Lucene-Solr-master-MacOSX/solr/build/solr-core/test/J0/../../../../../../../../../Users/jenkins/workspace/Lucene-Solr-master-MacOSX/solr/build/solr-core/test/J0/temp/solr.cloud.SyncSliceTest_F8E3B768E16E848D-001/control-001/cores}
[junit4] 2> 2947674 ERROR (TEST-SyncSliceTest.test-seed#[F8E3B768E16E848D]) [ ] o.a.s.u.StartupLoggingUtils Missing Java Option solr.log.dir. Logging may be missing or incomplete.
[junit4] 2> 2947674 INFO (TEST-SyncSliceTest.test-seed#[F8E3B768E16E848D]) [ ] o.a.s.s.SolrDispatchFilter Using logger factory org.apache.logging.slf4j.Log4jLoggerFactory
[junit4] 2> 2947674 INFO (TEST-SyncSliceTest.test-seed#[F8E3B768E16E848D]) [ ] o.a.s.s.SolrDispatchFilter ___ _ Welcome to Apache Solr? version 9.0.0
[junit4] 2> 2947674 INFO (TEST-SyncSliceTest.test-seed#[F8E3B768E16E848D]) [ ] o.a.s.s.SolrDispatchFilter / __| ___| |_ _ Starting in cloud mode on port null
[junit4] 2> 2947674 INFO (TEST-SyncSliceTest.test-seed#[F8E3B768E16E848D]) [ ] o.a.s.s.SolrDispatchFilter \__ \/ _ \ | '_| Install dir: null
[junit4] 2> 2947674 INFO (TEST-SyncSliceTest.test-seed#[F8E3B768E16E848D]) [ ] o.a.s.s.SolrDispatchFilter |___/\___/_|_| Start time: 2019-10-29T10:10:22.798316Z
[junit4] 2> 2947674 INFO (TEST-SyncSliceTest.test-seed#[F8E3B768E16E848D]) [ ] o.a.s.c.c.ConnectionManager Waiting for client to connect to ZooKeeper
[junit4] 2> 2947681 INFO (zkConnectionManagerCallback-17368-thread-1) [ ] o.a.s.c.c.ConnectionManager zkClient has connected
[junit4] 2> 2947681 INFO (TEST-SyncSliceTest.test-seed#[F8E3B768E16E848D]) [ ] o.a.s.c.c.ConnectionManager Client is connected to ZooKeeper
[junit4] 2> 2947793 INFO (TEST-SyncSliceTest.test-seed#[F8E3B768E16E848D]) [ ] o.a.s.s.SolrDispatchFilter Loading solr.xml from SolrHome (not found in ZooKeeper)
[junit4] 2> 2947793 INFO (TEST-SyncSliceTest.test-seed#[F8E3B768E16E848D]) [ ] o.a.s.c.SolrXmlConfig Loading container configuration from /Users/jenkins/workspace/Lucene-Solr-master-MacOSX/solr/build/solr-core/test/J0/temp/solr.cloud.SyncSliceTest_F8E3B768E16E848D-001/control-001/solr.xml
[junit4] 2> 2947794 INFO (TEST-SyncSliceTest.test-seed#[F8E3B768E16E848D]) [ ] o.a.s.c.SolrXmlConfig Configuration parameter autoReplicaFailoverWorkLoopDelay is ignored
[junit4] 2> 2947794 INFO (TEST-SyncSliceTest.test-seed#[F8E3B768E16E848D]) [ ] o.a.s.c.SolrXmlConfig Configuration parameter autoReplicaFailoverBadNodeExpiration is ignored
[junit4] 2> 2947795 INFO (TEST-SyncSliceTest.test-seed#[F8E3B768E16E848D]) [ ] o.a.s.c.SolrXmlConfig MBean server found: com.sun.jmx.mbeanserver.JmxMBeanServer@789f01d0, but no JMX reporters were configured - adding default JMX reporter.
[junit4] 2> 2947922 INFO (TEST-SyncSliceTest.test-seed#[F8E3B768E16E848D]) [ ] o.a.s.h.c.HttpShardHandlerFactory Host whitelist initialized: WhitelistHostChecker [whitelistHosts=null, whitelistHostCheckingEnabled=false]
[junit4] 2> 2947923 WARN (TEST-SyncSliceTest.test-seed#[F8E3B768E16E848D]) [ ] o.e.j.u.s.S.config Trusting all certificates configured for Client@378ff68d[provider=null,keyStore=null,trustStore=null]
[junit4] 2> 2947923 WARN (TEST-SyncSliceTest.test-seed#[F8E3B768E16E848D]) [ ] o.e.j.u.s.S.config No Client EndPointIdentificationAlgorithm configured for Client@378ff68d[provider=null,keyStore=null,trustStore=null]
[junit4] 2> 2947926 WARN (TEST-SyncSliceTest.test-seed#[F8E3B768E16E848D]) [ ] o.e.j.u.s.S.config Trusting all certificates configured for Client@d135dfa[provider=null,keyStore=null,trustStore=null]
[junit4] 2> 2947926 WARN (TEST-SyncSliceTest.test-seed#[F8E3B768E16E848D]) [ ] o.e.j.u.s.S.config No Client EndPointIdentificationAlgorithm configured for Client@d135dfa[provider=null,keyStore=null,trustStore=null]
[junit4] 2> 2947926 INFO (TEST-SyncSliceTest.test-seed#[F8E3B768E16E848D]) [ ] o.a.s.c.ZkContainer Zookeeper client=127.0.0.1:55977/solr
[junit4] 2> 2947927 INFO (TEST-SyncSliceTest.test-seed#[F8E3B768E16E848D]) [ ] o.a.s.c.c.ConnectionManager Waiting for client to connect to ZooKeeper
[junit4] 2> 2947930 INFO (zkConnectionManagerCallback-17375-thread-1) [ ] o.a.s.c.c.ConnectionManager zkClient has connected
[junit4] 2> 2947930 INFO (TEST-SyncSliceTest.test-seed#[F8E3B768E16E848D]) [ ] o.a.s.c.c.ConnectionManager Client is connected to ZooKeeper
[junit4] 2> 2948043 INFO (TEST-SyncSliceTest.test-seed#[F8E3B768E16E848D]) [n:127.0.0.1:55981__fe%2Fne ] o.a.s.c.c.ConnectionManager Waiting for client to connect to ZooKeeper
[junit4] 2> 2948045 INFO (zkConnectionManagerCallback-17377-thread-1) [ ] o.a.s.c.c.ConnectionManager zkClient has connected
[junit4] 2> 2948045 INFO (TEST-SyncSliceTest.test-seed#[F8E3B768E16E848D]) [n:127.0.0.1:55981__fe%2Fne ] o.a.s.c.c.ConnectionManager Client is connected to ZooKeeper
[junit4] 2> 2948199 INFO (TEST-SyncSliceTest.test-seed#[F8E3B768E16E848D]) [n:127.0.0.1:55981__fe%2Fne ] o.a.s.c.OverseerElectionContext I am going to be the leader 127.0.0.1:55981__fe%2Fne
[junit4] 2> 2948200 INFO (TEST-SyncSliceTest.test-seed#[F8E3B768E16E848D]) [n:127.0.0.1:55981__fe%2Fne ] o.a.s.c.Overseer Overseer (id=72100888026742788-127.0.0.1:55981__fe%2Fne-n_0000000000) starting
[junit4] 2> 2948211 INFO (OverseerStateUpdate-72100888026742788-127.0.0.1:55981__fe%2Fne-n_0000000000) [n:127.0.0.1:55981__fe%2Fne ] o.a.s.c.Overseer Starting to work on the main queue : 127.0.0.1:55981__fe%2Fne
[junit4] 2> 2948212 INFO (TEST-SyncSliceTest.test-seed#[F8E3B768E16E848D]) [n:127.0.0.1:55981__fe%2Fne ] o.a.s.c.ZkController Register node as live in ZooKeeper:/live_nodes/127.0.0.1:55981__fe%2Fne
[junit4] 2> 2948213 INFO (OverseerStateUpdate-72100888026742788-127.0.0.1:55981__fe%2Fne-n_0000000000) [n:127.0.0.1:55981__fe%2Fne ] o.a.s.c.c.ZkStateReader Updated live nodes from ZooKeeper... (0) -> (1)
[junit4] 2> 2948235 INFO (TEST-SyncSliceTest.test-seed#[F8E3B768E16E848D]) [n:127.0.0.1:55981__fe%2Fne ] o.a.s.h.a.MetricsHistoryHandler No .system collection, keeping metrics history in memory.
[junit4] 2> 2948251 INFO (TEST-SyncSliceTest.test-seed#[F8E3B768E16E848D]) [n:127.0.0.1:55981__fe%2Fne ] o.a.s.m.r.SolrJmxReporter JMX monitoring for 'solr.node' (registry 'solr.node') enabled at server: com.sun.jmx.mbeanserver.JmxMBeanServer@789f01d0
[junit4] 2> 2948260 INFO (TEST-SyncSliceTest.test-seed#[F8E3B768E16E848D]) [n:127.0.0.1:55981__fe%2Fne ] o.a.s.m.r.SolrJmxReporter JMX monitoring for 'solr.jvm' (registry 'solr.jvm') enabled at server: com.sun.jmx.mbeanserver.JmxMBeanServer@789f01d0
[junit4] 2> 2948260 INFO (TEST-SyncSliceTest.test-seed#[F8E3B768E16E848D]) [n:127.0.0.1:55981__fe%2Fne ] o.a.s.m.r.SolrJmxReporter JMX monitoring for 'solr.jetty' (registry 'solr.jetty') enabled at server: com.sun.jmx.mbeanserver.JmxMBeanServer@789f01d0
[junit4] 2> 2948262 INFO (TEST-SyncSliceTest.test-seed#[F8E3B768E16E848D]) [n:127.0.0.1:55981__fe%2Fne ] o.a.s.c.CorePropertiesLocator Found 0 core definitions underneath /Users/jenkins/workspace/Lucene-Solr-master-MacOSX/solr/build/solr-core/test/J0/../../../../../../../../../Users/jenkins/workspace/Lucene-Solr-master-MacOSX/solr/build/solr-core/test/J0/temp/solr.cloud.SyncSliceTest_F8E3B768E16E848D-001/control-001/cores
[junit4] 2> 2948276 INFO (TEST-SyncSliceTest.test-seed#[F8E3B768E16E848D]) [ ] o.a.s.c.c.ConnectionManager Waiting for client to connect to ZooKeeper
[junit4] 2> 2948279 INFO (zkConnectionManagerCallback-17386-thread-1) [ ] o.a.s.c.c.ConnectionManager zkClient has connected
[junit4] 2> 2948279 INFO (TEST-SyncSliceTest.test-seed#[F8E3B768E16E848D]) [ ] o.a.s.c.c.ConnectionManager Client is connected to ZooKeeper
[junit4] 2> 2948281 INFO (TEST-SyncSliceTest.test-seed#[F8E3B768E16E848D]) [ ] o.a.s.c.c.ZkStateReader Updated live nodes from ZooKeeper... (0) -> (1)
[junit4] 2> 2948283 INFO (TEST-SyncSliceTest.test-seed#[F8E3B768E16E848D]) [ ] o.a.s.c.s.i.ZkClientClusterStateProvider Cluster at 127.0.0.1:55977/solr ready
[junit4] 2> 2948285 INFO (qtp685066223-44547) [n:127.0.0.1:55981__fe%2Fne ] o.a.s.h.a.CollectionsHandler Invoked Collection Action :create with params collection.configName=conf1&name=control_collection&nrtReplicas=1&action=CREATE&numShards=1&createNodeSet=127.0.0.1:55981__fe%252Fne&wt=javabin&version=2 and sendToOCPQueue=true
[junit4] 2> 2948292 INFO (OverseerThreadFactory-13329-thread-1-processing-n:127.0.0.1:55981__fe%2Fne) [n:127.0.0.1:55981__fe%2Fne ] o.a.s.c.a.c.CreateCollectionCmd Create collection control_collection
[junit4] 2> 2948408 INFO (qtp685066223-44549) [n:127.0.0.1:55981__fe%2Fne x:control_collection_shard1_replica_n1 ] o.a.s.h.a.CoreAdminOperation core create command qt=/admin/cores&collection.configName=conf1&newCollection=true&name=control_collection_shard1_replica_n1&action=CREATE&numShards=1&collection=control_collection&shard=shard1&wt=javabin&version=2&replicaType=NRT
[junit4] 2> 2948408 INFO (qtp685066223-44549) [n:127.0.0.1:55981__fe%2Fne x:control_collection_shard1_replica_n1 ] o.a.s.c.TransientSolrCoreCacheDefault Allocating transient cache for 4 transient cores
[junit4] 2> 2949432 INFO (qtp685066223-44549) [n:127.0.0.1:55981__fe%2Fne c:control_collection s:shard1 x:control_collection_shard1_replica_n1 ] o.a.s.c.SolrConfig Using Lucene MatchVersion: 9.0.0
[junit4] 2> 2949450 INFO (qtp685066223-44549) [n:127.0.0.1:55981__fe%2Fne c:control_collection s:shard1 x:control_collection_shard1_replica_n1 ] o.a.s.s.IndexSchema [control_collection_shard1_replica_n1] Schema name=test
[junit4] 2> 2949527 INFO (qtp685066223-44549) [n:127.0.0.1:55981__fe%2Fne c:control_collection s:shard1 x:control_collection_shard1_replica_n1 ] o.a.s.s.IndexSchema Loaded schema test/1.0 with uniqueid field id
[junit4] 2> 2949558 INFO (qtp685066223-44549) [n:127.0.0.1:55981__fe%2Fne c:control_collection s:shard1 x:control_collection_shard1_replica_n1 ] o.a.s.c.CoreContainer Creating SolrCore 'control_collection_shard1_replica_n1' using configuration from collection control_collection, trusted=true
[junit4] 2> 2949559 INFO (qtp685066223-44549) [n:127.0.0.1:55981__fe%2Fne c:control_collection s:shard1 x:control_collection_shard1_replica_n1 ] o.a.s.m.r.SolrJmxReporter JMX monitoring for 'solr.core.control_collection.shard1.replica_n1' (registry 'solr.core.control_collection.shard1.replica_n1') enabled at server: com.sun.jmx.mbeanserver.JmxMBeanServer@789f01d0
[junit4] 2> 2949559 INFO (qtp685066223-44549) [n:127.0.0.1:55981__fe%2Fne c:control_collection s:shard1 x:control_collection_shard1_replica_n1 ] o.a.s.c.SolrCore [[control_collection_shard1_replica_n1] ] Opening new SolrCore at [/Users/jenkins/workspace/Lucene-Solr-master-MacOSX/solr/build/solr-core/test/J0/temp/solr.cloud.SyncSliceTest_F8E3B768E16E848D-001/control-001/cores/control_collection_shard1_replica_n1], dataDir=[/Users/jenkins/workspace/Lucene-Solr-master-MacOSX/solr/build/solr-core/test/J0/../../../../../../../../../Users/jenkins/workspace/Lucene-Solr-master-MacOSX/solr/build/solr-core/test/J0/temp/solr.cloud.SyncSliceTest_F8E3B768E16E848D-001/control-001/cores/control_collection_shard1_replica_n1/data/]
[junit4] 2> 2949561 INFO (qtp685066223-44549) [n:127.0.0.1:55981__fe%2Fne c:control_collection s:shard1 x:control_collection_shard1_replica_n1 ] o.a.s.u.RandomMergePolicy RandomMergePolicy wrapping class org.apache.lucene.index.TieredMergePolicy: [TieredMergePolicy: maxMergeAtOnce=48, maxMergeAtOnceExplicit=44, maxMergedSegmentMB=45.640625, floorSegmentMB=1.8779296875, forceMergeDeletesPctAllowed=1.7813437358346063, segmentsPerTier=20.0, maxCFSSegmentSizeMB=8.796093022207999E12, noCFSRatio=0.0, deletesPctAllowed=46.630504914417436
[junit4] 2> 2949563 WARN (qtp685066223-44549) [n:127.0.0.1:55981__fe%2Fne c:control_collection s:shard1 x:control_collection_shard1_replica_n1 ] o.a.s.c.RequestHandlers INVALID paramSet a in requestHandler {type = requestHandler,name = /dump,class = DumpRequestHandler,attributes = {initParams=a, name=/dump, class=DumpRequestHandler},args = {defaults={a=A, b=B}}}
[junit4] 2> 2949609 INFO (qtp685066223-44549) [n:127.0.0.1:55981__fe%2Fne c:control_collection s:shard1 x:control_collection_shard1_replica_n1 ] o.a.s.u.UpdateHandler Using UpdateLog implementation: org.apache.solr.update.UpdateLog
[junit4] 2> 2949609 INFO (qtp685066223-44549) [n:127.0.0.1:55981__fe%2Fne c:control_collection s:shard1 x:control_collection_shard1_replica_n1 ] o.a.s.u.UpdateLog Initializing UpdateLog: dataDir= defaultSyncLevel=FLUSH numRecordsToKeep=100 maxNumLogsToKeep=10 numVersionBuckets=65536
[junit4] 2> 2949610 INFO (qtp685066223-44549) [n:127.0.0.1:55981__fe%2Fne c:control_collection s:shard1 x:control_collection_shard1_replica_n1 ] o.a.s.u.CommitTracker Hard AutoCommit: disabled
[junit4] 2> 2949611 INFO (qtp685066223-44549) [n:127.0.0.1:55981__fe%2Fne c:control_collection s:shard1 x:control_collection_shard1_replica_n1 ] o.a.s.u.CommitTracker Soft AutoCommit: disabled
[junit4] 2> 2949611 INFO (qtp685066223-44549) [n:127.0.0.1:55981__fe%2Fne c:control_collection s:shard1 x:control_collection_shard1_replica_n1 ] o.a.s.u.RandomMergePolicy RandomMergePolicy wrapping class org.apache.lucene.index.LogDocMergePolicy: [LogDocMergePolicy: minMergeSize=1000, mergeFactor=48, maxMergeSize=9223372036854775807, maxMergeSizeForForcedMerge=9223372036854775807, calibrateSizeByDeletes=false, maxMergeDocs=2147483647, maxCFSSegmentSizeMB=8.796093022207999E12, noCFSRatio=0.14464361836871265]
[junit4] 2> 2949612 INFO (qtp685066223-44549) [n:127.0.0.1:55981__fe%2Fne c:control_collection s:shard1 x:control_collection_shard1_replica_n1 ] o.a.s.s.SolrIndexSearcher Opening [Searcher@1dfadcf[control_collection_shard1_replica_n1] main]
[junit4] 2> 2949615 INFO (qtp685066223-44549) [n:127.0.0.1:55981__fe%2Fne c:control_collection s:shard1 x:control_collection_shard1_replica_n1 ] o.a.s.r.ManagedResourceStorage Configured ZooKeeperStorageIO with znodeBase: /configs/conf1
[junit4] 2> 2949615 INFO (qtp685066223-44549) [n:127.0.0.1:55981__fe%2Fne c:control_collection s:shard1 x:control_collection_shard1_replica_n1 ] o.a.s.r.ManagedResourceStorage Loaded null at path _rest_managed.json using ZooKeeperStorageIO:path=/configs/conf1
[junit4] 2> 2949616 INFO (qtp685066223-44549) [n:127.0.0.1:55981__fe%2Fne c:control_collection s:shard1 x:control_collection_shard1_replica_n1 ] o.a.s.h.ReplicationHandler Commits will be reserved for 10000ms.
[junit4] 2> 2949616 INFO (qtp685066223-44549) [n:127.0.0.1:55981__fe%2Fne c:control_collection s:shard1 x:control_collection_shard1_replica_n1 ] o.a.s.u.UpdateLog Could not find max version in index or recent updates, using new clock 1648721998370570240
[junit4] 2> 2949619 INFO (searcherExecutor-13334-thread-1-processing-n:127.0.0.1:55981__fe%2Fne x:control_collection_shard1_replica_n1 c:control_collection s:shard1) [n:127.0.0.1:55981__fe%2Fne c:control_collection s:shard1 x:control_collection_shard1_replica_n1 ] o.a.s.c.SolrCore [control_collection_shard1_replica_n1] Registered new searcher Searcher@1dfadcf[control_collection_shard1_replica_n1] main{ExitableDirectoryReader(UninvertingDirectoryReader())}
[junit4] 2> 2949624 INFO (qtp685066223-44549) [n:127.0.0.1:55981__fe%2Fne c:control_collection s:shard1 x:control_collection_shard1_replica_n1 ] o.a.s.c.ZkShardTerms Successful update of terms at /collections/control_collection/terms/shard1 to Terms{values={core_node2=0}, version=0}
[junit4] 2> 2949624 INFO (qtp685066223-44549) [n:127.0.0.1:55981__fe%2Fne c:control_collection s:shard1 x:control_collection_shard1_replica_n1 ] o.a.s.c.ShardLeaderElectionContextBase make sure parent is created /collections/control_collection/leaders/shard1
[junit4] 2> 2949631 INFO (qtp685066223-44549) [n:127.0.0.1:55981__fe%2Fne c:control_collection s:shard1 x:control_collection_shard1_replica_n1 ] o.a.s.c.ShardLeaderElectionContext Enough replicas found to continue.
[junit4] 2> 2949631 INFO (qtp685066223-44549) [n:127.0.0.1:55981__fe%2Fne c:control_collection s:shard1 x:control_collection_shard1_replica_n1 ] o.a.s.c.ShardLeaderElectionContext I may be the new leader - try and sync
[junit4] 2> 2949632 INFO (qtp685066223-44549) [n:127.0.0.1:55981__fe%2Fne c:control_collection s:shard1 x:control_collection_shard1_replica_n1 ] o.a.s.c.SyncStrategy Sync replicas to http://127.0.0.1:55981/_fe/ne/control_collection_shard1_replica_n1/
[junit4] 2> 2949633 INFO (qtp685066223-44549) [n:127.0.0.1:55981__fe%2Fne c:control_collection s:shard1 x:control_collection_shard1_replica_n1 ] o.a.s.c.SyncStrategy Sync Success - now sync replicas to me
[junit4] 2> 2949634 INFO (qtp685066223-44549) [n:127.0.0.1:55981__fe%2Fne c:control_collection s:shard1 x:control_collection_shard1_replica_n1 ] o.a.s.c.SyncStrategy http://127.0.0.1:55981/_fe/ne/control_collection_shard1_replica_n1/ has no replicas
[junit4] 2> 2949634 INFO (qtp685066223-44549) [n:127.0.0.1:55981__fe%2Fne c:control_collection s:shard1 x:control_collection_shard1_replica_n1 ] o.a.s.c.ShardLeaderElectionContextBase Creating leader registration node /collections/control_collection/leaders/shard1/leader after winning as /collections/control_collection/leader_elect/shard1/election/72100888026742788-core_node2-n_0000000000
[junit4] 2> 2949637 INFO (qtp685066223-44549) [n:127.0.0.1:55981__fe%2Fne c:control_collection s:shard1 x:control_collection_shard1_replica_n1 ] o.a.s.c.ShardLeaderElectionContext I am the new leader: http://127.0.0.1:55981/_fe/ne/control_collection_shard1_replica_n1/ shard1
[junit4] 2> 2949740 INFO (zkCallback-17376-thread-1) [ ] o.a.s.c.c.ZkStateReader A cluster state change: [WatchedEvent state:SyncConnected type:NodeDataChanged path:/collections/control_collection/state.json] for collection [control_collection] has occurred - updating... (live nodes size: [1])
[junit4] 2> 2949741 INFO (zkCallback-17376-thread-2) [ ] o.a.s.c.c.ZkStateReader A cluster state change: [WatchedEvent state:SyncConnected type:NodeDataChanged path:/collections/control_collection/state.json] for collection [control_collection] has occurred - updating... (live nodes size: [1])
[junit4] 2> 2949743 INFO (qtp685066223-44549) [n:127.0.0.1:55981__fe%2Fne c:control_collection s:shard1 x:control_collection_shard1_replica_n1 ] o.a.s.c.ZkController I am the leader, no recovery necessary
[junit4] 2> 2949749 INFO (qtp685066223-44549) [n:127.0.0.1:55981__fe%2Fne c:control_collection s:shard1 x:control_collection_shard1_replica_n1 ] o.a.s.s.HttpSolrCall [admin] webapp=null path=/admin/cores params={qt=/admin/cores&collection.configName=conf1&newCollection=true&name=control_collection_shard1_replica_n1&action=CREATE&numShards=1&collection=control_collection&shard=shard1&wt=javabin&version=2&replicaType=NRT} status=0 QTime=1341
[junit4] 2> 2949753 INFO (qtp685066223-44547) [n:127.0.0.1:55981__fe%2Fne ] o.a.s.h.a.CollectionsHandler Wait for new collection to be active for at most 45 seconds. Check all shard replicas
[junit4] 2> 2949858 INFO (zkCallback-17376-thread-2) [ ] o.a.s.c.c.ZkStateReader A cluster state change: [WatchedEvent state:SyncConnected type:NodeDataChanged path:/collections/control_collection/state.json] for collection [control_collection] has occurred - updating... (live nodes size: [1])
[junit4] 2> 2949858 INFO (zkCallback-17376-thread-3) [ ] o.a.s.c.c.ZkStateReader A cluster state change: [WatchedEvent state:SyncConnected type:NodeDataChanged path:/collections/control_collection/state.json] for collection [control_collection] has occurred - updating... (live nodes size: [1])
[junit4] 2> 2949858 INFO (zkCallback-17376-thread-1) [ ] o.a.s.c.c.ZkStateReader A cluster state change: [WatchedEvent state:SyncConnected type:NodeDataChanged path:/collections/control_collection/state.json] for collection [control_collection] has occurred - updating... (live nodes size: [1])
[junit4] 2> 2949858 INFO (qtp685066223-44547) [n:127.0.0.1:55981__fe%2Fne ] o.a.s.s.HttpSolrCall [admin] webapp=null path=/admin/collections params={collection.configName=conf1&name=control_collection&nrtReplicas=1&action=CREATE&numShards=1&createNodeSet=127.0.0.1:55981__fe%252Fne&wt=javabin&version=2} status=0 QTime=1572
[junit4] 2> 2949858 INFO (TEST-SyncSliceTest.test-seed#[F8E3B768E16E848D]) [ ] o.a.s.c.AbstractFullDistribZkTestBase Waiting to see 1 active replicas in collection: control_collection
[junit4] 2> 2949971 INFO (TEST-SyncSliceTest.test-seed#[F8E3B768E16E848D]) [ ] o.a.s.c.c.ConnectionManager Waiting for client to connect to ZooKeeper
[junit4] 2> 2949974 INFO (zkConnectionManagerCallback-17392-thread-1) [ ] o.a.s.c.c.ConnectionManager zkClient has connected
[junit4] 2> 2949974 INFO (TEST-SyncSliceTest.test-seed#[F8E3B768E16E848D]) [ ] o.a.s.c.c.ConnectionManager Client is connected to ZooKeeper
[junit4] 2> 2949976 INFO (TEST-SyncSliceTest.test-seed#[F8E3B768E16E848D]) [ ] o.a.s.c.c.ZkStateReader Updated live nodes from ZooKeeper... (0) -> (1)
[junit4] 2> 2949978 INFO (TEST-SyncSliceTest.test-seed#[F8E3B768E16E848D]) [ ] o.a.s.c.s.i.ZkClientClusterStateProvider Cluster at 127.0.0.1:55977/solr ready
[junit4] 2> 2949978 INFO (TEST-SyncSliceTest.test-seed#[F8E3B768E16E848D]) [ ] o.a.s.c.ChaosMonkey monkey: init - expire sessions:false cause connection loss:false
[junit4] 2> 2949982 INFO (qtp685066223-44548) [n:127.0.0.1:55981__fe%2Fne ] o.a.s.h.a.CollectionsHandler Invoked Collection Action :create with params collection.configName=conf1&name=collection1&nrtReplicas=1&action=CREATE&numShards=1&createNodeSet=&stateFormat=1&wt=javabin&version=2 and sendToOCPQueue=true
[junit4] 2> 2949988 INFO (OverseerThreadFactory-13329-thread-2-processing-n:127.0.0.1:55981__fe%2Fne) [n:127.0.0.1:55981__fe%2Fne ] o.a.s.c.a.c.CreateCollectionCmd Create collection collection1
[junit4] 2> 2949989 INFO (OverseerCollectionConfigSetProcessor-72100888026742788-127.0.0.1:55981__fe%2Fne-n_0000000000) [n:127.0.0.1:55981__fe%2Fne ] o.a.s.c.OverseerTaskQueue Response ZK path: /overseer/collection-queue-work/qnr-0000000000 doesn't exist. Requestor may have disconnected from ZooKeeper
[junit4] 2> 2950205 WARN (OverseerThreadFactory-13329-thread-2-processing-n:127.0.0.1:55981__fe%2Fne) [n:127.0.0.1:55981__fe%2Fne ] o.a.s.c.a.c.CreateCollectionCmd It is unusual to create a collection (collection1) without cores.
[junit4] 2> 2950208 INFO (qtp685066223-44548) [n:127.0.0.1:55981__fe%2Fne ] o.a.s.h.a.CollectionsHandler Wait for new collection to be active for at most 45 seconds. Check all shard replicas
[junit4] 2> 2950209 INFO (qtp685066223-44548) [n:127.0.0.1:55981__fe%2Fne ] o.a.s.s.HttpSolrCall [admin] webapp=null path=/admin/collections params={collection.configName=conf1&name=collection1&nrtReplicas=1&action=CREATE&numShards=1&createNodeSet=&stateFormat=1&wt=javabin&version=2} status=0 QTime=231
[junit4] 2> 2950211 INFO (TEST-SyncSliceTest.test-seed#[F8E3B768E16E848D]) [ ] o.a.s.c.SolrCloudTestCase active slice count: 1 expected:1
[junit4] 2> 2950211 INFO (TEST-SyncSliceTest.test-seed#[F8E3B768E16E848D]) [ ] o.a.s.c.SolrCloudTestCase active replica count: 0 expected replica count: 0
[junit4] 2> 2950211 INFO (TEST-SyncSliceTest.test-seed#[F8E3B768E16E848D]) [ ] o.a.s.c.SolrCloudTestCase active slice count: 1 expected:1
[junit4] 2> 2950211 INFO (TEST-SyncSliceTest.test-seed#[F8E3B768E16E848D]) [ ] o.a.s.c.SolrCloudTestCase active replica count: 0 expected replica count: 0
[junit4] 2> 2950211 INFO (TEST-SyncSliceTest.test-seed#[F8E3B768E16E848D]) [ ] o.a.s.c.SolrCloudTestCase active slice count: 1 expected:1
[junit4] 2> 2950211 INFO (TEST-SyncSliceTest.test-seed#[F8E3B768E16E848D]) [ ] o.a.s.c.SolrCloudTestCase active replica count: 0 expected replica count: 0
[junit4] 2> 2950211 INFO (TEST-SyncSliceTest.test-seed#[F8E3B768E16E848D]) [ ] o.a.s.c.AbstractFullDistribZkTestBase Creating jetty instances pullReplicaCount=0 numOtherReplicas=4
[junit4] 2> 2950497 INFO (TEST-SyncSliceTest.test-seed#[F8E3B768E16E848D]) [ ] o.a.s.c.AbstractFullDistribZkTestBase create jetty 1 in directory /Users/jenkins/workspace/Lucene-Solr-master-MacOSX/solr/build/solr-core/test/J0/temp/solr.cloud.SyncSliceTest_F8E3B768E16E848D-001/shard-1-001 of type NRT
[junit4] 2> 2950498 WARN (closeThreadPool-17393-thread-1) [ ] o.e.j.s.AbstractConnector Ignoring deprecated socket close linger time
[junit4] 2> 2950498 INFO (closeThreadPool-17393-thread-1) [ ] o.a.s.c.s.e.JettySolrRunner Start Jetty (configured port=0, binding port=0)
[junit4] 2> 2950499 INFO (closeThreadPool-17393-thread-1) [ ] o.a.s.c.s.e.JettySolrRunner Trying to start Jetty on port 0 try number 1 ...
[junit4] 2> 2950499 INFO (closeThreadPool-17393-thread-1) [ ] o.e.j.s.Server jetty-9.4.19.v20190610; built: 2019-06-10T16:30:51.723Z; git: afcf563148970e98786327af5e07c261fda175d3; jvm 13+33
[junit4] 2> 2950500 INFO (closeThreadPool-17393-thread-1) [ ] o.e.j.s.session DefaultSessionIdManager workerName=node0
[junit4] 2> 2950500 INFO (closeThreadPool-17393-thread-1) [ ] o.e.j.s.session No SessionScavenger set, using defaults
[junit4] 2> 2950500 INFO (closeThreadPool-17393-thread-1) [ ] o.e.j.s.session node0 Scavenging every 660000ms
[junit4] 2> 2950500 INFO (closeThreadPool-17393-thread-1) [ ] o.e.j.s.h.ContextHandler Started o.e.j.s.ServletContextHandler@486ef6ee{/_fe/ne,null,AVAILABLE}
[junit4] 2> 2950501 INFO (closeThreadPool-17393-thread-1) [ ] o.e.j.s.AbstractConnector Started ServerConnector@421d7dfa{HTTP/1.1,[http/1.1, h2c]}{127.0.0.1:55991}
[junit4] 2> 2950501 INFO (closeThreadPool-17393-thread-1) [ ] o.e.j.s.Server Started @2950557ms
[junit4] 2> 2950501 INFO (closeThreadPool-17393-thread-1) [ ] o.a.s.c.s.e.JettySolrRunner Jetty properties: {hostContext=/_fe/ne, solrconfig=solrconfig.xml, solr.data.dir=/Users/jenkins/workspace/Lucene-Solr-master-MacOSX/solr/build/solr-core/test/J0/temp/solr.cloud.SyncSliceTest_F8E3B768E16E848D-001/tempDir-001/jetty1, hostPort=55991, coreRootDirectory=/Users/jenkins/workspace/Lucene-Solr-master-MacOSX/solr/build/solr-core/test/J0/temp/solr.cloud.SyncSliceTest_F8E3B768E16E848D-001/shard-1-001/cores}
[junit4] 2> 2950501 ERROR (closeThreadPool-17393-thread-1) [ ] o.a.s.u.StartupLoggingUtils Missing Java Option solr.log.dir. Logging may be missing or incomplete.
[junit4] 2> 2950501 INFO (closeThreadPool-17393-thread-1) [ ] o.a.s.s.SolrDispatchFilter Using logger factory org.apache.logging.slf4j.Log4jLoggerFactory
[junit4] 2> 2950501 INFO (closeThreadPool-17393-thread-1) [ ] o.a.s.s.SolrDispatchFilter ___ _ Welcome to Apache Solr? version 9.0.0
[junit4] 2> 2950501 INFO (closeThreadPool-17393-thread-1) [ ] o.a.s.s.SolrDispatchFilter / __| ___| |_ _ Starting in cloud mode on port null
[junit4] 2> 2950501 INFO (closeThreadPool-17393-thread-1) [ ] o.a.s.s.SolrDispatchFilter \__ \/ _ \ | '_| Install dir: null
[junit4] 2> 2950501 INFO (closeThreadPool-17393-thread-1) [ ] o.a.s.s.SolrDispatchFilter |___/\___/_|_| Start time: 2019-10-29T10:10:25.625649Z
[junit4] 2> 2950502 INFO (closeThreadPool-17393-thread-1) [ ] o.a.s.c.c.ConnectionManager Waiting for client to connect to ZooKeeper
[junit4] 2> 2950505 INFO (zkConnectionManagerCallback-17395-thread-1) [ ] o.a.s.c.c.ConnectionManager zkClient has connected
[junit4] 2> 2950505 INFO (closeThreadPool-17393-thread-1) [ ] o.a.s.c.c.ConnectionManager Client is connected to ZooKeeper
[junit4] 2> 2950611 INFO (closeThreadPool-17393-thread-1) [ ] o.a.s.s.SolrDispatchFilter Loading solr.xml from SolrHome (not found in ZooKeeper)
[junit4] 2> 2950611 INFO (closeThreadPool-17393-thread-1) [ ] o.a.s.c.SolrXmlConfig Loading container configuration from /Users/jenkins/workspace/Lucene-Solr-master-MacOSX/solr/build/solr-core/test/J0/temp/solr.cloud.SyncSliceTest_F8E3B768E16E848D-001/shard-1-001/solr.xml
[junit4] 2> 2950614 INFO (closeThreadPool-17393-thread-1) [ ] o.a.s.c.SolrXmlConfig Configuration parameter autoReplicaFailoverWorkLoopDelay is ignored
[junit4] 2> 2950614 INFO (closeThreadPool-17393-thread-1) [ ] o.a.s.c.SolrXmlConfig Configuration parameter autoReplicaFailoverBadNodeExpiration is ignored
[junit4] 2> 2950616 INFO (closeThreadPool-17393-thread-1) [ ] o.a.s.c.SolrXmlConfig MBean server found: com.sun.jmx.mbeanserver.JmxMBeanServer@789f01d0, but no JMX reporters were configured - adding default JMX reporter.
[junit4] 2> 2950651 INFO (closeThreadPool-17393-thread-1) [ ] o.a.s.h.c.HttpShardHandlerFactory Host whitelist initialized: WhitelistHostChecker [whitelistHosts=null, whitelistHostCheckingEnabled=false]
[junit4] 2> 2950652 WARN (closeThreadPool-17393-thread-1) [ ] o.e.j.u.s.S.config Trusting all certificates configured for Client@6a327406[provider=null,keyStore=null,trustStore=null]
[junit4] 2> 2950652 WARN (closeThreadPool-17393-thread-1) [ ] o.e.j.u.s.S.config No Client EndPointIdentificationAlgorithm configured for Client@6a327406[provider=null,keyStore=null,trustStore=null]
[junit4] 2> 2950656 WARN (closeThreadPool-17393-thread-1) [ ] o.e.j.u.s.S.config Trusting all certificates configured for Client@2dddfd97[provider=null,keyStore=null,trustStore=null]
[junit4] 2> 2950656 WARN (closeThreadPool-17393-thread-1) [ ] o.e.j.u.s.S.config No Client EndPointIdentificationAlgorithm configured for Client@2dddfd97[provider=null,keyStore=null,trustStore=null]
[junit4] 2> 2950657 INFO (closeThreadPool-17393-thread-1) [ ] o.a.s.c.ZkContainer Zookeeper client=127.0.0.1:55977/solr
[junit4] 2> 2950658 INFO (closeThreadPool-17393-thread-1) [ ] o.a.s.c.c.ConnectionManager Waiting for client to connect to ZooKeeper
[junit4] 2> 2950661 INFO (zkConnectionManagerCallback-17402-thread-1) [ ] o.a.s.c.c.ConnectionManager zkClient has connected
[junit4] 2> 2950661 INFO (closeThreadPool-17393-thread-1) [ ] o.a.s.c.c.ConnectionManager Client is connected to ZooKeeper
[junit4] 2> 2950765 INFO (closeThreadPool-17393-thread-1) [n:127.0.0.1:55991__fe%2Fne ] o.a.s.c.c.ConnectionManager Waiting for client to connect to ZooKeeper
[junit4] 2> 2950768 INFO (zkConnectionManagerCallback-17404-thread-1) [ ] o.a.s.c.c.ConnectionManager zkClient has connected
[junit4] 2> 2950768 INFO (closeThreadPool-17393-thread-1) [n:127.0.0.1:55991__fe%2Fne ] o.a.s.c.c.ConnectionManager Client is connected to ZooKeeper
[junit4] 2> 2950779 INFO (closeThreadPool-17393-thread-1) [n:127.0.0.1:55991__fe%2Fne ] o.a.s.c.c.ZkStateReader Updated live nodes from ZooKeeper... (0) -> (1)
[junit4] 2> 2950789 INFO (closeThreadPool-17393-thread-1) [n:127.0.0.1:55991__fe%2Fne ] o.a.s.c.ZkController Publish node=127.0.0.1:55991__fe%2Fne as DOWN
[junit4] 2> 2950792 INFO (closeThreadPool-17393-thread-1) [n:127.0.0.1:55991__fe%2Fne ] o.a.s.c.TransientSolrCoreCacheDefault Allocating transient cache for 4 transient cores
[junit4] 2> 2950792 INFO (closeThreadPool-17393-thread-1) [n:127.0.0.1:55991__fe%2Fne ] o.a.s.c.ZkController Register node as live in ZooKeeper:/live_nodes/127.0.0.1:55991__fe%2Fne
[junit4] 2> 2950796 INFO (zkCallback-17391-thread-1) [ ] o.a.s.c.c.ZkStateReader Updated live nodes from ZooKeeper... (1) -> (2)
[junit4] 2> 2950796 INFO (zkCallback-17376-thread-1) [ ] o.a.s.c.c.ZkStateReader Updated live nodes from ZooKeeper... (1) -> (2)
[junit4] 2> 2950796 INFO (zkCallback-17403-thread-1) [ ] o.a.s.c.c.ZkStateReader Updated live nodes from ZooKeeper... (1) -> (2)
[junit4] 2> 2950804 INFO (TEST-SyncSliceTest.test-seed#[F8E3B768E16E848D]) [ ] o.a.s.c.AbstractFullDistribZkTestBase create jetty 2 in directory /Users/jenkins/workspace/Lucene-Solr-master-MacOSX/solr/build/solr-core/test/J0/temp/solr.cloud.SyncSliceTest_F8E3B768E16E848D-001/shard-2-001 of type NRT
[junit4] 2> 2950805 WARN (closeThreadPool-17393-thread-2) [ ] o.e.j.s.AbstractConnector Ignoring deprecated socket close linger time
[junit4] 2> 2950805 INFO (closeThreadPool-17393-thread-2) [ ] o.a.s.c.s.e.JettySolrRunner Start Jetty (configured port=0, binding port=0)
[junit4] 2> 2950805 INFO (closeThreadPool-17393-thread-2) [ ] o.a.s.c.s.e.JettySolrRunner Trying to start Jetty on port 0 try number 1 ...
[junit4] 2> 2950805 INFO (closeThreadPool-17393-thread-2) [ ] o.e.j.s.Server jetty-9.4.19.v20190610; built: 2019-06-10T16:30:51.723Z; git: afcf563148970e98786327af5e07c261fda175d3; jvm 13+33
[junit4] 2> 2950807 INFO (closeThreadPool-17393-thread-2) [ ] o.e.j.s.session DefaultSessionIdManager workerName=node0
[junit4] 2> 2950807 INFO (closeThreadPool-17393-thread-2) [ ] o.e.j.s.session No SessionScavenger set, using defaults
[junit4] 2> 2950807 INFO (closeThreadPool-17393-thread-2) [ ] o.e.j.s.session node0 Scavenging every 600000ms
[junit4] 2> 2950807 INFO (closeThreadPool-17393-thread-2) [ ] o.e.j.s.h.ContextHandler Started o.e.j.s.ServletContextHandler@53aa5371{/_fe/ne,null,AVAILABLE}
[junit4] 2> 2950807 INFO (closeThreadPool-17393-thread-2) [ ] o.e.j.s.AbstractConnector Started ServerConnector@ddfb6ca{HTTP/1.1,[http/1.1, h2c]}{127.0.0.1:55995}
[junit4] 2> 2950808 INFO (closeThreadPool-17393-thread-2) [ ] o.e.j.s.Server Started @2950864ms
[junit4] 2> 2950808 INFO (closeThreadPool-17393-thread-2) [ ] o.a.s.c.s.e.JettySolrRunner Jetty properties: {hostContext=/_fe/ne, solrconfig=solrconfig.xml, solr.data.dir=/Users/jenkins/workspace/Lucene-Solr-master-MacOSX/solr/build/solr-core/test/J0/temp/solr.cloud.SyncSliceTest_F8E3B768E16E848D-001/tempDir-001/jetty2, hostPort=55995, coreRootDirectory=/Users/jenkins/workspace/Lucene-Solr-master-MacOSX/solr/build/solr-core/test/J0/temp/solr.cloud.SyncSliceTest_F8E3B768E16E848D-001/shard-2-001/cores}
[junit4] 2> 2950808 ERROR (closeThreadPool-17393-thread-2) [ ] o.a.s.u.StartupLoggingUtils Missing Java Option solr.log.dir. Logging may be missing or incomplete.
[junit4] 2> 2950808 INFO (closeThreadPool-17393-thread-2) [ ] o.a.s.s.SolrDispatchFilter Using logger factory org.apache.logging.slf4j.Log4jLoggerFactory
[junit4] 2> 2950808 INFO (closeThreadPool-17393-thread-2) [ ] o.a.s.s.SolrDispatchFilter ___ _ Welcome to Apache Solr? version 9.0.0
[junit4] 2> 2950808 INFO (closeThreadPool-17393-thread-2) [ ] o.a.s.s.SolrDispatchFilter / __| ___| |_ _ Starting in cloud mode on port null
[junit4] 2> 2950808 INFO (closeThreadPool-17393-thread-2) [ ] o.a.s.s.SolrDispatchFilter \__ \/ _ \ | '_| Install dir: null
[junit4] 2> 2950808 INFO (closeThreadPool-17393-thread-2) [ ] o.a.s.s.SolrDispatchFilter |___/\___/_|_| Start time: 2019-10-29T10:10:25.932582Z
[junit4] 2> 2950810 INFO (closeThreadPool-17393-thread-2) [ ] o.a.s.c.c.ConnectionManager Waiting for client to connect to ZooKeeper
[junit4] 2> 2950813 INFO (zkConnectionManagerCallback-17409-thread-1) [ ] o.a.s.c.c.ConnectionManager zkClient has connected
[junit4] 2> 2950813 INFO (closeThreadPool-17393-thread-2) [ ] o.a.s.c.c.ConnectionManager Client is connected to ZooKeeper
[junit4] 2> 2950818 INFO (closeThreadPool-17393-thread-1) [n:127.0.0.1:55991__fe%2Fne ] o.a.s.h.a.MetricsHistoryHandler No .system collection, keeping metrics history in memory.
[junit4] 2> 2950840 INFO (closeThreadPool-17393-thread-1) [n:127.0.0.1:55991__fe%2Fne ] o.a.s.m.r.SolrJmxReporter JMX monitoring for 'solr.node' (registry 'solr.node') enabled at server: com.sun.jmx.mbeanserver.JmxMBeanServer@789f01d0
[junit4] 2> 2950855 INFO (closeThreadPool-17393-thread-1) [n:127.0.0.1:55991__fe%2Fne ] o.a.s.m.r.SolrJmxReporter JMX monitoring for 'solr.jvm' (registry 'solr.jvm') enabled at server: com.sun.jmx.mbeanserver.JmxMBeanServer@789f01d0
[junit4] 2> 2950856 INFO (closeThreadPool-17393-thread-1) [n:127.0.0.1:55991__fe%2Fne ] o.a.s.m.r.SolrJmxReporter JMX monitoring for 'solr.jetty' (registry 'solr.jetty') enabled at server: com.sun.jmx.mbeanserver.JmxMBeanServer@789f01d0
[junit4] 2> 2950916 INFO (closeThreadPool-17393-thread-2) [ ] o.a.s.s.SolrDispatchFilter Loading solr.xml from SolrHome (not found in ZooKeeper)
[junit4] 2> 2950917 INFO (closeThreadPool-17393-thread-2) [ ] o.a.s.c.SolrXmlConfig Loading container configuration from /Users/jenkins/workspace/Lucene-Solr-master-MacOSX/solr/build/solr-core/test/J0/temp/solr.cloud.SyncSliceTest_F8E3B768E16E848D-001/shard-2-001/solr.xml
[junit4] 2> 2950918 INFO (closeThreadPool-17393-thread-1) [n:127.0.0.1:55991__fe%2Fne ] o.a.s.c.CorePropertiesLocator Found 0 core definitions underneath /Users/jenkins/workspace/Lucene-Solr-master-MacOSX/solr/build/solr-core/test/J0/temp/solr.cloud.SyncSliceTest_F8E3B768E16E848D-001/shard-1-001/cores
[junit4] 2> 2950926 INFO (closeThreadPool-17393-thread-2) [ ] o.a.s.c.SolrXmlConfig Configuration parameter autoReplicaFailoverWorkLoopDelay is ignored
[junit4] 2> 2950926 INFO (closeThreadPool-17393-thread-2) [ ] o.a.s.c.SolrXmlConfig Configuration parameter autoReplicaFailoverBadNodeExpiration is ignored
[junit4] 2> 2950926 INFO (closeThreadPool-17393-thread-2) [ ] o.a.s.c.SolrXmlConfig MBean server found: com.sun.jmx.mbeanserver.JmxMBeanServer@789f01d0, but no JMX reporters were configured - adding default JMX reporter.
[junit4] 2> 2950950 INFO (closeThreadPool-17393-thread-1) [ ] o.a.s.c.AbstractFullDistribZkTestBase waitForLiveNode: 127.0.0.1:55991__fe%2Fne
[junit4] 2> 2950968 INFO (closeThreadPool-17393-thread-2) [ ] o.a.s.h.c.HttpShardHandlerFactory Host whitelist initialized: WhitelistHostChecker [whitelistHosts=null, whitelistHostCheckingEnabled=false]
[junit4] 2> 2950969 WARN (closeThreadPool-17393-thread-2) [ ] o.e.j.u.s.S.config Trusting all certificates configured for Client@6268e21c[provider=null,keyStore=null,trustStore=null]
[junit4] 2> 2950969 WARN (closeThreadPool-17393-thread-2) [ ] o.e.j.u.s.S.config No Client EndPointIdentificationAlgorithm configured for Client@6268e21c[provider=null,keyStore=null,trustStore=null]
[junit4] 2> 2950972 WARN (closeThreadPool-17393-thread-2) [ ] o.e.j.u.s.S.config Trusting all certificates configured for Client@6f1b3b8[provider=null,keyStore=null,trustStore=null]
[junit4] 2> 2950972 WARN (closeThreadPool-17393-thread-2) [ ] o.e.j.u.s.S.config No Client EndPointIdentificationAlgorithm configured for Client@6f1b3b8[provider=null,keyStore=null,trustStore=null]
[junit4] 2> 2950972 INFO (closeThreadPool-17393-thread-2) [ ] o.a.s.c.ZkContainer Zookeeper client=127.0.0.1:55977/solr
[junit4] 2> 2950973 INFO (closeThreadPool-17393-thread-2) [ ] o.a.s.c.c.ConnectionManager Waiting for client to connect to ZooKeeper
[junit4] 2> 2950978 INFO (zkConnectionManagerCallback-17417-thread-1) [ ] o.a.s.c.c.ConnectionManager zkClient has connected
[junit4] 2> 2950979 INFO (closeThreadPool-17393-thread-2) [ ] o.a.s.c.c.ConnectionManager Client is connected to ZooKeeper
[junit4] 2> 2951087 INFO (closeThreadPool-17393-thread-2) [n:127.0.0.1:55995__fe%2Fne ] o.a.s.c.c.ConnectionManager Waiting for client to connect to ZooKeeper
[junit4] 2> 2951090 INFO (zkConnectionManagerCallback-17419-thread-1) [ ] o.a.s.c.c.ConnectionManager zkClient has connected
[junit4] 2> 2951090 INFO (closeThreadPool-17393-thread-2) [n:127.0.0.1:55995__fe%2Fne ] o.a.s.c.c.ConnectionManager Client is connected to ZooKeeper
[junit4] 2> 2951104 INFO (closeThreadPool-17393-thread-2) [n:127.0.0.1:55995__fe%2Fne ] o.a.s.c.c.ZkStateReader Updated live nodes from ZooKeeper... (0) -> (2)
[junit4] 2> 2951118 INFO (closeThreadPool-17393-thread-2) [n:127.0.0.1:55995__fe%2Fne ] o.a.s.c.ZkController Publish node=127.0.0.1:55995__fe%2Fne as DOWN
[junit4] 2> 2951121 INFO (closeThreadPool-17393-thread-2) [n:127.0.0.1:55995__fe%2Fne ] o.a.s.c.TransientSolrCoreCacheDefault Allocating transient cache for 4 transient cores
[junit4] 2> 2951121 INFO (closeThreadPool-17393-thread-2) [n:127.0.0.1:55995__fe%2Fne ] o.a.s.c.ZkController Register node as live in ZooKeeper:/live_nodes/127.0.0.1:55995__fe%2Fne
[junit4] 2> 2951124 INFO (zkCallback-17391-thread-1) [ ] o.a.s.c.c.ZkStateReader Updated live nodes from ZooKeeper... (2) -> (3)
[junit4] 2> 2951124 INFO (zkCallback-17376-thread-1) [ ] o.a.s.c.c.ZkStateReader Updated live nodes from ZooKeeper... (2) -> (3)
[junit4] 2> 2951124 INFO (zkCallback-17403-thread-1) [ ] o.a.s.c.c.ZkStateReader Updated live nodes from ZooKeeper... (2) -> (3)
[junit4] 2> 2951124 INFO (zkCallback-17418-thread-1) [ ] o.a.s.c.c.ZkStateReader Updated live nodes from ZooKeeper... (2) -> (3)
[junit4] 2> 2951154 INFO (closeThreadPool-17393-thread-2) [n:127.0.0.1:55995__fe%2Fne ] o.a.s.h.a.MetricsHistoryHandler No .system collection, keeping metrics history in memory.
[junit4] 2> 2951177 INFO (closeThreadPool-17393-thread-2) [n:127.0.0.1:55995__fe%2Fne ] o.a.s.m.r.SolrJmxReporter JMX monitoring for 'solr.node' (registry 'solr.node') enabled at server: com.sun.jmx.mbeanserver.JmxMBeanServer@789f01d0
[junit4] 2> 2951187 INFO (closeThreadPool-17393-thread-2) [n:127.0.0.1:55995__fe%2Fne ] o.a.s.m.r.SolrJmxReporter JMX monitoring for 'solr.jvm' (registry 'solr.jvm') enabled at server: com.sun.jmx.mbeanserver.JmxMBeanServer@789f01d0
[junit4] 2> 2951189 INFO (closeThreadPool-17393-thread-2) [n:127.0.0.1:55995__fe%2Fne ] o.a.s.m.r.SolrJmxReporter JMX monitoring for 'solr.jetty' (registry 'solr.jetty') enabled at server: com.sun.jmx.mbeanserver.JmxMBeanServer@789f01d0
[junit4] 2> 2951197 INFO (closeThreadPool-17393-thread-2) [n:127.0.0.1:55995__fe%2Fne ] o.a.s.c.CorePropertiesLocator Found 0 core definitions underneath /Users/jenkins/workspace/Lucene-Solr-master-MacOSX/solr/build/solr-core/test/J0/temp/solr.cloud.SyncSliceTest_F8E3B768E16E848D-001/shard-2-001/cores
[junit4] 2> 2951209 INFO (TEST-SyncSliceTest.test-seed#[F8E3B768E16E848D]) [ ] o.a.s.c.AbstractFullDistribZkTestBase create jetty 3 in directory /Users/jenkins/workspace/Lucene-Solr-master-MacOSX/solr/build/solr-core/test/J0/temp/solr.cloud.SyncSliceTest_F8E3B768E16E848D-001/shard-3-001 of type NRT
[junit4] 2> 2951209 WARN (closeThreadPool-17393-thread-1) [ ] o.e.j.s.AbstractConnector Ignoring deprecated socket close linger time
[junit4] 2> 2951210 INFO (closeThreadPool-17393-thread-1) [ ] o.a.s.c.s.e.JettySolrRunner Start Jetty (configured port=0, binding port=0)
[junit4] 2> 2951210 INFO (closeThreadPool-17393-thread-1) [ ] o.a.s.c.s.e.JettySolrRunner Trying to start Jetty on port 0 try number 1 ...
[junit4] 2> 2951210 INFO (closeThreadPool-17393-thread-1) [ ] o.e.j.s.Server jetty-9.4.19.v20190610; built: 2019-06-10T16:30:51.723Z; git: afcf563148970e98786327af5e07c261fda175d3; jvm 13+33
[junit4] 2> 2951211 INFO (closeThreadPool-17393-thread-1) [ ] o.e.j.s.session DefaultSessionIdManager workerName=node0
[junit4] 2> 2951211 INFO (closeThreadPool-17393-thread-1) [ ] o.e.j.s.session No SessionScavenger set, using defaults
[junit4] 2> 2951211 INFO (closeThreadPool-17393-thread-1) [ ] o.e.j.s.session node0 Scavenging every 600000ms
[junit4] 2> 2951212 INFO (closeThreadPool-17393-thread-1) [ ] o.e.j.s.h.ContextHandler Started o.e.j.s.ServletContextHandler@4506e179{/_fe/ne,null,AVAILABLE}
[junit4] 2> 2951212 INFO (closeThreadPool-17393-thread-1) [ ] o.e.j.s.AbstractConnector Started ServerConnector@38847714{HTTP/1.1,[http/1.1, h2c]}{127.0.0.1:55999}
[junit4] 2> 2951212 INFO (closeThreadPool-17393-thread-1) [ ] o.e.j.s.Server Started @2951268ms
[junit4] 2> 2951212 INFO (closeThreadPool-17393-thread-1) [ ] o.a.s.c.s.e.JettySolrRunner Jetty properties: {hostContext=/_fe/ne, solrconfig=solrconfig.xml, solr.data.dir=/Users/jenkins/workspace/Lucene-Solr-master-MacOSX/solr/build/solr-core/test/J0/temp/solr.cloud.SyncSliceTest_F8E3B768E16E848D-001/tempDir-001/jetty3, hostPort=55999, coreRootDirectory=/Users/jenkins/workspace/Lucene-Solr-master-MacOSX/solr/build/solr-core/test/J0/../../../../../../../../../Users/jenkins/workspace/Lucene-Solr-master-MacOSX/solr/build/solr-core/test/J0/temp/solr.cloud.SyncSliceTest_F8E3B768E16E848D-001/shard-3-001/cores, replicaType=NRT}
[junit4] 2> 2951212 ERROR (closeThreadPool-17393-thread-1) [ ] o.a.s.u.StartupLoggingUtils Missing Java Option solr.log.dir. Logging may be missing or incomplete.
[junit4] 2> 2951212 INFO (closeThreadPool-17393-thread-1) [ ] o.a.s.s.SolrDispatchFilter Using logger factory org.apache.logging.slf4j.Log4jLoggerFactory
[junit4] 2> 2951212 INFO (closeThreadPool-17393-thread-1) [ ] o.a.s.s.SolrDispatchFilter ___ _ Welcome to Apache Solr? version 9.0.0
[junit4] 2> 2951212 INFO (closeThreadPool-17393-thread-1) [ ] o.a.s.s.SolrDispatchFilter / __| ___| |_ _ Starting in cloud mode on port null
[junit4] 2> 2951212 INFO (closeThreadPool-17393-thread-1) [ ] o.a.s.s.SolrDispatchFilter \__ \/ _ \ | '_| Install dir: null
[junit4] 2> 2951212 INFO (closeThreadPool-17393-thread-1) [ ] o.a.s.s.SolrDispatchFilter |___/\___/_|_| Start time: 2019-10-29T10:10:26.336850Z
[junit4] 2> 2951214 INFO (closeThreadPool-17393-thread-1) [ ] o.a.s.c.c.ConnectionManager Waiting for client to connect to ZooKeeper
[junit4] 2> 2951216 INFO (zkConnectionManagerCallback-17425-thread-1) [ ] o.a.s.c.c.ConnectionManager zkClient has connected
[junit4] 2> 2951216 INFO (closeThreadPool-17393-thread-1) [ ] o.a.s.c.c.ConnectionManager Client is connected to ZooKeeper
[junit4] 2> 2951225 INFO (closeThreadPool-17393-thread-2) [ ] o.a.s.c.AbstractFullDistribZkTestBase waitForLiveNode: 127.0.0.1:55995__fe%2Fne
[junit4] 2> 2951327 INFO (closeThreadPool-17393-thread-1) [ ] o.a.s.s.SolrDispatchFilter Loading solr.xml from SolrHome (not found in ZooKeeper)
[junit4] 2> 2951327 INFO (closeThreadPool-17393-thread-1) [ ] o.a.s.c.SolrXmlConfig Loading container configuration from /Users/jenkins/workspace/Lucene-Solr-master-MacOSX/solr/build/solr-core/test/J0/temp/solr.cloud.SyncSliceTest_F8E3B768E16E848D-001/shard-3-001/solr.xml
[junit4] 2> 2951329 INFO (closeThreadPool-17393-thread-1) [ ] o.a.s.c.SolrXmlConfig Configuration parameter autoReplicaFailoverWorkLoopDelay is ignored
[junit4] 2> 2951329 INFO (closeThreadPool-17393-thread-1) [ ] o.a.s.c.SolrXmlConfig Configuration parameter autoReplicaFailoverBadNodeExpiration is ignored
[junit4] 2> 2951331 INFO (closeThreadPool-17393-thread-1) [ ] o.a.s.c.SolrXmlConfig MBean server found: com.sun.jmx.mbeanserver.JmxMBeanServer@789f01d0, but no JMX reporters were configured - adding default JMX reporter.
[junit4] 2> 2951433 INFO (closeThreadPool-17393-thread-1) [ ] o.a.s.h.c.HttpShardHandlerFactory Host whitelist initialized: WhitelistHostChecker [whitelistHosts=null, whitelistHostCheckingEnabled=false]
[junit4] 2> 2951434 WARN (closeThreadPool-17393-thread-1) [ ] o.e.j.u.s.S.config Trusting all certificates configured for Client@135351b7[provider=null,keyStore=null,trustStore=null]
[junit4] 2> 2951434 WARN (closeThreadPool-17393-thread-1) [ ] o.e.j.u.s.S.config No Client EndPointIdentificationAlgorithm configured for Client@135351b7[provider=null,keyStore=null,trustStore=null]
[junit4] 2> 2951438 WARN (closeThreadPool-17393-thread-1) [ ] o.e.j.u.s.S.config Trusting all certificates configured for Client@42f38c88[provider=null,keyStore=null,trustStore=null]
[junit4] 2> 2951438 WARN (closeThreadPool-17393-thread-1) [ ] o.e.j.u.s.S.config No Client EndPointIdentificationAlgorithm configured for Client@42f38c88[provider=null,keyStore=null,trustStore=null]
[junit4] 2> 2951439 INFO (closeThreadPool-17393-thread-1) [ ] o.a.s.c.ZkContainer Zookeeper client=127.0.0.1:55977/solr
[junit4] 2> 2951440 INFO (closeThreadPool-17393-thread-1) [ ] o.a.s.c.c.ConnectionManager Waiting for client to connect to ZooKeeper
[junit4] 2> 2951443 INFO (zkConnectionManagerCallback-17432-thread-1) [ ] o.a.s.c.c.ConnectionManager zkClient has connected
[junit4] 2> 2951443 INFO (closeThreadPool-17393-thread-1) [ ] o.a.s.c.c.ConnectionManager Client is connected to ZooKeeper
[junit4] 2> 2951547 INFO (closeThreadPool-17393-thread-1) [ ] o.a.s.c.c.ConnectionManager Waiting for client to connect to ZooKeeper
[junit4] 2> 2951550 INFO (zkConnectionManagerCallback-17434-thread-1) [ ] o.a.s.c.c.ConnectionManager zkClient has connected
[junit4] 2> 2951550 INFO (closeThreadPool-17393-thread-1) [ ] o.a.s.c.c.ConnectionManager Client is connected to ZooKeeper
[junit4] 2> 2951561 INFO (closeThreadPool-17393-thread-1) [ ] o.a.s.c.c.ZkStateReader Updated live nodes from ZooKeeper... (0) -> (3)
[junit4] 2> 2951570 INFO (closeThreadPool-17393-thread-1) [ ] o.a.s.c.ZkController Publish node=127.0.0.1:55999__fe%2Fne as DOWN
[junit4] 2> 2951572 INFO (closeThreadPool-17393-thread-1) [ ] o.a.s.c.TransientSolrCoreCacheDefault Allocating transient cache for 4 transient cores
[junit4] 2> 2951572 INFO (closeThreadPool-17393-thread-1) [ ] o.a.s.c.ZkController Register node as live in ZooKeeper:/live_nodes/127.0.0.1:55999__fe%2Fne
[junit4] 2> 2951575 INFO (zkCallback-17376-thread-1) [ ] o.a.s.c.c.ZkStateReader Updated live nodes from ZooKeeper... (3) -> (4)
[junit4] 2> 2951575 INFO (zkCallback-17418-thread-1) [ ] o.a.s.c.c.ZkStateReader Updated live nodes from ZooKeeper... (3) -> (4)
[junit4] 2> 2951575 INFO (zkCallback-17433-thread-1) [ ] o.a.s.c.c.ZkStateReader Updated live nodes from ZooKeeper... (3) -> (4)
[junit4] 2> 2951575 INFO (zkCallback-17403-thread-1) [ ] o.a.s.c.c.ZkStateReader Updated live nodes from ZooKeeper... (3) -> (4)
[junit4] 2> 2951575 INFO (zkCallback-17391-thread-1) [ ] o.a.s.c.c.ZkStateReader Updated live nodes from ZooKeeper... (3) -> (4)
[junit4] 2> 2951596 INFO (closeThreadPool-17393-thread-1) [ ] o.a.s.h.a.MetricsHistoryHandler No .system collection, keeping metrics history in memory.
[junit4] 2> 2951620 INFO (closeThreadPool-17393-thread-1) [ ] o.a.s.m.r.SolrJmxReporter JMX monitoring for 'solr.node' (registry 'solr.node') enabled at server: com.sun.jmx.mbeanserver.JmxMBeanServer@789f01d0
[junit4] 2> 2951620 INFO (TEST-SyncSliceTest.test-seed#[F8E3B768E16E848D]) [ ] o.a.s.c.AbstractFullDistribZkTestBase create jetty 4 in directory /Users/jenkins/workspace/Lucene-Solr-master-MacOSX/solr/build/solr-core/test/J0/temp/solr.cloud.SyncSliceTest_F8E3B768E16E848D-001/shard-4-001 of type NRT
[junit4] 2> 2951621 WARN (closeThreadPool-17393-thread-2) [ ] o.e.j.s.AbstractConnector Ignoring deprecated socket close linger time
[junit4] 2> 2951621 INFO (closeThreadPool-17393-thread-2) [ ] o.a.s.c.s.e.JettySolrRunner Start Jetty (configured port=0, binding port=0)
[junit4] 2> 2951621 INFO (closeThreadPool-17393-thread-2) [ ] o.a.s.c.s.e.JettySolrRunner Trying to start Jetty on port 0 try number 1 ...
[junit4] 2> 2951621 INFO (closeThreadPool-17393-thread-2) [ ] o.e.j.s.Server jetty-9.4.19.v20190610; built: 2019-06-10T16:30:51.723Z; git: afcf563148970e98786327af5e07c261fda175d3; jvm 13+33
[junit4] 2> 2951622 INFO (closeThreadPool-17393-thread-2) [ ] o.e.j.s.session DefaultSessionIdManager workerName=node0
[junit4] 2> 2951623 INFO (closeThreadPool-17393-thread-2) [ ] o.e.j.s.session No SessionScavenger set, using defaults
[junit4] 2> 2951623 INFO (closeThreadPool-17393-thread-2) [ ] o.e.j.s.session node0 Scavenging every 600000ms
[junit4] 2> 2951623 INFO (closeThreadPool-17393-thread-2) [ ] o.e.j.s.h.ContextHandler Started o.e.j.s.ServletContextHandler@5d4e3783{/_fe/ne,null,AVAILABLE}
[junit4] 2> 2951624 INFO (closeThreadPool-17393-thread-2) [ ] o.e.j.s.AbstractConnector Started ServerConnector@4f717223{HTTP/1.1,[http/1.1, h2c]}{127.0.0.1:56003}
[junit4] 2> 2951624 INFO (closeThreadPool-17393-thread-2) [ ] o.e.j.s.Server Started @2951680ms
[junit4] 2> 2951624 INFO (closeThreadPool-17393-thread-2) [ ] o.a.s.c.s.e.JettySolrRunner Jetty properties: {hostContext=/_fe/ne, solrconfig=solrconfig.xml, solr.data.dir=/Users/jenkins/workspace/Lucene-Solr-master-MacOSX/solr/build/solr-core/test/J0/temp/solr.cloud.SyncSliceTest_F8E3B768E16E848D-001/tempDir-001/jetty4, hostPort=56003, coreRootDirectory=/Users/jenkins/workspace/Lucene-Solr-master-MacOSX/solr/build/solr-core/test/J0/../../../../../../../../../Users/jenkins/workspace/Lucene-Solr-master-MacOSX/solr/build/solr-core/test/J0/temp/solr.cloud.SyncSliceTest_F8E3B768E16E848D-001/shard-4-001/cores, replicaType=NRT}
[junit4] 2> 2951625 ERROR (closeThreadPool-17393-thread-2) [ ] o.a.s.u.StartupLoggingUtils Missing Java Option solr.log.dir. Logging may be missing or incomplete.
[junit4] 2> 2951625 INFO (closeThreadPool-17393-thread-2) [ ] o.a.s.s.SolrDispatchFilter Using logger factory org.apache.logging.slf4j.Log4jLoggerFactory
[junit4] 2> 2951625 INFO (closeThreadPool-17393-thread-2) [ ] o.a.s.s.SolrDispatchFilter ___ _ Welcome to Apache Solr? version 9.0.0
[junit4] 2> 2951625 INFO (closeThreadPool-17393-thread-2) [ ] o.a.s.s.SolrDispatchFilter / __| ___| |_ _ Starting in cloud mode on port null
[junit4] 2> 2951625 INFO (closeThreadPool-17393-thread-2) [ ] o.a.s.s.SolrDispatchFilter \__ \/ _ \ | '_| Install dir: null
[junit4] 2> 2951625 INFO (closeThreadPool-17393-thread-2) [ ] o.a.s.s.SolrDispatchFilter |___/\___/_|_| Start time: 2019-10-29T10:10:26.749349Z
[junit4] 2> 2951626 INFO (closeThreadPool-17393-thread-2) [ ] o.a.s.c.c.ConnectionManager Waiting for client to connect to ZooKeeper
[junit4] 2> 2951628 INFO (zkConnectionManagerCallback-17440-thread-1) [ ] o.a.s.c.c.ConnectionManager zkClient has connected
[junit4] 2> 2951628 INFO (closeThreadPool-17393-thread-2) [ ] o.a.s.c.c.ConnectionManager Client is connected to ZooKeeper
[junit4] 2> 2951632 INFO (closeThreadPool-17393-thread-1) [ ] o.a.s.m.r.SolrJmxReporter JMX monitoring for 'solr.jvm' (registry 'solr.jvm') enabled at server: com.sun.jmx.mbeanserver.JmxMBeanServer@789f01d0
[junit4] 2> 2951632 INFO (closeThreadPool-17393-thread-1) [ ] o.a.s.m.r.SolrJmxReporter JMX monitoring for 'solr.jetty' (registry 'solr.jetty') enabled at server: com.sun.jmx.mbeanserver.JmxMBeanServer@789f01d0
[junit4] 2> 2951634 INFO (closeThreadPool-17393-thread-1) [ ] o.a.s.c.CorePropertiesLocator Found 0 core definitions underneath /Users/jenkins/workspace/Lucene-Solr-master-MacOSX/solr/build/solr-core/test/J0/../../../../../../../../../Users/jenkins/workspace/Lucene-Solr-master-MacOSX/solr/build/solr-core/test/J0/temp/solr.cloud.SyncSliceTest_F8E3B768E16E848D-001/shard-3-001/cores
[junit4] 2> 2951675 INFO (closeThreadPool-17393-thread-1) [ ] o.a.s.c.AbstractFullDistribZkTestBase waitForLiveNode: 127.0.0.1:55999__fe%2Fne
[junit4] 2> 2951739 INFO (closeThreadPool-17393-thread-2) [ ] o.a.s.s.SolrDispatchFilter Loading solr.xml from SolrHome (not found in ZooKeeper)
[junit4] 2> 2951740 INFO (closeThreadPool-17393-thread-2) [ ] o.a.s.c.SolrXmlConfig Loading container configuration from /Users/jenkins/workspace/Lucene-Solr-master-MacOSX/solr/build/solr-core/test/J0/temp/solr.cloud.SyncSliceTest_F8E3B768E16E848D-001/shard-4-001/solr.xml
[junit4] 2> 2951742 INFO (closeThreadPool-17393-thread-2) [ ] o.a.s.c.SolrXmlConfig Configuration parameter autoReplicaFailoverWorkLoopDelay is ignored
[junit4] 2> 2951742 INFO (closeThreadPool-17393-thread-2) [ ] o.a.s.c.SolrXmlConfig Configuration parameter autoReplicaFailoverBadNodeExpiration is ignored
[junit4] 2> 2951743 INFO (closeThreadPool-17393-thread-2) [ ] o.a.s.c.SolrXmlConfig MBean server found: com.sun.jmx.mbeanserver.JmxMBeanServer@789f01d0, but no JMX reporters were configured - adding default JMX reporter.
[junit4] 2> 2951778 INFO (closeThreadPool-17393-thread-2) [ ] o.a.s.h.c.HttpShardHandlerFactory Host whitelist initialized: WhitelistHostChecker [whitelistHosts=null, whitelistHostCheckingEnabled=false]
[junit4] 2> 2951778 WARN (closeThreadPool-17393-thread-2) [ ] o.e.j.u.s.S.config Trusting all certificates configured for Client@45f01a85[provider=null,keyStore=null,trustStore=null]
[junit4] 2> 2951778 WARN (closeThreadPool-17393-thread-2) [ ] o.e.j.u.s.S.config No Client EndPointIdentificationAlgorithm configured for Client@45f01a85[provider=null,keyStore=null,trustStore=null]
[junit4] 2> 2951784 WARN (closeThreadPool-17393-thread-2) [ ] o.e.j.u.s.S.config Trusting all certificates configured for Client@24f4a798[provider=null,keyStore=null,trustStore=null]
[junit4] 2> 2951784 WARN (closeThreadPool-17393-thread-2) [ ] o.e.j.u.s.S.config No Client EndPointIdentificationAlgorithm configured for Client@24f4a798[provider=null,keyStore=null,trustStore=null]
[junit4] 2> 2951785 INFO (closeThreadPool-17393-thread-2) [ ] o.a.s.c.ZkContainer Zookeeper client=127.0.0.1:55977/solr
[junit4] 2> 2951786 INFO (closeThreadPool-17393-thread-2) [ ] o.a.s.c.c.ConnectionManager Waiting for client to connect to ZooKeeper
[junit4] 2> 2951788 INFO (zkConnectionManagerCallback-17447-thread-1) [ ] o.a.s.c.c.ConnectionManager zkClient has connected
[junit4] 2> 2951788 INFO (closeThreadPool-17393-thread-2) [ ] o.a.s.c.c.ConnectionManager Client is connected to ZooKeeper
[junit4] 2> 2951892 INFO (closeThreadPool-17393-thread-2) [ ] o.a.s.c.c.ConnectionManager Waiting for client to connect to ZooKeeper
[junit4] 2> 2951894 INFO (zkConnectionManagerCallback-17449-thread-1) [ ] o.a.s.c.c.ConnectionManager zkClient has connected
[junit4] 2> 2951894 INFO (closeThreadPool-17393-thread-2) [ ] o.a.s.c.c.ConnectionManager Client is connected to ZooKeeper
[junit4] 2> 2951904 INFO (closeThreadPool-17393-thread-2) [ ] o.a.s.c.c.ZkStateReader Updated live nodes from ZooKeeper... (0) -> (4)
[junit4] 2> 2951912 INFO (closeThreadPool-17393-thread-2) [ ] o.a.s.c.ZkController Publish node=127.0.0.1:56003__fe%2Fne as DOWN
[junit4] 2> 2951914 INFO (closeThreadPool-17393-thread-2) [ ] o.a.s.c.TransientSolrCoreCacheDefault Allocating transient cache for 4 transient cores
[junit4] 2> 2951914 INFO (closeThreadPool-17393-thread-2) [ ] o.a.s.c.ZkController Register node as live in ZooKeeper:/live_nodes/127.0.0.1:56003__fe%2Fne
[junit4] 2> 2951917 INFO (zkCallback-17433-thread-1) [ ] o.a.s.c.c.ZkStateReader Updated live nodes from ZooKeeper... (4) -> (5)
[junit4] 2> 2951917 INFO (zkCallback-17418-thread-1) [ ] o.a.s.c.c.ZkStateReader Updated live nodes from ZooKeeper... (4) -> (5)
[junit4] 2> 2951917 INFO (zkCallback-17448-thread-1) [ ] o.a.s.c.c.ZkStateReader Updated live nodes from ZooKeeper... (4) -> (5)
[junit4] 2> 2951917 INFO (zkCallback-17376-thread-1) [ ] o.a.s.c.c.ZkStateReader Updated live nodes from ZooKeeper... (4) -> (5)
[junit4] 2> 2951918 INFO (zkCallback-17391-thread-1) [ ] o.a.s.c.c.ZkStateReader Updated live nodes from ZooKeeper... (4) -> (5)
[junit4] 2> 2951918 INFO (zkCallback-17403-thread-1) [ ] o.a.s.c.c.ZkStateReader Updated live nodes from ZooKeeper... (4) -> (5)
[junit4] 2> 2951938 INFO (closeThreadPool-17393-thread-2) [ ] o.a.s.h.a.MetricsHistoryHandler No .system collection, keeping metrics history in memory.
[junit4] 2> 2951954 INFO (closeThreadPool-17393-thread-2) [ ] o.a.s.m.r.SolrJmxReporter JMX monitoring for 'solr.node' (registry 'solr.node') enabled at server: com.sun.jmx.mbeanserver.JmxMBeanServer@789f01d0
[junit4] 2> 2951963 INFO (closeThreadPool-17393-thread-2) [ ] o.a.s.m.r.SolrJmxReporter JMX monitoring for 'solr.jvm' (registry 'solr.jvm') enabled at server: com.sun.jmx.mbeanserver.JmxMBeanServer@789f01d0
[junit4] 2> 2951963 INFO (closeThreadPool-17393-thread-2) [ ] o.a.s.m.r.SolrJmxReporter JMX monitoring for 'solr.jetty' (registry 'solr.jetty') enabled at server: com.sun.jmx.mbeanserver.JmxMBeanServer@789f01d0
[junit4] 2> 2951965 INFO (closeThreadPool-17393-thread-2) [ ] o.a.s.c.CorePropertiesLocator Found 0 core definitions underneath /Users/jenkins/workspace/Lucene-Solr-master-MacOSX/solr/build/solr-core/test/J0/../../../../../../../../../Users/jenkins/workspace/Lucene-Solr-master-MacOSX/solr/build/solr-core/test/J0/temp/solr.cloud.SyncSliceTest_F8E3B768E16E848D-001/shard-4-001/cores
[junit4] 2> 2951992 INFO (OverseerCollectionConfigSetProcessor-72100888026742788-127.0.0.1:55981__fe%2Fne-n_0000000000) [n:127.0.0.1:55981__fe%2Fne ] o.a.s.c.OverseerTaskQueue Response ZK path: /overseer/collection-queue-work/qnr-0000000002 doesn't exist. Requestor may have disconnected from ZooKeeper
[junit4] 2> 2952002 INFO (closeThreadPool-17393-thread-2) [ ] o.a.s.c.AbstractFullDistribZkTestBase waitForLiveNode: 127.0.0.1:56003__fe%2Fne
[junit4] 2> 2952005 INFO (qtp685066223-44549) [n:127.0.0.1:55981__fe%2Fne ] o.a.s.h.a.CollectionsHandler Invoked Collection Action :addreplica with params node=127.0.0.1:55991__fe%252Fne&action=ADDREPLICA&collection=collection1&shard=shard1&type=NRT&wt=javabin&version=2 and sendToOCPQueue=true
[junit4] 2> 2952005 INFO (qtp685066223-44551) [n:127.0.0.1:55981__fe%2Fne ] o.a.s.h.a.CollectionsHandler Invoked Collection Action :addreplica with params node=127.0.0.1:55995__fe%252Fne&action=ADDREPLICA&collection=collection1&shard=shard1&type=NRT&wt=javabin&version=2 and sendToOCPQueue=true
[junit4] 2> 2952006 INFO (qtp685066223-44546) [n:127.0.0.1:55981__fe%2Fne ] o.a.s.h.a.CollectionsHandler Invoked Collection Action :addreplica with params node=127.0.0.1:55999__fe%252Fne&action=ADDREPLICA&collection=collection1&shard=shard1&type=NRT&wt=javabin&version=2 and sendToOCPQueue=true
[junit4] 2> 2952006 INFO (qtp685066223-44547) [n:127.0.0.1:55981__fe%2Fne ] o.a.s.h.a.CollectionsHandler Invoked Collection Action :addreplica with params node=127.0.0.1:56003__fe%252Fne&action=ADDREPLICA&collection=collection1&shard=shard1&type=NRT&wt=javabin&version=2 and sendToOCPQueue=true
[junit4] 2> 2952012 INFO (OverseerThreadFactory-13329-thread-3-processing-n:127.0.0.1:55981__fe%2Fne) [n:127.0.0.1:55981__fe%2Fne c:collection1 s:shard1 ] o.a.s.c.a.c.AddReplicaCmd Node Identified 127.0.0.1:55991__fe%2Fne for creating new replica of shard shard1 for collection collection1
[junit4] 2> 2952015 INFO (OverseerThreadFactory-13329-thread-3-processing-n:127.0.0.1:55981__fe%2Fne) [n:127.0.0.1:55981__fe%2Fne c:collection1 s:shard1 ] o.a.s.c.a.c.AddReplicaCmd Returning CreateReplica command.
[junit4] 2> 2952020 INFO (qtp1176691174-44605) [n:127.0.0.1:55991__fe%2Fne x:collection1_shard1_replica_n1 ] o.a.s.h.a.CoreAdminOperation core create command qt=/admin/cores&collection.configName=conf1&name=collection1_shard1_replica_n1&action=CREATE&collection=collection1&shard=shard1&wt=javabin&version=2&replicaType=NRT
[junit4] 2> 2953047 INFO (qtp1176691174-44605) [n:127.0.0.1:55991__fe%2Fne c:collection1 s:shard1 x:collection1_shard1_replica_n1 ] o.a.s.c.SolrConfig Using Lucene MatchVersion: 9.0.0
[junit4] 2> 2953069 INFO (qtp1176691174-44605) [n:127.0.0.1:55991__fe%2Fne c:collection1 s:shard1 x:collection1_shard1_replica_n1 ] o.a.s.s.IndexSchema [collection1_shard1_replica_n1] Schema name=test
[junit4] 2> 2953156 INFO (qtp1176691174-44605) [n:127.0.0.1:55991__fe%2Fne c:collection1 s:shard1 x:collection1_shard1_replica_n1 ] o.a.s.s.IndexSchema Loaded schema test/1.0 with uniqueid field id
[junit4] 2> 2953189 INFO (qtp1176691174-44605) [n:127.0.0.1:55991__fe%2Fne c:collection1 s:shard1 x:collection1_shard1_replica_n1 ] o.a.s.c.CoreContainer Creating SolrCore 'collection1_shard1_replica_n1' using configuration from collection collection1, trusted=true
[junit4] 2> 2953189 INFO (qtp1176691174-44605) [n:127.0.0.1:55991__fe%2Fne c:collection1 s:shard1 x:collection1_shard1_replica_n1 ] o.a.s.m.r.SolrJmxReporter JMX monitoring for 'solr.core.collection1.shard1.replica_n1' (registry 'solr.core.collection1.shard1.replica_n1') enabled at server: com.sun.jmx.mbeanserver.JmxMBeanServer@789f01d0
[junit4] 2> 2953189 INFO (qtp1176691174-44605) [n:127.0.0.1:55991__fe%2Fne c:collection1 s:shard1 x:collection1_shard1_replica_n1 ] o.a.s.c.SolrCore [[collection1_shard1_replica_n1] ] Opening new SolrCore at [/Users/jenkins/workspace/Lucene-Solr-master-MacOSX/solr/build/solr-core/test/J0/temp/solr.cloud.SyncSliceTest_F8E3B768E16E848D-001/shard-1-001/cores/collection1_shard1_replica_n1], dataDir=[/Users/jenkins/workspace/Lucene-Solr-master-MacOSX/solr/build/solr-core/test/J0/temp/solr.cloud.SyncSliceTest_F8E3B768E16E848D-001/shard-1-001/cores/collection1_shard1_replica_n1/data/]
[junit4] 2> 2953190 INFO (qtp1176691174-44605) [n:127.0.0.1:55991__fe%2Fne c:collection1 s:shard1 x:collection1_shard1_replica_n1 ] o.a.s.u.RandomMergePolicy RandomMergePolicy wrapping class org.apache.lucene.index.TieredMergePolicy: [TieredMergePolicy: maxMergeAtOnce=48, maxMergeAtOnceExplicit=44, maxMergedSegmentMB=45.640625, floorSegmentMB=1.8779296875, forceMergeDeletesPctAllowed=1.7813437358346063, segmentsPerTier=20.0, maxCFSSegmentSizeMB=8.796093022207999E12, noCFSRatio=0.0, deletesPctAllowed=46.630504914417436
[junit4] 2> 2953192 WARN (qtp1176691174-44605) [n:127.0.0.1:55991__fe%2Fne c:collection1 s:shard1 x:collection1_shard1_replica_n1 ] o.a.s.c.RequestHandlers INVALID paramSet a in requestHandler {type = requestHandler,name = /dump,class = DumpRequestHandler,attributes = {initParams=a, name=/dump, class=DumpRequestHandler},args = {defaults={a=A, b=B}}}
[junit4] 2> 2953258 INFO (qtp1176691174-44605) [n:127.0.0.1:55991__fe%2Fne c:collection1 s:shard1 x:collection1_shard1_replica_n1 ] o.a.s.u.UpdateHandler Using UpdateLog implementation: org.apache.solr.update.UpdateLog
[junit4] 2> 2953258 INFO (qtp1176691174-44605) [n:127.0.0.1:55991__fe%2Fne c:collection1 s:shard1 x:collection1_shard1_replica_n1 ] o.a.s.u.UpdateLog Initializing UpdateLog: dataDir= defaultSyncLevel=FLUSH numRecordsToKeep=100 maxNumLogsToKeep=10 numVersionBuckets=65536
[junit4] 2> 2953260 INFO (qtp1176691174-44605) [n:127.0.0.1:55991__fe%2Fne c:collection1 s:shard1 x:collection1_shard1_replica_n1 ] o.a.s.u.CommitTracker Hard AutoCommit: disabled
[junit4] 2> 2953260 INFO (qtp1176691174-44605) [n:127.0.0.1:55991__fe%2Fne c:collection1 s:shard1 x:collection1_shard1_replica_n1 ] o.a.s.u.CommitTracker Soft AutoCommit: disabled
[junit4] 2> 2953260 INFO (qtp1176691174-44605) [n:127.0.0.1:55991__fe%2Fne c:collection1 s:shard1 x:collection1_shard1_replica_n1 ] o.a.s.u.RandomMergePolicy RandomMergePolicy wrapping class org.apache.lucene.index.LogDocMergePolicy: [LogDocMergePolicy: minMergeSize=1000, mergeFactor=48, maxMergeSize=9223372036854775807, maxMergeSizeForForcedMerge=9223372036854775807, calibrateSizeByDeletes=false, maxMergeDocs=2147483647, maxCFSSegmentSizeMB=8.796093022207999E12, noCFSRatio=0.14464361836871265]
[junit4] 2> 2953261 INFO (qtp1176691174-44605) [n:127.0.0.1:55991__fe%2Fne c:collection1 s:shard1 x:collection1_shard1_replica_n1 ] o.a.s.s.SolrIndexSearcher Opening [Searcher@7c31a913[collection1_shard1_replica_n1] main]
[junit4] 2> 2953263 INFO (qtp1176691174-44605) [n:127.0.0.1:55991__fe%2Fne c:collection1 s:shard1 x:collection1_shard1_replica_n1 ] o.a.s.r.ManagedResourceStorage Configured ZooKeeperStorageIO with znodeBase: /configs/conf1
[junit4] 2> 2953264 INFO (qtp1176691174-44605) [n:127.0.0.1:55991__fe%2Fne c:collection1 s:shard1 x:collection1_shard1_replica_n1 ] o.a.s.r.ManagedResourceStorage Loaded null at path _rest_managed.json using ZooKeeperStorageIO:path=/configs/conf1
[junit4] 2> 2953264 INFO (qtp1176691174-44605) [n:127.0.0.1:55991__fe%2Fne c:collection1 s:shard1 x:collection1_shard1_replica_n1 ] o.a.s.h.ReplicationHandler Commits will be reserved for 10000ms.
[junit4] 2> 2953264 INFO (qtp1176691174-44605) [n:127.0.0.1:55991__fe%2Fne c:collection1 s:shard1 x:collection1_shard1_replica_n1 ] o.a.s.u.UpdateLog Could not find max version in index or recent updates, using new clock 1648722002195775488
[junit4] 2> 2953267 INFO (searcherExecutor-13375-thread-1-processing-n:127.0.0.1:55991__fe%2Fne x:collection1_shard1_replica_n1 c:collection1 s:shard1) [n:127.0.0.1:55991__fe%2Fne c:collection1 s:shard1 x:collection1_shard1_replica_n1 ] o.a.s.c.SolrCore [collection1_shard1_replica_n1] Registered new searcher Searcher@7c31a913[collection1_shard1_replica_n1] main{ExitableDirectoryReader(UninvertingDirectoryReader())}
[junit4] 2> 2953272 INFO (qtp1176691174-44605) [n:127.0.0.1:55991__fe%2Fne c:collection1 s:shard1 x:collection1_shard1_replica_n1 ] o.a.s.c.ZkShardTerms Successful update of terms at /collections/collection1/terms/shard1 to Terms{values={core_node2=0}, version=0}
[junit4] 2> 2953272 INFO (qtp1176691174-44605) [n:127.0.0.1:55991__fe%2Fne c:collection1 s:shard1 x:collection1_shard1_replica_n1 ] o.a.s.c.ShardLeaderElectionContextBase make sure parent is created /collections/collection1/leaders/shard1
[junit4] 2> 2953278 INFO (qtp1176691174-44605) [n:127.0.0.1:55991__fe%2Fne c:collection1 s:shard1 x:collection1_shard1_replica_n1 ] o.a.s.c.ShardLeaderElectionContext Enough replicas found to continue.
[junit4] 2> 2953278 INFO (qtp1176691174-44605) [n:127.0.0.1:55991__fe%2Fne c:collection1 s:shard1 x:collection1_shard1_replica_n1 ] o.a.s.c.ShardLeaderElectionContext I may be the new leader - try and sync
[junit4] 2> 2953278 INFO (qtp1176691174-44605) [n:127.0.0.1:55991__fe%2Fne c:collection1 s:shard1 x:collection1_shard1_replica_n1 ] o.a.s.c.SyncStrategy Sync replicas to http://127.0.0.1:55991/_fe/ne/collection1_shard1_replica_n1/
[junit4] 2> 2953278 INFO (qtp1176691174-44605) [n:127.0.0.1:55991__fe%2Fne c:collection1 s:shard1 x:collection1_shard1_replica_n1 ] o.a.s.c.SyncStrategy Sync Success - now sync replicas to me
[junit4] 2> 2953278 INFO (qtp1176691174-44605) [n:127.0.0.1:55991__fe%2Fne c:collection1 s:shard1 x:collection1_shard1_replica_n1 ] o.a.s.c.SyncStrategy http://127.0.0.1:55991/_fe/ne/collection1_shard1_replica_n1/ has no replicas
[junit4] 2> 2953278 INFO (qtp1176691174-44605) [n:127.0.0.1:55991__fe%2Fne c:collection1 s:shard1 x:collection1_shard1_replica_n1 ] o.a.s.c.ShardLeaderElectionContextBase Creating leader registration node /collections/collection1/leaders/shard1/leader after winning as /collections/collection1/leader_elect/shard1/election/72100888026742793-core_node2-n_0000000000
[junit4] 2> 2953284 INFO (qtp1176691174-44605) [n:127.0.0.1:55991__fe%2Fne c:collection1 s:shard1 x:collection1_shard1_replica_n1 ] o.a.s.c.ShardLeaderElectionContext I am the new leader: http://127.0.0.1:55991/_fe/ne/collection1_shard1_replica_n1/ shard1
[junit4] 2> 2953395 INFO (qtp1176691174-44605) [n:127.0.0.1:55991__fe%2Fne c:collection1 s:shard1 x:collection1_shard1_replica_n1 ] o.a.s.c.ZkController I am the leader, no recovery necessary
[junit4] 2> 2953400 INFO (qtp1176691174-44605) [n:127.0.0.1:55991__fe%2Fne c:collection1 s:shard1 x:collection1_shard1_replica_n1 ] o
[...truncated too long message...]
] 1> "127.0.0.1:55455__fe%2Fne"],
[junit4] 1> "nodeNameVsTimeRemoved":{"127.0.0.1:55443__fe%2Fne":663887601500124}}
[junit4] 1> /solr/autoscaling/events (2)
[junit4] 1> /solr/autoscaling/events/.scheduled_maintenance (0)
[junit4] 1> /solr/autoscaling/events/.auto_add_replicas (0)
[junit4] 1> /solr/autoscaling.json (0)
[junit4] 1> DATA:
[junit4] 1> {
[junit4] 1> "triggers":{
[junit4] 1> ".auto_add_replicas":{
[junit4] 1> "name":".auto_add_replicas",
[junit4] 1> "event":"nodeLost",
[junit4] 1> "waitFor":10,
[junit4] 1> "enabled":true,
[junit4] 1> "actions":[
[junit4] 1> {
[junit4] 1> "name":"auto_add_replicas_plan",
[junit4] 1> "class":"solr.AutoAddReplicasPlanAction"},
[junit4] 1> {
[junit4] 1> "name":"execute_plan",
[junit4] 1> "class":"solr.ExecutePlanAction"}]},
[junit4] 1> ".scheduled_maintenance":{
[junit4] 1> "name":".scheduled_maintenance",
[junit4] 1> "event":"scheduled",
[junit4] 1> "startTime":"NOW",
[junit4] 1> "every":"+1DAY",
[junit4] 1> "enabled":true,
[junit4] 1> "actions":[
[junit4] 1> {
[junit4] 1> "name":"inactive_shard_plan",
[junit4] 1> "class":"solr.InactiveShardPlanAction"},
[junit4] 1> {
[junit4] 1> "name":"inactive_markers_plan",
[junit4] 1> "class":"solr.InactiveMarkersPlanAction"},
[junit4] 1> {
[junit4] 1> "name":"execute_plan",
[junit4] 1> "class":"solr.ExecutePlanAction"}]}},
[junit4] 1> "listeners":{
[junit4] 1> ".auto_add_replicas.system":{
[junit4] 1> "beforeAction":[],
[junit4] 1> "afterAction":[],
[junit4] 1> "stage":[
[junit4] 1> "STARTED",
[junit4] 1> "ABORTED",
[junit4] 1> "SUCCEEDED",
[junit4] 1> "FAILED",
[junit4] 1> "BEFORE_ACTION",
[junit4] 1> "AFTER_ACTION",
[junit4] 1> "IGNORED"],
[junit4] 1> "trigger":".auto_add_replicas",
[junit4] 1> "class":"org.apache.solr.cloud.autoscaling.SystemLogListener"},
[junit4] 1> ".scheduled_maintenance.system":{
[junit4] 1> "beforeAction":[],
[junit4] 1> "afterAction":[],
[junit4] 1> "stage":[
[junit4] 1> "STARTED",
[junit4] 1> "ABORTED",
[junit4] 1> "SUCCEEDED",
[junit4] 1> "FAILED",
[junit4] 1> "BEFORE_ACTION",
[junit4] 1> "AFTER_ACTION",
[junit4] 1> "IGNORED"],
[junit4] 1> "trigger":".scheduled_maintenance",
[junit4] 1> "class":"org.apache.solr.cloud.autoscaling.SystemLogListener"}},
[junit4] 1> "properties":{}}
[junit4] 1> /solr/clusterprops.json (0)
[junit4] 1> DATA:
[junit4] 1> {"legacyCloud":"true"}
[junit4] 1>
[junit4] 2> 94099 INFO (TEST-SyncSliceTest.test-seed#[F8E3B768E16E848D]) [ ] o.a.s.c.ZkTestServer Shutting down ZkTestServer.
[junit4] 2> 94311 WARN (ZkTestServer Run Thread) [ ] o.a.s.c.ZkTestServer Watch limit violations:
[junit4] 2> Maximum concurrent create/delete watches above limit:
[junit4] 2>
[junit4] 2> 19 /solr/collections/collection1/state.json
[junit4] 2> 18 /solr/collections/collection1/terms/shard1
[junit4] 2> 7 /solr/aliases.json
[junit4] 2> 5 /solr/packages.json
[junit4] 2> 5 /solr/security.json
[junit4] 2> 5 /solr/configs/conf1
[junit4] 2> 4 /solr/collections/collection1/collectionprops.json
[junit4] 2> 3 /solr/collections/control_collection/terms/shard1
[junit4] 2>
[junit4] 2> Maximum concurrent data watches above limit:
[junit4] 2>
[junit4] 2> 89 /solr/clusterstate.json
[junit4] 2> 12 /solr/collections/control_collection/state.json
[junit4] 2> 7 /solr/clusterprops.json
[junit4] 2> 2 /solr/overseer_elect/election/72101101292027914-127.0.0.1:55441__fe%2Fne-n_0000000001
[junit4] 2>
[junit4] 2> Maximum concurrent children watches above limit:
[junit4] 2>
[junit4] 2> 50 /solr/overseer/queue
[junit4] 2> 35 /solr/live_nodes
[junit4] 2> 20 /solr/overseer/collection-queue-work
[junit4] 2> 7 /solr/collections
[junit4] 2>
[junit4] 2> 95464 INFO (TEST-SyncSliceTest.test-seed#[F8E3B768E16E848D]) [ ] o.a.s.c.ZkTestServer waitForServerDown: 127.0.0.1:55411
[junit4] 2> 95464 INFO (TEST-SyncSliceTest.test-seed#[F8E3B768E16E848D]) [ ] o.a.s.c.ZkTestServer parse host and port list: 127.0.0.1:55411
[junit4] 2> 95464 INFO (TEST-SyncSliceTest.test-seed#[F8E3B768E16E848D]) [ ] o.a.s.c.ZkTestServer connecting to 127.0.0.1 55411
[junit4] 2> NOTE: reproduce with: ant test -Dtestcase=SyncSliceTest -Dtests.method=test -Dtests.seed=F8E3B768E16E848D -Dtests.slow=true -Dtests.badapples=true -Dtests.locale=ca-FR -Dtests.timezone=Asia/Riyadh -Dtests.asserts=true -Dtests.file.encoding=US-ASCII
[junit4] FAILURE 28.0s J0 | SyncSliceTest.test <<<
[junit4] > Throwable #1: java.lang.AssertionError: expected:<5> but was:<4>
[junit4] > at __randomizedtesting.SeedInfo.seed([F8E3B768E16E848D:70B788B24F92E975]:0)
[junit4] > at org.apache.solr.cloud.SyncSliceTest.test(SyncSliceTest.java:150)
[junit4] > at java.base/jdk.internal.reflect.NativeMethodAccessorImpl.invoke0(Native Method)
[junit4] > at java.base/jdk.internal.reflect.NativeMethodAccessorImpl.invoke(NativeMethodAccessorImpl.java:62)
[junit4] > at java.base/jdk.internal.reflect.DelegatingMethodAccessorImpl.invoke(DelegatingMethodAccessorImpl.java:43)
[junit4] > at java.base/java.lang.reflect.Method.invoke(Method.java:567)
[junit4] > at org.apache.solr.BaseDistributedSearchTestCase$ShardsRepeatRule$ShardsFixedStatement.callStatement(BaseDistributedSearchTestCase.java:1082)
[junit4] > at org.apache.solr.BaseDistributedSearchTestCase$ShardsRepeatRule$ShardsStatement.evaluate(BaseDistributedSearchTestCase.java:1054)
[junit4] > at java.base/java.lang.Thread.run(Thread.java:830)
[junit4] 2> NOTE: leaving temporary files on disk at: /Users/jenkins/workspace/Lucene-Solr-master-MacOSX/solr/build/solr-core/test/J0/temp/solr.cloud.SyncSliceTest_F8E3B768E16E848D-001
[junit4] 2> NOTE: test params are: codec=Asserting(Lucene80): {rnd_b=FSTOrd50, multiDefault=PostingsFormat(name=Direct), a_t=PostingsFormat(name=Direct), _root_=Lucene50(blocksize=128), id=FSTOrd50, text=PostingsFormat(name=LuceneVarGapFixedInterval)}, docValues:{range_facet_l_dv=DocValuesFormat(name=Lucene80), _version_=DocValuesFormat(name=Asserting), range_facet_i_dv=DocValuesFormat(name=Asserting), intDvoDefault=DocValuesFormat(name=Lucene80), timestamp=DocValuesFormat(name=Asserting)}, maxPointsInLeafNode=1675, maxMBSortInHeap=7.852765687091154, sim=Asserting(org.apache.lucene.search.similarities.AssertingSimilarity@28d25852), locale=ca-FR, timezone=Asia/Riyadh
[junit4] 2> NOTE: Mac OS X 10.11.6 x86_64/Oracle Corporation 13 (64-bit)/cpus=3,threads=1,free=110541032,total=297795584
[junit4] 2> NOTE: All tests run in this JVM: [SyncSliceTest, SyncSliceTest]
[junit4] Completed [3/5 (1!)] on J0 in 28.33s, 1 test, 1 failure <<< FAILURES!
[...truncated 18 lines...]
BUILD FAILED
/Users/jenkins/workspace/Lucene-Solr-master-MacOSX/lucene/common-build.xml:1510: The following error occurred while executing this line:
/Users/jenkins/workspace/Lucene-Solr-master-MacOSX/lucene/common-build.xml:1037: There were test failures: 5 suites, 5 tests, 1 failure [seed: F8E3B768E16E848D]
Total time: 2 minutes 29 seconds
[repro] Setting last failure code to 256
[repro] Failures:
[repro] 1/5 failed: org.apache.solr.cloud.SyncSliceTest
[repro] Exiting with code 256
+ mv lucene/build lucene/build.repro
+ mv solr/build solr/build.repro
+ mv lucene/build.orig lucene/build
+ mv solr/build.orig solr/build
Archiving artifacts
Setting ANT_1_8_2_HOME=/Users/jenkins/tools/hudson.tasks.Ant_AntInstallation/ANT_1.8.2
[WARNINGS] Parsing warnings in console log with parser Java Compiler (javac)
Setting ANT_1_8_2_HOME=/Users/jenkins/tools/hudson.tasks.Ant_AntInstallation/ANT_1.8.2
No credentials specified
Setting ANT_1_8_2_HOME=/Users/jenkins/tools/hudson.tasks.Ant_AntInstallation/ANT_1.8.2
<Git Blamer> Using GitBlamer to create author and commit information for all warnings.
<Git Blamer> GIT_COMMIT=24134cf9b17cd7e7e0d404a92a361466ab26b6e3, workspace=/Users/jenkins/workspace/Lucene-Solr-master-MacOSX
[WARNINGS] Computing warning deltas based on reference build #5409
Recording test results
Setting ANT_1_8_2_HOME=/Users/jenkins/tools/hudson.tasks.Ant_AntInstallation/ANT_1.8.2
Build step 'Publish JUnit test result report' changed build result to UNSTABLE
Email was triggered for: Unstable (Test Failures)
Sending email for trigger: Unstable (Test Failures)
Setting ANT_1_8_2_HOME=/Users/jenkins/tools/hudson.tasks.Ant_AntInstallation/ANT_1.8.2
Setting ANT_1_8_2_HOME=/Users/jenkins/tools/hudson.tasks.Ant_AntInstallation/ANT_1.8.2
Setting ANT_1_8_2_HOME=/Users/jenkins/tools/hudson.tasks.Ant_AntInstallation/ANT_1.8.2
Setting ANT_1_8_2_HOME=/Users/jenkins/tools/hudson.tasks.Ant_AntInstallation/ANT_1.8.2
Setting ANT_1_8_2_HOME=/Users/jenkins/tools/hudson.tasks.Ant_AntInstallation/ANT_1.8.2
Setting ANT_1_8_2_HOME=/Users/jenkins/tools/hudson.tasks.Ant_AntInstallation/ANT_1.8.2