You are viewing a plain text version of this content. The canonical link for it is here.
Posted to sandesha-dev@ws.apache.org by "Richard Slade (JIRA)" <ji...@apache.org> on 2010/03/17 20:25:27 UTC
[jira] Created: (SANDESHA2-201) SequenceTimedOutTest test failure
SequenceTimedOutTest test failure
---------------------------------
Key: SANDESHA2-201
URL: https://issues.apache.org/jira/browse/SANDESHA2-201
Project: Sandesha2
Issue Type: Bug
Environment: Red Hat linux
Reporter: Richard Slade
-------------------------------------------------------------------------------
When running the sandesha unit testsunder the modules/test directory I am seeing the following error. It appears to be related to revision 916949
Test set: org.apache.sandesha2.faulttests.SequenceTimedOutTest
-------------------------------------------------------------------------------
Tests run: 3, Failures: 1, Errors: 0, Skipped: 0, Time elapsed: 135.262 sec <<< FAILURE!
testSOAP11CreateSequenceRefusedInboundFault(org.apache.sandesha2.faulttests.SequenceTimedOutTest) Time elapsed: 71.733 sec <<< FAILURE!
junit.framework.AssertionFailedError: expected:<3> but was:<4>
at junit.framework.Assert.fail(Assert.java:47)
at junit.framework.Assert.failNotEquals(Assert.java:280)
at junit.framework.Assert.assertEquals(Assert.java:64)
at junit.framework.Assert.assertEquals(Assert.java:159)
at junit.framework.Assert.assertEquals(Assert.java:165)
at org.apache.sandesha2.faulttests.SequenceTimedOutTest.testSOAP11CreateSequenceRefusedInboundFault(SequenceTimedOutTest.java:124)
--
This message is automatically generated by JIRA.
-
You can reply to this email to add a comment to the issue online.
---------------------------------------------------------------------
To unsubscribe, e-mail: sandesha-dev-unsubscribe@ws.apache.org
For additional commands, e-mail: sandesha-dev-help@ws.apache.org
[jira] Commented: (SANDESHA2-201) SequenceTimedOutTest test failure
Posted by "Richard Slade (JIRA)" <ji...@apache.org>.
[ https://issues.apache.org/jira/browse/SANDESHA2-201?page=com.atlassian.jira.plugin.system.issuetabpanels:comment-tabpanel&focusedCommentId=12848325#action_12848325 ]
Richard Slade commented on SANDESHA2-201:
-----------------------------------------
Problem occurs only on a Linux system, I have not been able to reproduce the problem on a Windows system.
> SequenceTimedOutTest test failure
> ---------------------------------
>
> Key: SANDESHA2-201
> URL: https://issues.apache.org/jira/browse/SANDESHA2-201
> Project: Sandesha2
> Issue Type: Bug
> Environment: Red Hat linux
> Reporter: Richard Slade
>
> -------------------------------------------------------------------------------
> When running the sandesha unit testsunder the modules/test directory I am seeing the following error. It appears to be related to revision 916949
> Test set: org.apache.sandesha2.faulttests.SequenceTimedOutTest
> -------------------------------------------------------------------------------
> Tests run: 3, Failures: 1, Errors: 0, Skipped: 0, Time elapsed: 135.262 sec <<< FAILURE!
> testSOAP11CreateSequenceRefusedInboundFault(org.apache.sandesha2.faulttests.SequenceTimedOutTest) Time elapsed: 71.733 sec <<< FAILURE!
> junit.framework.AssertionFailedError: expected:<3> but was:<4>
> at junit.framework.Assert.fail(Assert.java:47)
> at junit.framework.Assert.failNotEquals(Assert.java:280)
> at junit.framework.Assert.assertEquals(Assert.java:64)
> at junit.framework.Assert.assertEquals(Assert.java:159)
> at junit.framework.Assert.assertEquals(Assert.java:165)
> at org.apache.sandesha2.faulttests.SequenceTimedOutTest.testSOAP11CreateSequenceRefusedInboundFault(SequenceTimedOutTest.java:124)
--
This message is automatically generated by JIRA.
-
You can reply to this email to add a comment to the issue online.
---------------------------------------------------------------------
To unsubscribe, e-mail: sandesha-dev-unsubscribe@ws.apache.org
For additional commands, e-mail: sandesha-dev-help@ws.apache.org
[jira] Closed: (SANDESHA2-201) SequenceTimedOutTest test failure
Posted by "Richard Slade (JIRA)" <ji...@apache.org>.
[ https://issues.apache.org/jira/browse/SANDESHA2-201?page=com.atlassian.jira.plugin.system.issuetabpanels:all-tabpanel ]
Richard Slade closed SANDESHA2-201.
-----------------------------------
Resolution: Fixed
Problem fixed with revision 927343
> SequenceTimedOutTest test failure
> ---------------------------------
>
> Key: SANDESHA2-201
> URL: https://issues.apache.org/jira/browse/SANDESHA2-201
> Project: Sandesha2
> Issue Type: Bug
> Environment: Red Hat linux
> Reporter: Richard Slade
> Attachments: faultmanager.patch
>
>
> -------------------------------------------------------------------------------
> When running the sandesha unit testsunder the modules/test directory I am seeing the following error. It appears to be related to revision 916949
> Test set: org.apache.sandesha2.faulttests.SequenceTimedOutTest
> -------------------------------------------------------------------------------
> Tests run: 3, Failures: 1, Errors: 0, Skipped: 0, Time elapsed: 135.262 sec <<< FAILURE!
> testSOAP11CreateSequenceRefusedInboundFault(org.apache.sandesha2.faulttests.SequenceTimedOutTest) Time elapsed: 71.733 sec <<< FAILURE!
> junit.framework.AssertionFailedError: expected:<3> but was:<4>
> at junit.framework.Assert.fail(Assert.java:47)
> at junit.framework.Assert.failNotEquals(Assert.java:280)
> at junit.framework.Assert.assertEquals(Assert.java:64)
> at junit.framework.Assert.assertEquals(Assert.java:159)
> at junit.framework.Assert.assertEquals(Assert.java:165)
> at org.apache.sandesha2.faulttests.SequenceTimedOutTest.testSOAP11CreateSequenceRefusedInboundFault(SequenceTimedOutTest.java:124)
--
This message is automatically generated by JIRA.
-
You can reply to this email to add a comment to the issue online.
---------------------------------------------------------------------
To unsubscribe, e-mail: sandesha-dev-unsubscribe@ws.apache.org
For additional commands, e-mail: sandesha-dev-help@ws.apache.org
[jira] Commented: (SANDESHA2-201) SequenceTimedOutTest test failure
Posted by "Andrew Gatford (JIRA)" <ji...@apache.org>.
[ https://issues.apache.org/jira/browse/SANDESHA2-201?page=com.atlassian.jira.plugin.system.issuetabpanels:comment-tabpanel&focusedCommentId=12849217#action_12849217 ]
Andrew Gatford commented on SANDESHA2-201:
------------------------------------------
I've seen what looks to be the cause of the problem.
2010-03-24 15:05:54,140 ERROR org.apache.sandesha2.util.FaultManager - org.apache.axis2.AxisFault: CreateSequenceRefused null java.lang.Exception
at org.apache.sandesha2.util.SequenceManager.setupNewSequence(SequenceManager.java:99)
at org.apache.sandesha2.msgprocessors.CreateSeqMsgProcessor.processInMessage(CreateSeqMsgProcessor.java:143)
at org.apache.sandesha2.msgreceivers.RMMessageReceiver.invokeBusinessLogic(RMMessageReceiver.java:94)
at org.apache.axis2.receivers.AbstractMessageReceiver.receive(AbstractMessageReceiver.java:114)
at org.apache.sandesha2.util.FaultManager.notifyClientsOfFault(FaultManager.java:1091)
at org.apache.sandesha2.util.SequenceManager.finalizeTimedOutSequence(SequenceManager.java:351)
at org.apache.sandesha2.workers.Sender.internalRun(Sender.java:184)
at org.apache.sandesha2.workers.SandeshaThread.run(SandeshaThread.java:317)
The notify clients of Fault should probably set the Unreliable message tag to stop Sandesha2 from thinking it needs to do something with it.
> SequenceTimedOutTest test failure
> ---------------------------------
>
> Key: SANDESHA2-201
> URL: https://issues.apache.org/jira/browse/SANDESHA2-201
> Project: Sandesha2
> Issue Type: Bug
> Environment: Red Hat linux
> Reporter: Richard Slade
>
> -------------------------------------------------------------------------------
> When running the sandesha unit testsunder the modules/test directory I am seeing the following error. It appears to be related to revision 916949
> Test set: org.apache.sandesha2.faulttests.SequenceTimedOutTest
> -------------------------------------------------------------------------------
> Tests run: 3, Failures: 1, Errors: 0, Skipped: 0, Time elapsed: 135.262 sec <<< FAILURE!
> testSOAP11CreateSequenceRefusedInboundFault(org.apache.sandesha2.faulttests.SequenceTimedOutTest) Time elapsed: 71.733 sec <<< FAILURE!
> junit.framework.AssertionFailedError: expected:<3> but was:<4>
> at junit.framework.Assert.fail(Assert.java:47)
> at junit.framework.Assert.failNotEquals(Assert.java:280)
> at junit.framework.Assert.assertEquals(Assert.java:64)
> at junit.framework.Assert.assertEquals(Assert.java:159)
> at junit.framework.Assert.assertEquals(Assert.java:165)
> at org.apache.sandesha2.faulttests.SequenceTimedOutTest.testSOAP11CreateSequenceRefusedInboundFault(SequenceTimedOutTest.java:124)
--
This message is automatically generated by JIRA.
-
You can reply to this email to add a comment to the issue online.
---------------------------------------------------------------------
To unsubscribe, e-mail: sandesha-dev-unsubscribe@ws.apache.org
For additional commands, e-mail: sandesha-dev-help@ws.apache.org
[jira] Updated: (SANDESHA2-201) SequenceTimedOutTest test failure
Posted by "Andrew Gatford (JIRA)" <ji...@apache.org>.
[ https://issues.apache.org/jira/browse/SANDESHA2-201?page=com.atlassian.jira.plugin.system.issuetabpanels:all-tabpanel ]
Andrew Gatford updated SANDESHA2-201:
-------------------------------------
Attachment: faultmanager.patch
It looks like we are trying to deliver a fault on a create sequence message. We should probably only do that for Application messages.
This patch adds an extra check
> SequenceTimedOutTest test failure
> ---------------------------------
>
> Key: SANDESHA2-201
> URL: https://issues.apache.org/jira/browse/SANDESHA2-201
> Project: Sandesha2
> Issue Type: Bug
> Environment: Red Hat linux
> Reporter: Richard Slade
> Attachments: faultmanager.patch
>
>
> -------------------------------------------------------------------------------
> When running the sandesha unit testsunder the modules/test directory I am seeing the following error. It appears to be related to revision 916949
> Test set: org.apache.sandesha2.faulttests.SequenceTimedOutTest
> -------------------------------------------------------------------------------
> Tests run: 3, Failures: 1, Errors: 0, Skipped: 0, Time elapsed: 135.262 sec <<< FAILURE!
> testSOAP11CreateSequenceRefusedInboundFault(org.apache.sandesha2.faulttests.SequenceTimedOutTest) Time elapsed: 71.733 sec <<< FAILURE!
> junit.framework.AssertionFailedError: expected:<3> but was:<4>
> at junit.framework.Assert.fail(Assert.java:47)
> at junit.framework.Assert.failNotEquals(Assert.java:280)
> at junit.framework.Assert.assertEquals(Assert.java:64)
> at junit.framework.Assert.assertEquals(Assert.java:159)
> at junit.framework.Assert.assertEquals(Assert.java:165)
> at org.apache.sandesha2.faulttests.SequenceTimedOutTest.testSOAP11CreateSequenceRefusedInboundFault(SequenceTimedOutTest.java:124)
--
This message is automatically generated by JIRA.
-
You can reply to this email to add a comment to the issue online.
---------------------------------------------------------------------
To unsubscribe, e-mail: sandesha-dev-unsubscribe@ws.apache.org
For additional commands, e-mail: sandesha-dev-help@ws.apache.org
[jira] Commented: (SANDESHA2-201) SequenceTimedOutTest test failure
Posted by "Andrew Gatford (JIRA)" <ji...@apache.org>.
[ https://issues.apache.org/jira/browse/SANDESHA2-201?page=com.atlassian.jira.plugin.system.issuetabpanels:comment-tabpanel&focusedCommentId=12846878#action_12846878 ]
Andrew Gatford commented on SANDESHA2-201:
------------------------------------------
I've tried several times to recreate this problem today and so far can't.
For me the tests are running fine with or without revision 916949.
One possible thing that might be causing it is the tests take longer to run with revision 916949. They go from about 10:30 to 12 mins. Perhaps that is enough to pop the test timer and cause the problem.
> SequenceTimedOutTest test failure
> ---------------------------------
>
> Key: SANDESHA2-201
> URL: https://issues.apache.org/jira/browse/SANDESHA2-201
> Project: Sandesha2
> Issue Type: Bug
> Environment: Red Hat linux
> Reporter: Richard Slade
>
> -------------------------------------------------------------------------------
> When running the sandesha unit testsunder the modules/test directory I am seeing the following error. It appears to be related to revision 916949
> Test set: org.apache.sandesha2.faulttests.SequenceTimedOutTest
> -------------------------------------------------------------------------------
> Tests run: 3, Failures: 1, Errors: 0, Skipped: 0, Time elapsed: 135.262 sec <<< FAILURE!
> testSOAP11CreateSequenceRefusedInboundFault(org.apache.sandesha2.faulttests.SequenceTimedOutTest) Time elapsed: 71.733 sec <<< FAILURE!
> junit.framework.AssertionFailedError: expected:<3> but was:<4>
> at junit.framework.Assert.fail(Assert.java:47)
> at junit.framework.Assert.failNotEquals(Assert.java:280)
> at junit.framework.Assert.assertEquals(Assert.java:64)
> at junit.framework.Assert.assertEquals(Assert.java:159)
> at junit.framework.Assert.assertEquals(Assert.java:165)
> at org.apache.sandesha2.faulttests.SequenceTimedOutTest.testSOAP11CreateSequenceRefusedInboundFault(SequenceTimedOutTest.java:124)
--
This message is automatically generated by JIRA.
-
You can reply to this email to add a comment to the issue online.
---------------------------------------------------------------------
To unsubscribe, e-mail: sandesha-dev-unsubscribe@ws.apache.org
For additional commands, e-mail: sandesha-dev-help@ws.apache.org