You are viewing a plain text version of this content. The canonical link for it is here.
Posted to commits@myfaces.apache.org by Apache Jenkins Server <je...@builds.apache.org> on 2013/11/04 09:48:37 UTC

Build failed in Jenkins: Trinidad Core Trunk (snapshot) #96

See <https://builds.apache.org/job/Trinidad%20Core%20Trunk%20(snapshot)/96/changes>

Changes:

[sobryan] [maven-release-plugin] prepare release maven-plugin-parent-2.0.8

[sobryan] Touched the pom file to establish command-line credentials

------------------------------------------
[...truncated 11609 lines...]
13/13 KB   78/165 KB   12/12 KB   146/226 KB   
13/13 KB   78/165 KB   12/12 KB   4/8 KB   146/226 KB   
13/13 KB   78/165 KB   12/12 KB   8/8 KB   146/226 KB   
13/13 KB   78/165 KB   12/12 KB   8/8 KB   146/226 KB   
13/13 KB   82/165 KB   12/12 KB   8/8 KB   146/226 KB   
13/13 KB   86/165 KB   12/12 KB   8/8 KB   146/226 KB   
13/13 KB   90/165 KB   12/12 KB   8/8 KB   146/226 KB   
13/13 KB   94/165 KB   12/12 KB   8/8 KB   146/226 KB   
13/13 KB   98/165 KB   12/12 KB   8/8 KB   146/226 KB   
13/13 KB   102/165 KB   12/12 KB   8/8 KB   146/226 KB   
13/13 KB   106/165 KB   12/12 KB   8/8 KB   146/226 KB   
13/13 KB   110/165 KB   12/12 KB   8/8 KB   146/226 KB   
13/13 KB   114/165 KB   12/12 KB   8/8 KB   146/226 KB   
13/13 KB   118/165 KB   12/12 KB   8/8 KB   146/226 KB   
13/13 KB   122/165 KB   12/12 KB   8/8 KB   146/226 KB   
13/13 KB   126/165 KB   12/12 KB   8/8 KB   146/226 KB   
13/13 KB   130/165 KB   12/12 KB   8/8 KB   146/226 KB   
13/13 KB   134/165 KB   12/12 KB   8/8 KB   146/226 KB   
13/13 KB   138/165 KB   12/12 KB   8/8 KB   146/226 KB   
13/13 KB   142/165 KB   12/12 KB   8/8 KB   146/226 KB   
13/13 KB   146/165 KB   12/12 KB   8/8 KB   146/226 KB   
13/13 KB   150/165 KB   12/12 KB   8/8 KB   146/226 KB   
13/13 KB   154/165 KB   12/12 KB   8/8 KB   146/226 KB   
13/13 KB   158/165 KB   12/12 KB   8/8 KB   146/226 KB   
13/13 KB   159/165 KB   12/12 KB   8/8 KB   146/226 KB   
13/13 KB   159/165 KB   12/12 KB   8/8 KB   147/226 KB   
13/13 KB   159/165 KB   12/12 KB   8/8 KB   151/226 KB   
13/13 KB   159/165 KB   12/12 KB   8/8 KB   155/226 KB   
13/13 KB   159/165 KB   12/12 KB   8/8 KB   159/226 KB   
13/13 KB   159/165 KB   12/12 KB   8/8 KB   163/226 KB   
13/13 KB   159/165 KB   12/12 KB   8/8 KB   167/226 KB   
13/13 KB   159/165 KB   12/12 KB   8/8 KB   171/226 KB   
13/13 KB   159/165 KB   12/12 KB   8/8 KB   175/226 KB   
13/13 KB   159/165 KB   12/12 KB   8/8 KB   179/226 KB   
13/13 KB   159/165 KB   12/12 KB   8/8 KB   183/226 KB   
13/13 KB   159/165 KB   12/12 KB   8/8 KB   187/226 KB   
13/13 KB   159/165 KB   12/12 KB   8/8 KB   191/226 KB   
13/13 KB   159/165 KB   12/12 KB   8/8 KB   195/226 KB   
13/13 KB   159/165 KB   12/12 KB   8/8 KB   199/226 KB   
13/13 KB   159/165 KB   12/12 KB   8/8 KB   203/226 KB   
13/13 KB   159/165 KB   12/12 KB   8/8 KB   207/226 KB   
13/13 KB   159/165 KB   12/12 KB   8/8 KB   211/226 KB   
13/13 KB   159/165 KB   12/12 KB   8/8 KB   215/226 KB   
                                                         
13/13 KB   159/165 KB   8/8 KB   219/226 KB              
Downloaded: http://repo.maven.apache.org/maven2/org/codehaus/plexus/plexus-i18n/1.0-beta-6/plexus-i18n-1.0-beta-6.jar (12 KB at 229.9 KB/sec)
13/13 KB   159/165 KB   8/8 KB   223/226 KB   
Downloading: http://repo.maven.apache.org/maven2/plexus/plexus-utils/1.0.2/plexus-utils-1.0.2.jar
13/13 KB   159/165 KB   8/8 KB   226/226 KB   
                                              
Downloaded: http://repo.maven.apache.org/maven2/org/apache/maven/doxia/doxia-site-renderer/1.0-alpha-7/doxia-site-renderer-1.0-alpha-7.jar (13 KB at 221.1 KB/sec)
Downloading: http://repo.maven.apache.org/maven2/commons-logging/commons-logging-api/1.0.4/commons-logging-api-1.0.4.jar
163/165 KB   8/8 KB   226/226 KB              
165/165 KB   8/8 KB   226/226 KB   
                                   
Downloaded: http://repo.maven.apache.org/maven2/org/codehaus/plexus/plexus-velocity/1.1.2/plexus-velocity-1.1.2.jar (8 KB at 144.1 KB/sec)
Downloading: http://repo.maven.apache.org/maven2/org/apache/maven/doxia/doxia-decoration-model/1.0-alpha-7/doxia-decoration-model-1.0-alpha-7.jar
                                   
Downloaded: http://repo.maven.apache.org/maven2/org/apache/maven/doxia/doxia-core/1.0-alpha-7/doxia-core-1.0-alpha-7.jar (226 KB at 2895.7 KB/sec)
2/157 KB   165/165 KB              
6/157 KB   165/165 KB   
10/157 KB   165/165 KB   
14/157 KB   165/165 KB   
18/157 KB   165/165 KB   
22/157 KB   165/165 KB   
26/157 KB   165/165 KB   
30/157 KB   165/165 KB   
34/157 KB   165/165 KB   
38/157 KB   165/165 KB   
42/157 KB   165/165 KB   
46/157 KB   165/165 KB   
50/157 KB   165/165 KB   
54/157 KB   165/165 KB   
58/157 KB   165/165 KB   
62/157 KB   165/165 KB   
66/157 KB   165/165 KB   
70/157 KB   165/165 KB   
74/157 KB   165/165 KB   
78/157 KB   165/165 KB   
82/157 KB   165/165 KB   
86/157 KB   165/165 KB   
90/157 KB   165/165 KB   
94/157 KB   165/165 KB   
98/157 KB   165/165 KB   
102/157 KB   165/165 KB   
106/157 KB   165/165 KB   
110/157 KB   165/165 KB   
114/157 KB   165/165 KB   
118/157 KB   165/165 KB   
122/157 KB   165/165 KB   
126/157 KB   165/165 KB   
130/157 KB   165/165 KB   
130/157 KB   165/165 KB   4/26 KB   
134/157 KB   165/165 KB   4/26 KB   
134/157 KB   165/165 KB   8/26 KB   
138/157 KB   165/165 KB   8/26 KB   
138/157 KB   165/165 KB   12/26 KB   
142/157 KB   165/165 KB   12/26 KB   
142/157 KB   165/165 KB   16/26 KB   
146/157 KB   165/165 KB   16/26 KB   
146/157 KB   165/165 KB   20/26 KB   
150/157 KB   165/165 KB   20/26 KB   
150/157 KB   165/165 KB   24/26 KB   
150/157 KB   165/165 KB   24/26 KB   
150/157 KB   165/165 KB   26/26 KB   
                                     
Downloaded: http://repo.maven.apache.org/maven2/org/codehaus/plexus/plexus-utils/1.0.5/plexus-utils-1.0.5.jar (165 KB at 1664.3 KB/sec)
2/38 KB   150/157 KB   26/26 KB      
6/38 KB   150/157 KB   26/26 KB   
10/38 KB   150/157 KB   26/26 KB   
14/38 KB   150/157 KB   26/26 KB   
18/38 KB   150/157 KB   26/26 KB   
22/38 KB   150/157 KB   26/26 KB   
26/38 KB   150/157 KB   26/26 KB   
30/38 KB   150/157 KB   26/26 KB   
34/38 KB   150/157 KB   26/26 KB   
38/38 KB   150/157 KB   26/26 KB   
38/38 KB   150/157 KB   26/26 KB   
38/38 KB   154/157 KB   26/26 KB   
38/38 KB   157/157 KB   26/26 KB   
                                   
Downloaded: http://repo.maven.apache.org/maven2/commons-logging/commons-logging-api/1.0.4/commons-logging-api-1.0.4.jar (26 KB at 465.2 KB/sec)
                                   
Downloaded: http://repo.maven.apache.org/maven2/org/apache/maven/doxia/doxia-decoration-model/1.0-alpha-7/doxia-decoration-model-1.0-alpha-7.jar (38 KB at 677.8 KB/sec)
                                   
Downloaded: http://repo.maven.apache.org/maven2/plexus/plexus-utils/1.0.2/plexus-utils-1.0.2.jar (157 KB at 2008.0 KB/sec)
[INFO] 
[INFO] --- maven-enforcer-plugin:1.0-beta-1:enforce (enforce-versions) @ maven-tagdoc-plugin ---
[INFO] 
[INFO] --- maven-plugin-plugin:2.5.1:descriptor (default-descriptor) @ maven-tagdoc-plugin ---
[INFO] Using 'UTF-8' encoding to read mojo metadata.
[INFO] Applying mojo extractor for language: java
[INFO] Mojo extractor for language: java found 1 mojo descriptors.
[INFO] Applying mojo extractor for language: bsh
[INFO] Mojo extractor for language: bsh found 0 mojo descriptors.
[INFO] 
[INFO] --- maven-remote-resources-plugin:1.1:process (default) @ maven-tagdoc-plugin ---
[INFO] 
[INFO] --- maven-resources-plugin:2.4.3:resources (default-resources) @ maven-tagdoc-plugin ---
[INFO] Using 'UTF-8' encoding to copy filtered resources.
[INFO] Copying 0 resource
[INFO] Copying 2 resources
[INFO] 
[INFO] --- maven-compiler-plugin:2.3.1:compile (default-compile) @ maven-tagdoc-plugin ---
[INFO] Compiling 1 source file to /x1/jenkins/jenkins-slave/workspace/Trinidad Core Trunk (snapshot)/trinidad-maven/maven-tagdoc-plugin/target/classes
[INFO] 
[INFO] --- maven-resources-plugin:2.4.3:testResources (default-testResources) @ maven-tagdoc-plugin ---
[INFO] Using 'UTF-8' encoding to copy filtered resources.
[INFO] skip non existing resourceDirectory /x1/jenkins/jenkins-slave/workspace/Trinidad Core Trunk (snapshot)/trinidad-maven/maven-tagdoc-plugin/src/test/resources
[INFO] Copying 2 resources
[INFO] 
[INFO] --- maven-compiler-plugin:2.3.1:testCompile (default-testCompile) @ maven-tagdoc-plugin ---
[INFO] No sources to compile
[INFO] 
[INFO] --- maven-surefire-plugin:2.5:test (default-test) @ maven-tagdoc-plugin ---
[INFO] Surefire report directory: /x1/jenkins/jenkins-slave/workspace/Trinidad Core Trunk (snapshot)/trinidad-maven/maven-tagdoc-plugin/target/surefire-reports

-------------------------------------------------------
 T E S T S
-------------------------------------------------------
There are no tests to run.

Results :

Tests run: 0, Failures: 0, Errors: 0, Skipped: 0

[INFO] 
[INFO] --- maven-jar-plugin:2.3.1:jar (default-jar) @ maven-tagdoc-plugin ---
[INFO] Building jar: /x1/jenkins/jenkins-slave/workspace/Trinidad Core Trunk (snapshot)/trinidad-maven/maven-tagdoc-plugin/target/maven-tagdoc-plugin-2.0.8.jar
[INFO] 
[INFO] --- maven-plugin-plugin:2.5.1:addPluginArtifactMetadata (default-addPluginArtifactMetadata) @ maven-tagdoc-plugin ---
[INFO] 
[INFO] --- maven-install-plugin:2.3:install (default-install) @ maven-tagdoc-plugin ---
[INFO] Installing /x1/jenkins/jenkins-slave/workspace/Trinidad Core Trunk (snapshot)/trinidad-maven/maven-tagdoc-plugin/target/maven-tagdoc-plugin-2.0.8.jar to <https://builds.apache.org/job/Trinidad%20Core%20Trunk%20(snapshot)/ws/.repository/org/apache/myfaces/trinidadbuild/maven-tagdoc-plugin/2.0.8/maven-tagdoc-plugin-2.0.8.jar>
[INFO] Installing /x1/jenkins/jenkins-slave/workspace/Trinidad Core Trunk (snapshot)/trinidad-maven/maven-tagdoc-plugin/pom.xml to <https://builds.apache.org/job/Trinidad%20Core%20Trunk%20(snapshot)/ws/.repository/org/apache/myfaces/trinidadbuild/maven-tagdoc-plugin/2.0.8/maven-tagdoc-plugin-2.0.8.pom>
[INFO] ------------------------------------------------------------------------
[INFO] Reactor Summary:
[INFO] 
[INFO] Apache Trinidad Maven Plugin Parent ............... SUCCESS [11.442s]
[INFO] Apache Trinidad Maven JDev Plugin ................. SUCCESS [9.181s]
[INFO] Apache Trinidad Maven Faces Plugin ................ SUCCESS [4.605s]
[INFO] Apache Trinidad Maven Javacc Plugin ............... SUCCESS [1.913s]
[INFO] Apache Trinidad Maven i18n Plugin ................. SUCCESS [1.912s]
[INFO] Apache Trinidad Maven Javascript Plugin ........... SUCCESS [3.258s]
[INFO] Apache Trinidad Maven XRTS Plugin ................. SUCCESS [0.832s]
[INFO] Apache Trinidad Maven Tag Documentation Report .... SUCCESS [2.533s]
[INFO] ------------------------------------------------------------------------
[INFO] BUILD SUCCESS
[INFO] ------------------------------------------------------------------------
[INFO] Total time: 37.499s
[INFO] Finished at: Mon Nov 04 08:31:59 UTC 2013
[INFO] Final Memory: 43M/497M
[INFO] ------------------------------------------------------------------------
Parsing POMs
Downloaded artifact http://repo.maven.apache.org/maven2/org/apache/myfaces/myfaces/11/myfaces-11.pom
Downloaded artifact http://repo.maven.apache.org/maven2/org/apache/apache/10/apache-10.pom
maven3-agent.jar already up to date
maven3-interceptor.jar already up to date
maven3-interceptor-commons.jar already up to date
[Trinidad Core Trunk (snapshot)] $ /home/hudson/tools/java/latest1.6/bin/java -Xms512m -Xmx1024m -XX:PermSize=256m -XX:MaxPermSize=512m -cp /home/jenkins/jenkins-slave/maven3-agent.jar:/home/hudson/tools/maven/apache-maven-3.0.4/boot/plexus-classworlds-2.4.jar org.jvnet.hudson.maven3.agent.Maven3Main /home/hudson/tools/maven/apache-maven-3.0.4 /x1/jenkins/jenkins-slave/slave.jar /home/jenkins/jenkins-slave/maven3-interceptor.jar /home/jenkins/jenkins-slave/maven3-interceptor-commons.jar 53745
<===[JENKINS REMOTING CAPACITY]===>   channel started
log4j:WARN No appenders could be found for logger (org.apache.commons.beanutils.converters.BooleanConverter).
log4j:WARN Please initialize the log4j system properly.
Executing Maven:  -B -f <https://builds.apache.org/job/Trinidad%20Core%20Trunk%20(snapshot)/ws/pom.xml> -Dmaven.repo.local=<https://builds.apache.org/job/Trinidad%20Core%20Trunk%20(snapshot)/ws/.repository> -PbuildSnapshot,-buildExamples,enableRat,enableAssert clean install deploy[INFO] Scanning for projects...

[INFO] ------------------------------------------------------------------------
[INFO] Reactor Build Order:
[INFO] 
[INFO] Apache MyFaces Trinidad
[INFO] Apache MyFaces Trinidad Build
[INFO] Apache MyFaces Trinidad API
[INFO] Apache MyFaces Trinidad Impl
[INFO]                                                                         
[INFO] ------------------------------------------------------------------------
[INFO] Building Apache MyFaces Trinidad 2.1.1-SNAPSHOT
[INFO] ------------------------------------------------------------------------
Downloading: http://repo.maven.apache.org/maven2/org/apache/maven/plugins/maven-source-plugin/2.1.2/maven-source-plugin-2.1.2.pom
Downloaded: http://repo.maven.apache.org/maven2/org/apache/maven/plugins/maven-source-plugin/2.1.2/maven-source-plugin-2.1.2.pom (6 KB at 26.0 KB/sec)
Downloading: http://repo.maven.apache.org/maven2/org/apache/maven/plugins/maven-source-plugin/2.1.2/maven-source-plugin-2.1.2.jar
Downloaded: http://repo.maven.apache.org/maven2/org/apache/maven/plugins/maven-source-plugin/2.1.2/maven-source-plugin-2.1.2.jar (24 KB at 286.5 KB/sec)
[WARNING] The POM for org.apache.myfaces.trinidadbuild:maven-xrts-plugin:jar:2.0.8-SNAPSHOT is missing, no dependency information available
[INFO] ------------------------------------------------------------------------
[INFO] Reactor Summary:
[INFO] 
[INFO] Apache MyFaces Trinidad ........................... FAILURE [3.654s]
[INFO] Apache MyFaces Trinidad Build ..................... SKIPPED
[INFO] Apache MyFaces Trinidad API ....................... SKIPPED
[INFO] Apache MyFaces Trinidad Impl ...................... SKIPPED
[INFO] ------------------------------------------------------------------------
[INFO] BUILD FAILURE
[INFO] ------------------------------------------------------------------------
[INFO] Total time: 9:40.561s
[INFO] Finished at: Mon Nov 04 08:42:13 UTC 2013
[INFO] Final Memory: 6M/490M
[INFO] ------------------------------------------------------------------------
Waiting for Jenkins to finish collecting data
[ERROR] Plugin org.apache.myfaces.trinidadbuild:maven-xrts-plugin:2.0.8-SNAPSHOT or one of its dependencies could not be resolved: Failed to read artifact descriptor for org.apache.myfaces.trinidadbuild:maven-xrts-plugin:jar:2.0.8-SNAPSHOT: Could not find artifact org.apache.myfaces.trinidadbuild:maven-xrts-plugin:pom:2.0.8-SNAPSHOT -> [Help 1]
[ERROR] 
[ERROR] To see the full stack trace of the errors, re-run Maven with the -e switch.
[ERROR] Re-run Maven using the -X switch to enable full debug logging.
[ERROR] 
[ERROR] For more information about the errors and possible solutions, please read the following articles:
[ERROR] [Help 1] http://cwiki.apache.org/confluence/display/MAVEN/PluginResolutionException
[JENKINS] Archiving <https://builds.apache.org/job/Trinidad%20Core%20Trunk%20(snapshot)/ws/trinidad-build/pom.xml> to org.apache.myfaces.trinidad/trinidad-build/2.1.1-SNAPSHOT/trinidad-build-2.1.1-SNAPSHOT.pom
[JENKINS] Archiving <https://builds.apache.org/job/Trinidad%20Core%20Trunk%20(snapshot)/ws/pom.xml> to org.apache.myfaces.trinidad/trinidad/2.1.1-SNAPSHOT/trinidad-2.1.1-SNAPSHOT.pom
[JENKINS] Archiving <https://builds.apache.org/job/Trinidad%20Core%20Trunk%20(snapshot)/ws/trinidad-api/pom.xml> to org.apache.myfaces.trinidad/trinidad-api/2.1.1-SNAPSHOT/trinidad-api-2.1.1-SNAPSHOT.pom
[JENKINS] Archiving <https://builds.apache.org/job/Trinidad%20Core%20Trunk%20(snapshot)/ws/trinidad-impl/pom.xml> to org.apache.myfaces.trinidad/trinidad-impl/2.1.1-SNAPSHOT/trinidad-impl-2.1.1-SNAPSHOT.pom
Sending e-mails to: commits@myfaces.apache.org sobryan@apache.org null@apache.org
channel stopped

Jenkins build is back to normal : Trinidad Core Trunk (snapshot) #99

Posted by Apache Jenkins Server <je...@builds.apache.org>.
See <https://builds.apache.org/job/Trinidad%20Core%20Trunk%20(snapshot)/99/changes>


Build failed in Jenkins: Trinidad Core Trunk (snapshot) #98

Posted by Apache Jenkins Server <je...@builds.apache.org>.
See <https://builds.apache.org/job/Trinidad%20Core%20Trunk%20(snapshot)/98/changes>

Changes:

[jwaldman] TRINIDAD-2423 wrong assertion for font-size that it should be numeric
Thanks to Anand Nath for the patch

[andys] TRINIDAD-2410 LOCAL_VALUE_SET_KEY and SUBMITTED_VALUE_KEY should specify CAP_NOT_BOUND

------------------------------------------
[...truncated 15438 lines...]
174/506 KB   26/26 KB   284/353 KB   49/49 KB   38/38 KB   
174/506 KB   26/26 KB   288/353 KB   49/49 KB   38/38 KB   
174/506 KB   26/26 KB   292/353 KB   49/49 KB   38/38 KB   
174/506 KB   26/26 KB   296/353 KB   49/49 KB   38/38 KB   
174/506 KB   26/26 KB   300/353 KB   49/49 KB   38/38 KB   
174/506 KB   26/26 KB   304/353 KB   49/49 KB   38/38 KB   
174/506 KB   26/26 KB   307/353 KB   49/49 KB   38/38 KB   
174/506 KB   26/26 KB   311/353 KB   49/49 KB   38/38 KB   
174/506 KB   26/26 KB   315/353 KB   49/49 KB   38/38 KB   
174/506 KB   26/26 KB   319/353 KB   49/49 KB   38/38 KB   
174/506 KB   26/26 KB   323/353 KB   49/49 KB   38/38 KB   
174/506 KB   26/26 KB   325/353 KB   49/49 KB   38/38 KB   
174/506 KB   26/26 KB   329/353 KB   49/49 KB   38/38 KB   
174/506 KB   26/26 KB   333/353 KB   49/49 KB   38/38 KB   
                                                           
174/506 KB   337/353 KB   49/49 KB   38/38 KB              
Downloaded: http://repo.maven.apache.org/maven2/commons-logging/commons-logging-api/1.0.4/commons-logging-api-1.0.4.jar (26 KB at 492.1 KB/sec)
174/506 KB   341/353 KB   49/49 KB   38/38 KB   
174/506 KB   345/353 KB   49/49 KB   38/38 KB   
174/506 KB   349/353 KB   49/49 KB   38/38 KB   
174/506 KB   353/353 KB   49/49 KB   38/38 KB   
178/506 KB   353/353 KB   49/49 KB   38/38 KB   
182/506 KB   353/353 KB   49/49 KB   38/38 KB   
186/506 KB   353/353 KB   49/49 KB   38/38 KB   
190/506 KB   353/353 KB   49/49 KB   38/38 KB   
192/506 KB   353/353 KB   49/49 KB   38/38 KB   
196/506 KB   353/353 KB   49/49 KB   38/38 KB   
200/506 KB   353/353 KB   49/49 KB   38/38 KB   
204/506 KB   353/353 KB   49/49 KB   38/38 KB   
208/506 KB   353/353 KB   49/49 KB   38/38 KB   
212/506 KB   353/353 KB   49/49 KB   38/38 KB   
216/506 KB   353/353 KB   49/49 KB   38/38 KB   
220/506 KB   353/353 KB   49/49 KB   38/38 KB   
224/506 KB   353/353 KB   49/49 KB   38/38 KB   
228/506 KB   353/353 KB   49/49 KB   38/38 KB   
232/506 KB   353/353 KB   49/49 KB   38/38 KB   
236/506 KB   353/353 KB   49/49 KB   38/38 KB   
240/506 KB   353/353 KB   49/49 KB   38/38 KB   
244/506 KB   353/353 KB   49/49 KB   38/38 KB   
248/506 KB   353/353 KB   49/49 KB   38/38 KB   
252/506 KB   353/353 KB   49/49 KB   38/38 KB   
256/506 KB   353/353 KB   49/49 KB   38/38 KB   
260/506 KB   353/353 KB   49/49 KB   38/38 KB   
264/506 KB   353/353 KB   49/49 KB   38/38 KB   
268/506 KB   353/353 KB   49/49 KB   38/38 KB   
272/506 KB   353/353 KB   49/49 KB   38/38 KB   
276/506 KB   353/353 KB   49/49 KB   38/38 KB   
280/506 KB   353/353 KB   49/49 KB   38/38 KB   
284/506 KB   353/353 KB   49/49 KB   38/38 KB   
288/506 KB   353/353 KB   49/49 KB   38/38 KB   
292/506 KB   353/353 KB   49/49 KB   38/38 KB   
296/506 KB   353/353 KB   49/49 KB   38/38 KB   
300/506 KB   353/353 KB   49/49 KB   38/38 KB   
304/506 KB   353/353 KB   49/49 KB   38/38 KB   
308/506 KB   353/353 KB   49/49 KB   38/38 KB   
312/506 KB   353/353 KB   49/49 KB   38/38 KB   
316/506 KB   353/353 KB   49/49 KB   38/38 KB   
320/506 KB   353/353 KB   49/49 KB   38/38 KB   
324/506 KB   353/353 KB   49/49 KB   38/38 KB   
328/506 KB   353/353 KB   49/49 KB   38/38 KB   
332/506 KB   353/353 KB   49/49 KB   38/38 KB   
336/506 KB   353/353 KB   49/49 KB   38/38 KB   
340/506 KB   353/353 KB   49/49 KB   38/38 KB   
344/506 KB   353/353 KB   49/49 KB   38/38 KB   
348/506 KB   353/353 KB   49/49 KB   38/38 KB   
352/506 KB   353/353 KB   49/49 KB   38/38 KB   
356/506 KB   353/353 KB   49/49 KB   38/38 KB   
358/506 KB   353/353 KB   49/49 KB   38/38 KB   
                                                
Downloaded: http://repo.maven.apache.org/maven2/org/apache/maven/doxia/doxia-decoration-model/1.0-alpha-7/doxia-decoration-model-1.0-alpha-7.jar (38 KB at 677.8 KB/sec)
                                                
Downloaded: http://repo.maven.apache.org/maven2/org/apache/maven/maven-artifact-manager/2.0.1/maven-artifact-manager-2.0.1.jar (49 KB at 194.3 KB/sec)
                                                
Downloaded: http://repo.maven.apache.org/maven2/velocity/velocity/1.4/velocity-1.4.jar (353 KB at 4580.6 KB/sec)
362/506 KB                                      
366/506 KB   
370/506 KB   
374/506 KB   
378/506 KB   
382/506 KB   
386/506 KB   
390/506 KB   
394/506 KB   
398/506 KB   
402/506 KB   
406/506 KB   
410/506 KB   
414/506 KB   
418/506 KB   
422/506 KB   
426/506 KB   
430/506 KB   
434/506 KB   
438/506 KB   
442/506 KB   
446/506 KB   
450/506 KB   
454/506 KB   
458/506 KB   
462/506 KB   
466/506 KB   
470/506 KB   
474/506 KB   
478/506 KB   
482/506 KB   
486/506 KB   
490/506 KB   
494/506 KB   
498/506 KB   
502/506 KB   
506/506 KB   
506/506 KB   
             
Downloaded: http://repo.maven.apache.org/maven2/velocity/velocity-dep/1.4/velocity-dep-1.4.jar (506 KB at 4681.7 KB/sec)
[INFO] 
[INFO] --- maven-enforcer-plugin:1.0.1:enforce (enforce-versions) @ maven-tagdoc-plugin ---
[INFO] 
[INFO] --- maven-plugin-plugin:2.8:descriptor (default-descriptor) @ maven-tagdoc-plugin ---
[ERROR] 

Artifact Ids of the format maven-___-plugin are reserved for 
plugins in the Group Id org.apache.maven.plugins
Please change your artifactId to the format ___-maven-plugin
In the future this error will break the build.


[INFO] Using 'UTF-8' encoding to read mojo metadata.
[INFO] Applying mojo extractor for language: java
[INFO] Mojo extractor for language: java found 1 mojo descriptors.
[INFO] Applying mojo extractor for language: bsh
[INFO] Mojo extractor for language: bsh found 0 mojo descriptors.
[INFO] 
[INFO] --- maven-remote-resources-plugin:1.2.1:process (default) @ maven-tagdoc-plugin ---
[INFO] 
[INFO] --- maven-resources-plugin:2.5:resources (default-resources) @ maven-tagdoc-plugin ---
[debug] execute contextualize
[INFO] Using 'UTF-8' encoding to copy filtered resources.
[INFO] Copying 0 resource
[INFO] Copying 2 resources
[INFO] 
[INFO] --- maven-compiler-plugin:2.3.2:compile (default-compile) @ maven-tagdoc-plugin ---
[INFO] Compiling 1 source file to /x1/jenkins/jenkins-slave/workspace/Trinidad Core Trunk (snapshot)/trinidad-maven/maven-tagdoc-plugin/target/classes
[INFO] 
[INFO] --- maven-resources-plugin:2.5:testResources (default-testResources) @ maven-tagdoc-plugin ---
[debug] execute contextualize
[INFO] Using 'UTF-8' encoding to copy filtered resources.
[INFO] skip non existing resourceDirectory /x1/jenkins/jenkins-slave/workspace/Trinidad Core Trunk (snapshot)/trinidad-maven/maven-tagdoc-plugin/src/test/resources
[INFO] Copying 2 resources
[INFO] 
[INFO] --- maven-compiler-plugin:2.3.2:testCompile (default-testCompile) @ maven-tagdoc-plugin ---
[INFO] No sources to compile
[INFO] 
[INFO] --- maven-surefire-plugin:2.9:test (default-test) @ maven-tagdoc-plugin ---
[INFO] Surefire report directory: /x1/jenkins/jenkins-slave/workspace/Trinidad Core Trunk (snapshot)/trinidad-maven/maven-tagdoc-plugin/target/surefire-reports

-------------------------------------------------------
 T E S T S
-------------------------------------------------------

Results :

Tests run: 0, Failures: 0, Errors: 0, Skipped: 0

[INFO] 
[INFO] --- maven-jar-plugin:2.3.2:jar (default-jar) @ maven-tagdoc-plugin ---
[INFO] Building jar: /x1/jenkins/jenkins-slave/workspace/Trinidad Core Trunk (snapshot)/trinidad-maven/maven-tagdoc-plugin/target/maven-tagdoc-plugin-2.0.9-SNAPSHOT.jar
[INFO] 
[INFO] --- maven-plugin-plugin:2.8:addPluginArtifactMetadata (default-addPluginArtifactMetadata) @ maven-tagdoc-plugin ---
[INFO] 
[INFO] --- maven-site-plugin:3.0:attach-descriptor (attach-descriptor) @ maven-tagdoc-plugin ---
[INFO] 
[INFO] --- maven-checkstyle-plugin:2.7:check (verify-style) @ maven-tagdoc-plugin ---
[INFO] 
[INFO] 
[INFO] --- maven-install-plugin:2.3.1:install (default-install) @ maven-tagdoc-plugin ---
[INFO] Installing /x1/jenkins/jenkins-slave/workspace/Trinidad Core Trunk (snapshot)/trinidad-maven/maven-tagdoc-plugin/target/maven-tagdoc-plugin-2.0.9-SNAPSHOT.jar to <https://builds.apache.org/job/Trinidad%20Core%20Trunk%20(snapshot)/ws/.repository/org/apache/myfaces/trinidadbuild/maven-tagdoc-plugin/2.0.9-SNAPSHOT/maven-tagdoc-plugin-2.0.9-SNAPSHOT.jar>
[INFO] Installing /x1/jenkins/jenkins-slave/workspace/Trinidad Core Trunk (snapshot)/trinidad-maven/maven-tagdoc-plugin/pom.xml to <https://builds.apache.org/job/Trinidad%20Core%20Trunk%20(snapshot)/ws/.repository/org/apache/myfaces/trinidadbuild/maven-tagdoc-plugin/2.0.9-SNAPSHOT/maven-tagdoc-plugin-2.0.9-SNAPSHOT.pom>
[INFO] ------------------------------------------------------------------------
[INFO] Reactor Summary:
[INFO] 
[INFO] Apache Trinidad Maven Plugin Parent ............... SUCCESS [24.251s]
[INFO] Apache Trinidad Maven JDev Plugin ................. SUCCESS [6.653s]
[INFO] Apache Trinidad Maven Faces Plugin ................ SUCCESS [4.821s]
[INFO] Apache Trinidad Maven Javacc Plugin ............... SUCCESS [2.124s]
[INFO] Apache Trinidad Maven i18n Plugin ................. SUCCESS [2.579s]
[INFO] Apache Trinidad Maven Javascript Plugin ........... SUCCESS [4.178s]
[INFO] Apache Trinidad Maven XRTS Plugin ................. SUCCESS [0.735s]
[INFO] Apache Trinidad Maven Tag Documentation Report .... SUCCESS [3.053s]
[INFO] ------------------------------------------------------------------------
[INFO] BUILD SUCCESS
[INFO] ------------------------------------------------------------------------
[INFO] Total time: 49.342s
[INFO] Finished at: Wed Nov 06 12:14:25 UTC 2013
[INFO] Final Memory: 48M/499M
[INFO] ------------------------------------------------------------------------
Parsing POMs
maven3-agent.jar already up to date
maven3-interceptor.jar already up to date
maven3-interceptor-commons.jar already up to date
[Trinidad Core Trunk (snapshot)] $ /home/hudson/tools/java/latest1.6/bin/java -Xms512m -Xmx1024m -XX:PermSize=256m -XX:MaxPermSize=512m -cp /home/jenkins/jenkins-slave/maven3-agent.jar:/home/hudson/tools/maven/apache-maven-3.0.4/boot/plexus-classworlds-2.4.jar org.jvnet.hudson.maven3.agent.Maven3Main /home/hudson/tools/maven/apache-maven-3.0.4 /x1/jenkins/jenkins-slave/slave.jar /home/jenkins/jenkins-slave/maven3-interceptor.jar /home/jenkins/jenkins-slave/maven3-interceptor-commons.jar 50850
<===[JENKINS REMOTING CAPACITY]===>   channel started
log4j:WARN No appenders could be found for logger (org.apache.commons.beanutils.converters.BooleanConverter).
log4j:WARN Please initialize the log4j system properly.
Executing Maven:  -B -f <https://builds.apache.org/job/Trinidad%20Core%20Trunk%20(snapshot)/ws/pom.xml> -Dmaven.repo.local=<https://builds.apache.org/job/Trinidad%20Core%20Trunk%20(snapshot)/ws/.repository> -PbuildSnapshot,-buildExamples,enableRat,enableAssert clean install deploy[INFO] Scanning for projects...
[INFO] ------------------------------------------------------------------------

[INFO] Reactor Build Order:
[INFO] 
[INFO] Apache MyFaces Trinidad
[INFO] Apache MyFaces Trinidad Build
[INFO] Apache MyFaces Trinidad API
[INFO] Apache MyFaces Trinidad Impl
[INFO]                                                                         
[INFO] ------------------------------------------------------------------------
[INFO] Building Apache MyFaces Trinidad 2.1.1-SNAPSHOT
[INFO] ------------------------------------------------------------------------
Downloading: http://repo.maven.apache.org/maven2/org/apache/maven/plugins/maven-source-plugin/2.1.2/maven-source-plugin-2.1.2.pom
Downloaded: http://repo.maven.apache.org/maven2/org/apache/maven/plugins/maven-source-plugin/2.1.2/maven-source-plugin-2.1.2.pom (6 KB at 14.2 KB/sec)
Downloading: http://repo.maven.apache.org/maven2/org/apache/maven/plugins/maven-source-plugin/2.1.2/maven-source-plugin-2.1.2.jar
Downloaded: http://repo.maven.apache.org/maven2/org/apache/maven/plugins/maven-source-plugin/2.1.2/maven-source-plugin-2.1.2.jar (24 KB at 305.1 KB/sec)
[WARNING] The POM for org.apache.myfaces.trinidadbuild:maven-xrts-plugin:jar:2.0.8-SNAPSHOT is missing, no dependency information available
[INFO] ------------------------------------------------------------------------
[INFO] Reactor Summary:
[INFO] 
[INFO] Apache MyFaces Trinidad ........................... FAILURE [4.399s]
[INFO] Apache MyFaces Trinidad Build ..................... SKIPPED
[INFO] Apache MyFaces Trinidad API ....................... SKIPPED
[INFO] Apache MyFaces Trinidad Impl ...................... SKIPPED
[INFO] ------------------------------------------------------------------------
[INFO] BUILD FAILURE
[INFO] ------------------------------------------------------------------------
[INFO] Total time: 4:10.484s
[INFO] Finished at: Wed Nov 06 12:18:47 UTC 2013
[INFO] Final Memory: 6M/490M
[INFO] ------------------------------------------------------------------------
Waiting for Jenkins to finish collecting data
[ERROR] Plugin org.apache.myfaces.trinidadbuild:maven-xrts-plugin:2.0.8-SNAPSHOT or one of its dependencies could not be resolved: Failed to read artifact descriptor for org.apache.myfaces.trinidadbuild:maven-xrts-plugin:jar:2.0.8-SNAPSHOT: Could not find artifact org.apache.myfaces.trinidadbuild:maven-xrts-plugin:pom:2.0.8-SNAPSHOT -> [Help 1]
[ERROR] 
[ERROR] To see the full stack trace of the errors, re-run Maven with the -e switch.
[ERROR] Re-run Maven using the -X switch to enable full debug logging.
[ERROR] 
[ERROR] For more information about the errors and possible solutions, please read the following articles:
[ERROR] [Help 1] http://cwiki.apache.org/confluence/display/MAVEN/PluginResolutionException
[JENKINS] Archiving <https://builds.apache.org/job/Trinidad%20Core%20Trunk%20(snapshot)/ws/trinidad-build/pom.xml> to org.apache.myfaces.trinidad/trinidad-build/2.1.1-SNAPSHOT/trinidad-build-2.1.1-SNAPSHOT.pom
[JENKINS] Archiving <https://builds.apache.org/job/Trinidad%20Core%20Trunk%20(snapshot)/ws/pom.xml> to org.apache.myfaces.trinidad/trinidad/2.1.1-SNAPSHOT/trinidad-2.1.1-SNAPSHOT.pom
[JENKINS] Archiving <https://builds.apache.org/job/Trinidad%20Core%20Trunk%20(snapshot)/ws/trinidad-api/pom.xml> to org.apache.myfaces.trinidad/trinidad-api/2.1.1-SNAPSHOT/trinidad-api-2.1.1-SNAPSHOT.pom
[JENKINS] Archiving <https://builds.apache.org/job/Trinidad%20Core%20Trunk%20(snapshot)/ws/trinidad-impl/pom.xml> to org.apache.myfaces.trinidad/trinidad-impl/2.1.1-SNAPSHOT/trinidad-impl-2.1.1-SNAPSHOT.pom
Sending e-mails to: commits@myfaces.apache.org sobryan@apache.org null@apache.org
channel stopped

Build failed in Jenkins: Trinidad Core Trunk (snapshot) #97

Posted by Apache Jenkins Server <je...@builds.apache.org>.
See <https://builds.apache.org/job/Trinidad%20Core%20Trunk%20(snapshot)/97/changes>

Changes:

[sobryan] Fixed some issues with RAT audits

[sobryan] [maven-release-plugin] prepare for next development iteration

[sobryan] [maven-release-plugin] prepare release maven-plugin-parent-2.0.8

[sobryan] Changed SCM locations which was preventing release:prepare from functioning.

[sobryan] Undo failure on release:prepare

[sobryan] [maven-release-plugin] prepare release maven-plugin-parent-2.0.8

[sobryan] Undo failure on release:prepare

[sobryan] Prepare the trinidad plugins for release.

This transaction updates the plugins to use the latest myfaces master poms.  I adjusted all of the copyrights and removed tabs/invalid characters so that checkstyle minimum could pass.

------------------------------------------
[...truncated 15525 lines...]
283/353 KB   172/506 KB   
283/353 KB   176/506 KB   
287/353 KB   176/506 KB   
287/353 KB   180/506 KB   
291/353 KB   180/506 KB   
291/353 KB   184/506 KB   
295/353 KB   184/506 KB   
295/353 KB   188/506 KB   
295/353 KB   192/506 KB   
299/353 KB   192/506 KB   
299/353 KB   196/506 KB   
303/353 KB   196/506 KB   
303/353 KB   200/506 KB   
307/353 KB   200/506 KB   
307/353 KB   204/506 KB   
311/353 KB   204/506 KB   
311/353 KB   208/506 KB   
315/353 KB   212/506 KB   
315/353 KB   212/506 KB   
319/353 KB   212/506 KB   
319/353 KB   216/506 KB   
319/353 KB   220/506 KB   
323/353 KB   220/506 KB   
323/353 KB   224/506 KB   
327/353 KB   224/506 KB   
327/353 KB   228/506 KB   
331/353 KB   228/506 KB   
331/353 KB   232/506 KB   
335/353 KB   232/506 KB   
335/353 KB   236/506 KB   
339/353 KB   240/506 KB   
339/353 KB   240/506 KB   
343/353 KB   240/506 KB   
343/353 KB   244/506 KB   
343/353 KB   248/506 KB   
347/353 KB   248/506 KB   
347/353 KB   252/506 KB   
351/353 KB   252/506 KB   
351/353 KB   256/506 KB   
353/353 KB   256/506 KB   
353/353 KB   260/506 KB   
353/353 KB   264/506 KB   
353/353 KB   268/506 KB   
353/353 KB   272/506 KB   
353/353 KB   276/506 KB   
353/353 KB   280/506 KB   
353/353 KB   284/506 KB   
353/353 KB   288/506 KB   
353/353 KB   292/506 KB   
353/353 KB   296/506 KB   
353/353 KB   300/506 KB   
353/353 KB   304/506 KB   
353/353 KB   308/506 KB   
353/353 KB   312/506 KB   
353/353 KB   316/506 KB   
353/353 KB   320/506 KB   
353/353 KB   324/506 KB   
353/353 KB   328/506 KB   
353/353 KB   332/506 KB   
353/353 KB   336/506 KB   
353/353 KB   340/506 KB   
353/353 KB   344/506 KB   
353/353 KB   348/506 KB   
353/353 KB   352/506 KB   
353/353 KB   356/506 KB   
353/353 KB   360/506 KB   
353/353 KB   364/506 KB   
353/353 KB   368/506 KB   
353/353 KB   372/506 KB   
353/353 KB   376/506 KB   
353/353 KB   380/506 KB   
353/353 KB   384/506 KB   
353/353 KB   388/506 KB   
353/353 KB   392/506 KB   
353/353 KB   396/506 KB   
353/353 KB   400/506 KB   
353/353 KB   404/506 KB   
353/353 KB   408/506 KB   
353/353 KB   412/506 KB   
353/353 KB   416/506 KB   
                          
420/506 KB                
Downloaded: http://repo.maven.apache.org/maven2/velocity/velocity/1.4/velocity-1.4.jar (353 KB at 16795.6 KB/sec)
424/506 KB   
428/506 KB   
432/506 KB   
436/506 KB   
440/506 KB   
444/506 KB   
448/506 KB   
452/506 KB   
456/506 KB   
460/506 KB   
464/506 KB   
468/506 KB   
472/506 KB   
476/506 KB   
480/506 KB   
484/506 KB   
488/506 KB   
492/506 KB   
496/506 KB   
500/506 KB   
504/506 KB   
506/506 KB   
             
Downloaded: http://repo.maven.apache.org/maven2/velocity/velocity-dep/1.4/velocity-dep-1.4.jar (506 KB at 22983.0 KB/sec)
4/20 KB      
8/20 KB   
12/20 KB   
16/20 KB   
20/20 KB   
           
Downloaded: http://repo.maven.apache.org/maven2/org/apache/maven/maven-repository-metadata/2.0.1/maven-repository-metadata-2.0.1.jar (20 KB at 228.0 KB/sec)
[INFO] 
[INFO] --- maven-enforcer-plugin:1.0.1:enforce (enforce-versions) @ maven-tagdoc-plugin ---
[INFO] 
[INFO] --- maven-plugin-plugin:2.8:descriptor (default-descriptor) @ maven-tagdoc-plugin ---
[ERROR] 

Artifact Ids of the format maven-___-plugin are reserved for 
plugins in the Group Id org.apache.maven.plugins
Please change your artifactId to the format ___-maven-plugin
In the future this error will break the build.


[INFO] Using 'UTF-8' encoding to read mojo metadata.
[INFO] Applying mojo extractor for language: java
[INFO] Mojo extractor for language: java found 1 mojo descriptors.
[INFO] Applying mojo extractor for language: bsh
[INFO] Mojo extractor for language: bsh found 0 mojo descriptors.
[INFO] 
[INFO] --- maven-remote-resources-plugin:1.2.1:process (default) @ maven-tagdoc-plugin ---
[INFO] 
[INFO] --- maven-resources-plugin:2.5:resources (default-resources) @ maven-tagdoc-plugin ---
[debug] execute contextualize
[INFO] Using 'UTF-8' encoding to copy filtered resources.
[INFO] Copying 0 resource
[INFO] Copying 2 resources
[INFO] 
[INFO] --- maven-compiler-plugin:2.3.2:compile (default-compile) @ maven-tagdoc-plugin ---
[INFO] Compiling 1 source file to <https://builds.apache.org/job/Trinidad%20Core%20Trunk%20(snapshot)/ws/trinidad-maven/maven-tagdoc-plugin/target/classes>
[INFO] 
[INFO] --- maven-resources-plugin:2.5:testResources (default-testResources) @ maven-tagdoc-plugin ---
[debug] execute contextualize
[INFO] Using 'UTF-8' encoding to copy filtered resources.
[INFO] skip non existing resourceDirectory <https://builds.apache.org/job/Trinidad%20Core%20Trunk%20(snapshot)/ws/trinidad-maven/maven-tagdoc-plugin/src/test/resources>
[INFO] Copying 2 resources
[INFO] 
[INFO] --- maven-compiler-plugin:2.3.2:testCompile (default-testCompile) @ maven-tagdoc-plugin ---
[INFO] No sources to compile
[INFO] 
[INFO] --- maven-surefire-plugin:2.9:test (default-test) @ maven-tagdoc-plugin ---
[INFO] Surefire report directory: <https://builds.apache.org/job/Trinidad%20Core%20Trunk%20(snapshot)/ws/trinidad-maven/maven-tagdoc-plugin/target/surefire-reports>

-------------------------------------------------------
 T E S T S
-------------------------------------------------------

Results :

Tests run: 0, Failures: 0, Errors: 0, Skipped: 0

[INFO] 
[INFO] --- maven-jar-plugin:2.3.2:jar (default-jar) @ maven-tagdoc-plugin ---
[INFO] Building jar: <https://builds.apache.org/job/Trinidad%20Core%20Trunk%20(snapshot)/ws/trinidad-maven/maven-tagdoc-plugin/target/maven-tagdoc-plugin-2.0.9-SNAPSHOT.jar>
[INFO] 
[INFO] --- maven-plugin-plugin:2.8:addPluginArtifactMetadata (default-addPluginArtifactMetadata) @ maven-tagdoc-plugin ---
[INFO] 
[INFO] --- maven-site-plugin:3.0:attach-descriptor (attach-descriptor) @ maven-tagdoc-plugin ---
[INFO] 
[INFO] --- maven-checkstyle-plugin:2.7:check (verify-style) @ maven-tagdoc-plugin ---
[INFO] 
[INFO] 
[INFO] --- maven-install-plugin:2.3.1:install (default-install) @ maven-tagdoc-plugin ---
[INFO] Installing <https://builds.apache.org/job/Trinidad%20Core%20Trunk%20(snapshot)/ws/trinidad-maven/maven-tagdoc-plugin/target/maven-tagdoc-plugin-2.0.9-SNAPSHOT.jar> to <https://builds.apache.org/job/Trinidad%20Core%20Trunk%20(snapshot)/ws/.repository/org/apache/myfaces/trinidadbuild/maven-tagdoc-plugin/2.0.9-SNAPSHOT/maven-tagdoc-plugin-2.0.9-SNAPSHOT.jar>
[INFO] Installing <https://builds.apache.org/job/Trinidad%20Core%20Trunk%20(snapshot)/ws/trinidad-maven/maven-tagdoc-plugin/pom.xml> to <https://builds.apache.org/job/Trinidad%20Core%20Trunk%20(snapshot)/ws/.repository/org/apache/myfaces/trinidadbuild/maven-tagdoc-plugin/2.0.9-SNAPSHOT/maven-tagdoc-plugin-2.0.9-SNAPSHOT.pom>
[INFO] ------------------------------------------------------------------------
[INFO] Reactor Summary:
[INFO] 
[INFO] Apache Trinidad Maven Plugin Parent ............... SUCCESS [9.419s]
[INFO] Apache Trinidad Maven JDev Plugin ................. SUCCESS [9.916s]
[INFO] Apache Trinidad Maven Faces Plugin ................ SUCCESS [9.834s]
[INFO] Apache Trinidad Maven Javacc Plugin ............... SUCCESS [2.202s]
[INFO] Apache Trinidad Maven i18n Plugin ................. SUCCESS [1.467s]
[INFO] Apache Trinidad Maven Javascript Plugin ........... SUCCESS [4.938s]
[INFO] Apache Trinidad Maven XRTS Plugin ................. SUCCESS [1.004s]
[INFO] Apache Trinidad Maven Tag Documentation Report .... SUCCESS [2.002s]
[INFO] ------------------------------------------------------------------------
[INFO] BUILD SUCCESS
[INFO] ------------------------------------------------------------------------
[INFO] Total time: 41.600s
[INFO] Finished at: Tue Nov 05 15:27:28 UTC 2013
[INFO] Final Memory: 57M/617M
[INFO] ------------------------------------------------------------------------
Parsing POMs
maven3-agent.jar already up to date
maven3-interceptor.jar already up to date
maven3-interceptor-commons.jar already up to date
[Trinidad Core Trunk (snapshot)] $ /home/hudson/tools/java/latest1.6/bin/java -Xms512m -Xmx1024m -XX:PermSize=256m -XX:MaxPermSize=512m -cp /home/jenkins/jenkins-slave/maven3-agent.jar:/home/hudson/tools/maven/apache-maven-3.0.4/boot/plexus-classworlds-2.4.jar org.jvnet.hudson.maven3.agent.Maven3Main /home/hudson/tools/maven/apache-maven-3.0.4 /home/jenkins/jenkins-slave/slave.jar /home/jenkins/jenkins-slave/maven3-interceptor.jar /home/jenkins/jenkins-slave/maven3-interceptor-commons.jar 53980
<===[JENKINS REMOTING CAPACITY]===>channel started
   log4j:WARN No appenders could be found for logger (org.apache.commons.beanutils.converters.BooleanConverter).
Executing Maven:  -B -f <https://builds.apache.org/job/Trinidad%20Core%20Trunk%20(snapshot)/ws/pom.xml> -Dmaven.repo.local=<https://builds.apache.org/job/Trinidad%20Core%20Trunk%20(snapshot)/ws/.repository> -PbuildSnapshot,-buildExamples,enableRat,enableAssert clean install deploylog4j:WARN Please initialize the log4j system properly.

[INFO] Scanning for projects...
[INFO] ------------------------------------------------------------------------
[INFO] Reactor Build Order:
[INFO] 
[INFO] Apache MyFaces Trinidad
[INFO] Apache MyFaces Trinidad Build
[INFO] Apache MyFaces Trinidad API
[INFO] Apache MyFaces Trinidad Impl
[INFO]                                                                         
[INFO] ------------------------------------------------------------------------
[INFO] Building Apache MyFaces Trinidad 2.1.1-SNAPSHOT
[INFO] ------------------------------------------------------------------------
Downloading: http://repo.maven.apache.org/maven2/org/apache/maven/plugins/maven-source-plugin/2.1.2/maven-source-plugin-2.1.2.pom
Downloaded: http://repo.maven.apache.org/maven2/org/apache/maven/plugins/maven-source-plugin/2.1.2/maven-source-plugin-2.1.2.pom (6 KB at 41.0 KB/sec)
Downloading: http://repo.maven.apache.org/maven2/org/apache/maven/plugins/maven-source-plugin/2.1.2/maven-source-plugin-2.1.2.jar
Downloaded: http://repo.maven.apache.org/maven2/org/apache/maven/plugins/maven-source-plugin/2.1.2/maven-source-plugin-2.1.2.jar (24 KB at 1807.3 KB/sec)
[WARNING] The POM for org.apache.myfaces.trinidadbuild:maven-xrts-plugin:jar:2.0.8-SNAPSHOT is missing, no dependency information available
[INFO] ------------------------------------------------------------------------
[INFO] Reactor Summary:
[INFO] 
[INFO] Apache MyFaces Trinidad ........................... FAILURE [7.065s]
[INFO] Apache MyFaces Trinidad Build ..................... SKIPPED
[INFO] Apache MyFaces Trinidad API ....................... SKIPPED
[INFO] Apache MyFaces Trinidad Impl ...................... SKIPPED
[INFO] ------------------------------------------------------------------------
[INFO] BUILD FAILURE
[INFO] ------------------------------------------------------------------------
[INFO] Total time: 23:24.751s
[INFO] Finished at: Tue Nov 05 15:52:32 UTC 2013
[INFO] Final Memory: 5M/490M
[INFO] ------------------------------------------------------------------------
Waiting for Jenkins to finish collecting data
[ERROR] Plugin org.apache.myfaces.trinidadbuild:maven-xrts-plugin:2.0.8-SNAPSHOT or one of its dependencies could not be resolved: Failed to read artifact descriptor for org.apache.myfaces.trinidadbuild:maven-xrts-plugin:jar:2.0.8-SNAPSHOT: Could not find artifact org.apache.myfaces.trinidadbuild:maven-xrts-plugin:pom:2.0.8-SNAPSHOT -> [Help 1]
[ERROR] 
[ERROR] To see the full stack trace of the errors, re-run Maven with the -e switch.
[ERROR] Re-run Maven using the -X switch to enable full debug logging.
[ERROR] 
[ERROR] For more information about the errors and possible solutions, please read the following articles:
[ERROR] [Help 1] http://cwiki.apache.org/confluence/display/MAVEN/PluginResolutionException
[JENKINS] Archiving <https://builds.apache.org/job/Trinidad%20Core%20Trunk%20(snapshot)/ws/trinidad-build/pom.xml> to org.apache.myfaces.trinidad/trinidad-build/2.1.1-SNAPSHOT/trinidad-build-2.1.1-SNAPSHOT.pom
[JENKINS] Archiving <https://builds.apache.org/job/Trinidad%20Core%20Trunk%20(snapshot)/ws/pom.xml> to org.apache.myfaces.trinidad/trinidad/2.1.1-SNAPSHOT/trinidad-2.1.1-SNAPSHOT.pom
[JENKINS] Archiving <https://builds.apache.org/job/Trinidad%20Core%20Trunk%20(snapshot)/ws/trinidad-api/pom.xml> to org.apache.myfaces.trinidad/trinidad-api/2.1.1-SNAPSHOT/trinidad-api-2.1.1-SNAPSHOT.pom
[JENKINS] Archiving <https://builds.apache.org/job/Trinidad%20Core%20Trunk%20(snapshot)/ws/trinidad-impl/pom.xml> to org.apache.myfaces.trinidad/trinidad-impl/2.1.1-SNAPSHOT/trinidad-impl-2.1.1-SNAPSHOT.pom
Sending e-mails to: commits@myfaces.apache.org sobryan@apache.org null@apache.org
channel stopped