You are viewing a plain text version of this content. The canonical link for it is here.
Posted to builds@beam.apache.org by Apache Jenkins Server <je...@builds.apache.org> on 2022/05/21 23:48:33 UTC
Build failed in Jenkins: beam_PostCommit_Java_Examples_Dataflow_V2_java11 #2132
See <https://ci-beam.apache.org/job/beam_PostCommit_Java_Examples_Dataflow_V2_java11/2132/display/redirect>
Changes:
------------------------------------------
[...truncated 36.22 KB...]
Using cached soupsieve-2.3.2.post1-py3-none-any.whl (37 kB)
Collecting six>=1.9.0
Using cached six-1.16.0-py2.py3-none-any.whl (11 kB)
Installing collected packages: soupsieve, six, pyyaml, tenacity, beautifulsoup4
Successfully installed beautifulsoup4-4.11.1 pyyaml-5.4.1 six-1.16.0 soupsieve-2.3.2.post1 tenacity-5.1.5
Executing python <https://ci-beam.apache.org/job/beam_PostCommit_Java_Examples_Dataflow_V2_java11/ws/src/sdks/java/container/license_scripts/pull_licenses_java.py> --license_index=<https://ci-beam.apache.org/job/beam_PostCommit_Java_Examples_Dataflow_V2_java11/ws/src/sdks/java/container/build/reports/dependency-license/index.json> --output_dir=<https://ci-beam.apache.org/job/beam_PostCommit_Java_Examples_Dataflow_V2_java11/ws/src/sdks/java/container/build/target/java_third_party_licenses> --dep_url_yaml=<https://ci-beam.apache.org/job/beam_PostCommit_Java_Examples_Dataflow_V2_java11/ws/src/sdks/java/container/license_scripts/dep_urls_java.yaml> --manual_license_path=<https://ci-beam.apache.org/job/beam_PostCommit_Java_Examples_Dataflow_V2_java11/ws/src/sdks/java/container/license_scripts/manual_licenses>
INFO:root:Pulling license for 242 dependencies using 16 threads.
INFO:root:Replaced local file URL with file://<https://ci-beam.apache.org/job/beam_PostCommit_Java_Examples_Dataflow_V2_java11/ws/src/sdks/java/container/license_scripts/manual_licenses/xz/COPYING> for xz-1.5
INFO:root:pull_licenses_java.py succeed. It took 21.380327 seconds with 16 threads.
Copying licenses from <https://ci-beam.apache.org/job/beam_PostCommit_Java_Examples_Dataflow_V2_java11/ws/src/sdks/java/container/build/target/java_third_party_licenses> to <https://ci-beam.apache.org/job/beam_PostCommit_Java_Examples_Dataflow_V2_java11/ws/src/sdks/java/container/build/target/third_party_licenses.>
Finished license_scripts.sh
> Task :sdks:java:container:goPrepare UP-TO-DATE
> Task :sdks:java:container:java11:copyJavaThirdPartyLicenses
> Task :sdks:java:container:goBuild
/home/jenkins/go/bin/go1.18.1 build -o ./build/target/linux_amd64/boot boot.go boot_test.go
> Task :sdks:java:container:java11:copySdkHarnessLauncher
Execution optimizations have been disabled for task ':sdks:java:container:java11:copySdkHarnessLauncher' to ensure correctness due to the following reasons:
- Gradle detected a problem with the following location: '<https://ci-beam.apache.org/job/beam_PostCommit_Java_Examples_Dataflow_V2_java11/ws/src/sdks/java/container/build/target'.> Reason: Task ':sdks:java:container:java11:copySdkHarnessLauncher' uses this output of task ':sdks:java:container:downloadCloudProfilerAgent' without declaring an explicit or implicit dependency. This can lead to incorrect results being produced, depending on what order the tasks are executed. Please refer to https://docs.gradle.org/7.4/userguide/validation_problems.html#implicit_dependency for more details about this problem.
- Gradle detected a problem with the following location: '<https://ci-beam.apache.org/job/beam_PostCommit_Java_Examples_Dataflow_V2_java11/ws/src/sdks/java/container/build/target'.> Reason: Task ':sdks:java:container:java11:copySdkHarnessLauncher' uses this output of task ':sdks:java:container:pullLicenses' without declaring an explicit or implicit dependency. This can lead to incorrect results being produced, depending on what order the tasks are executed. Please refer to https://docs.gradle.org/7.4/userguide/validation_problems.html#implicit_dependency for more details about this problem.
> Task :release:go-licenses:java:dockerRun
+ go-licenses save github.com/apache/beam/sdks/java/container --save_path=/output/licenses
+ go-licenses csv github.com/apache/beam/sdks/java/container
+ tee /output/licenses/list.csv
github.com/apache/beam/sdks/java/container,https://github.com/apache/beam/blob/master/LICENSE,Apache-2.0
github.com/golang/protobuf,https://github.com/golang/protobuf/blob/master/LICENSE,BSD-3-Clause
google.golang.org/protobuf,https://go.googlesource.com/protobuf/+/refs/heads/master/LICENSE,BSD-3-Clause
github.com/apache/beam/sdks/go/pkg/beam,https://github.com/apache/beam/blob/master/sdks/go/README.md,Apache-2.0
google.golang.org/grpc,https://github.com/grpc/grpc-go/blob/master/LICENSE,Apache-2.0
golang.org/x/net,https://go.googlesource.com/net/+/refs/heads/master/LICENSE,BSD-3-Clause
golang.org/x/sys,https://go.googlesource.com/sys/+/refs/heads/master/LICENSE,BSD-3-Clause
google.golang.org/genproto/googleapis/rpc/status,https://github.com/googleapis/go-genproto/blob/master/LICENSE,Apache-2.0
golang.org/x/text,https://go.googlesource.com/text/+/refs/heads/master/LICENSE,BSD-3-Clause
+ chmod -R a+w /output/licenses
> Task :release:go-licenses:java:createLicenses
> Task :sdks:java:container:java11:copyGolangLicenses
> Task :sdks:java:container:java11:dockerPrepare
> Task :sdks:java:container:java11:docker
> Task :runners:google-cloud-dataflow-java:buildAndPushDockerJavaContainer
WARNING: `gcloud docker` will not be supported for Docker client versions above 18.03.
As an alternative, use `gcloud auth configure-docker` to configure `docker` to
use `gcloud` as a credential helper, then use `docker` as you would for non-GCR
registries, e.g. `docker pull gcr.io/project-id/my-image`. Add
`--verbosity=error` to silence this warning: `gcloud docker
--verbosity=error -- pull gcr.io/project-id/my-image`.
See: https://cloud.google.com/container-registry/docs/support/deprecation-notices#gcloud-docker
The push refers to repository [us.gcr.io/apache-beam-testing/java-postcommit-it/java]
041ed4c20450: Preparing
33277223a0be: Preparing
53567c6a1273: Preparing
14576bf911f7: Preparing
adf1a7a07809: Preparing
f6459d3bf06c: Preparing
062bc44deabf: Preparing
d178f715d0fc: Preparing
9021021927a0: Preparing
c4efc21e0dd5: Preparing
b2a141ff05ab: Preparing
65c4d28366fc: Preparing
4d30dca09733: Preparing
88c5d6474290: Preparing
5595b9834c08: Preparing
cbd16b72e80e: Preparing
07df3576ab77: Preparing
3b2356b88239: Preparing
a7934564e6b9: Preparing
1b7cceb6a07c: Preparing
b274e8788e0c: Preparing
78658088978a: Preparing
c4efc21e0dd5: Waiting
9021021927a0: Waiting
b2a141ff05ab: Waiting
d178f715d0fc: Waiting
3b2356b88239: Waiting
b274e8788e0c: Waiting
1b7cceb6a07c: Waiting
65c4d28366fc: Waiting
a7934564e6b9: Waiting
062bc44deabf: Waiting
78658088978a: Waiting
88c5d6474290: Waiting
5595b9834c08: Waiting
4d30dca09733: Waiting
07df3576ab77: Waiting
14576bf911f7: Pushed
adf1a7a07809: Pushed
33277223a0be: Pushed
53567c6a1273: Pushed
041ed4c20450: Pushed
062bc44deabf: Pushed
d178f715d0fc: Pushed
c4efc21e0dd5: Pushed
9021021927a0: Pushed
f6459d3bf06c: Pushed
65c4d28366fc: Pushed
b2a141ff05ab: Pushed
07df3576ab77: Layer already exists
cbd16b72e80e: Layer already exists
3b2356b88239: Layer already exists
a7934564e6b9: Layer already exists
1b7cceb6a07c: Layer already exists
b274e8788e0c: Layer already exists
78658088978a: Layer already exists
88c5d6474290: Pushed
5595b9834c08: Pushed
4d30dca09733: Pushed
20220521234525: digest: sha256:640939408edae571856b686696d8bc30cb5d810775e5ef3e1cb595c9832659ae size: 4935
> Task :runners:google-cloud-dataflow-java:examplesJavaRunnerV2IntegrationTest
Could not stop org.gradle.internal.actor.internal.DefaultActorFactory$NonBlockingActor@3715cc52.
org.gradle.internal.dispatch.DispatchException: Could not dispatch message [MethodInvocation method: stop()].
at org.gradle.internal.dispatch.ExceptionTrackingFailureHandler.dispatchFailed(ExceptionTrackingFailureHandler.java:35)
at org.gradle.internal.dispatch.FailureHandlingDispatch.dispatch(FailureHandlingDispatch.java:32)
at org.gradle.internal.dispatch.AsyncDispatch.dispatchMessages(AsyncDispatch.java:87)
at org.gradle.internal.dispatch.AsyncDispatch.access$000(AsyncDispatch.java:36)
at org.gradle.internal.dispatch.AsyncDispatch$1.run(AsyncDispatch.java:71)
at org.gradle.internal.concurrent.InterruptibleRunnable.run(InterruptibleRunnable.java:42)
at org.gradle.internal.operations.CurrentBuildOperationPreservingRunnable.run(CurrentBuildOperationPreservingRunnable.java:42)
at org.gradle.internal.concurrent.ExecutorPolicy$CatchAndRecordFailures.onExecute(ExecutorPolicy.java:64)
at org.gradle.internal.concurrent.ManagedExecutorImpl$1.run(ManagedExecutorImpl.java:48)
at java.util.concurrent.ThreadPoolExecutor.runWorker(ThreadPoolExecutor.java:1149)
at java.util.concurrent.ThreadPoolExecutor$Worker.run(ThreadPoolExecutor.java:624)
at java.lang.Thread.run(Thread.java:748)
Caused by: org.gradle.process.internal.ExecException: Process 'Gradle Test Executor 4' finished with non-zero exit value 143
This problem might be caused by incorrect test process configuration.
Please refer to the test execution section in the User Manual at https://docs.gradle.org/7.4/userguide/java_testing.html#sec:test_execution
at org.gradle.api.internal.tasks.testing.worker.ForkingTestClassProcessor.stop(ForkingTestClassProcessor.java:186)
at org.gradle.api.internal.tasks.testing.processors.RestartEveryNTestClassProcessor.endBatch(RestartEveryNTestClassProcessor.java:77)
at org.gradle.api.internal.tasks.testing.processors.RestartEveryNTestClassProcessor.stop(RestartEveryNTestClassProcessor.java:62)
at sun.reflect.NativeMethodAccessorImpl.invoke0(Native Method)
at sun.reflect.NativeMethodAccessorImpl.invoke(NativeMethodAccessorImpl.java:62)
at sun.reflect.DelegatingMethodAccessorImpl.invoke(DelegatingMethodAccessorImpl.java:43)
at java.lang.reflect.Method.invoke(Method.java:498)
at org.gradle.internal.dispatch.ReflectionDispatch.dispatch(ReflectionDispatch.java:36)
at org.gradle.internal.dispatch.ReflectionDispatch.dispatch(ReflectionDispatch.java:24)
at org.gradle.internal.dispatch.FailureHandlingDispatch.dispatch(FailureHandlingDispatch.java:30)
... 10 more
Could not stop org.gradle.internal.actor.internal.DefaultActorFactory$NonBlockingActor@1f805c65.
org.gradle.internal.dispatch.DispatchException: Could not dispatch message [MethodInvocation method: stop()].
at org.gradle.internal.dispatch.ExceptionTrackingFailureHandler.dispatchFailed(ExceptionTrackingFailureHandler.java:35)
at org.gradle.internal.dispatch.FailureHandlingDispatch.dispatch(FailureHandlingDispatch.java:32)
at org.gradle.internal.dispatch.AsyncDispatch.dispatchMessages(AsyncDispatch.java:87)
at org.gradle.internal.dispatch.AsyncDispatch.access$000(AsyncDispatch.java:36)
at org.gradle.internal.dispatch.AsyncDispatch$1.run(AsyncDispatch.java:71)
at org.gradle.internal.concurrent.InterruptibleRunnable.run(InterruptibleRunnable.java:42)
at org.gradle.internal.operations.CurrentBuildOperationPreservingRunnable.run(CurrentBuildOperationPreservingRunnable.java:42)
at org.gradle.internal.concurrent.ExecutorPolicy$CatchAndRecordFailures.onExecute(ExecutorPolicy.java:64)
at org.gradle.internal.concurrent.ManagedExecutorImpl$1.run(ManagedExecutorImpl.java:48)
at java.util.concurrent.ThreadPoolExecutor.runWorker(ThreadPoolExecutor.java:1149)
at java.util.concurrent.ThreadPoolExecutor$Worker.run(ThreadPoolExecutor.java:624)
at java.lang.Thread.run(Thread.java:748)
Caused by: org.gradle.process.internal.ExecException: Process 'Gradle Test Executor 1' finished with non-zero exit value 143
This problem might be caused by incorrect test process configuration.
Please refer to the test execution section in the User Manual at https://docs.gradle.org/7.4/userguide/java_testing.html#sec:test_execution
at org.gradle.api.internal.tasks.testing.worker.ForkingTestClassProcessor.stop(ForkingTestClassProcessor.java:186)
at org.gradle.api.internal.tasks.testing.processors.RestartEveryNTestClassProcessor.endBatch(RestartEveryNTestClassProcessor.java:77)
at org.gradle.api.internal.tasks.testing.processors.RestartEveryNTestClassProcessor.stop(RestartEveryNTestClassProcessor.java:62)
at sun.reflect.NativeMethodAccessorImpl.invoke0(Native Method)
at sun.reflect.NativeMethodAccessorImpl.invoke(NativeMethodAccessorImpl.java:62)
at sun.reflect.DelegatingMethodAccessorImpl.invoke(DelegatingMethodAccessorImpl.java:43)
at java.lang.reflect.Method.invoke(Method.java:498)
at org.gradle.internal.dispatch.ReflectionDispatch.dispatch(ReflectionDispatch.java:36)
at org.gradle.internal.dispatch.ReflectionDispatch.dispatch(ReflectionDispatch.java:24)
at org.gradle.internal.dispatch.FailureHandlingDispatch.dispatch(FailureHandlingDispatch.java:30)
... 10 more
Could not stop org.gradle.internal.actor.internal.DefaultActorFactory$NonBlockingActor@70037a93.
org.gradle.internal.dispatch.DispatchException: Could not dispatch message [MethodInvocation method: stop()].
at org.gradle.internal.dispatch.ExceptionTrackingFailureHandler.dispatchFailed(ExceptionTrackingFailureHandler.java:35)
at org.gradle.internal.dispatch.FailureHandlingDispatch.dispatch(FailureHandlingDispatch.java:32)
at org.gradle.internal.dispatch.AsyncDispatch.dispatchMessages(AsyncDispatch.java:87)
at org.gradle.internal.dispatch.AsyncDispatch.access$000(AsyncDispatch.java:36)
at org.gradle.internal.dispatch.AsyncDispatch$1.run(AsyncDispatch.java:71)
at org.gradle.internal.concurrent.InterruptibleRunnable.run(InterruptibleRunnable.java:42)
at org.gradle.internal.operations.CurrentBuildOperationPreservingRunnable.run(CurrentBuildOperationPreservingRunnable.java:42)
at org.gradle.internal.concurrent.ExecutorPolicy$CatchAndRecordFailures.onExecute(ExecutorPolicy.java:64)
at org.gradle.internal.concurrent.ManagedExecutorImpl$1.run(ManagedExecutorImpl.java:48)
at java.util.concurrent.ThreadPoolExecutor.runWorker(ThreadPoolExecutor.java:1149)
at java.util.concurrent.ThreadPoolExecutor$Worker.run(ThreadPoolExecutor.java:624)
at java.lang.Thread.run(Thread.java:748)
Caused by: org.gradle.process.internal.ExecException: Process 'Gradle Test Executor 2' finished with non-zero exit value 143
This problem might be caused by incorrect test process configuration.
Please refer to the test execution section in the User Manual at https://docs.gradle.org/7.4/userguide/java_testing.html#sec:test_execution
at org.gradle.api.internal.tasks.testing.worker.ForkingTestClassProcessor.stop(ForkingTestClassProcessor.java:186)
at org.gradle.api.internal.tasks.testing.processors.RestartEveryNTestClassProcessor.endBatch(RestartEveryNTestClassProcessor.java:77)
at org.gradle.api.internal.tasks.testing.processors.RestartEveryNTestClassProcessor.stop(RestartEveryNTestClassProcessor.java:62)
at sun.reflect.NativeMethodAccessorImpl.invoke0(Native Method)
at sun.reflect.NativeMethodAccessorImpl.invoke(NativeMethodAccessorImpl.java:62)
at sun.reflect.DelegatingMethodAccessorImpl.invoke(DelegatingMethodAccessorImpl.java:43)
at java.lang.reflect.Method.invoke(Method.java:498)
at org.gradle.internal.dispatch.ReflectionDispatch.dispatch(ReflectionDispatch.java:36)
at org.gradle.internal.dispatch.ReflectionDispatch.dispatch(ReflectionDispatch.java:24)
at org.gradle.internal.dispatch.FailureHandlingDispatch.dispatch(FailureHandlingDispatch.java:30)
... 10 more
> Task :runners:google-cloud-dataflow-java:examplesJavaRunnerV2IntegrationTest FAILED
The message received from the daemon indicates that the daemon has disappeared.
Build request sent: Build{id=500a2601-ae43-4b2d-b8fb-7829fb157122, currentDir=<https://ci-beam.apache.org/job/beam_PostCommit_Java_Examples_Dataflow_V2_java11/ws/src}>
Attempting to read last messages from the daemon log...
Daemon pid: 1220658
log file: /home/jenkins/.gradle/daemon/7.4/daemon-1220658.out.log
----- Last 20 lines from daemon log file - daemon-1220658.out.log -----
at org.gradle.internal.dispatch.FailureHandlingDispatch.dispatch(FailureHandlingDispatch.java:30)
... 10 more
Untagged: us.gcr.io/apache-beam-testing/java-postcommit-it/java:20220521234525
Untagged: us.gcr.io/apache-beam-testing/java-postcommit-it/java@sha256:640939408edae571856b686696d8bc30cb5d810775e5ef3e1cb595c9832659ae
Daemon vm is shutting down... The daemon has exited normally or was terminated in response to a user interrupt.
Remove shutdown hook failed
java.lang.IllegalStateException: Shutdown in progress
at java.lang.ApplicationShutdownHooks.remove(ApplicationShutdownHooks.java:82)
at java.lang.Runtime.removeShutdownHook(Runtime.java:239)
at org.gradle.process.internal.shutdown.ShutdownHooks.removeShutdownHook(ShutdownHooks.java:38)
at org.gradle.process.internal.DefaultExecHandle.setEndStateInfo(DefaultExecHandle.java:208)
at org.gradle.process.internal.DefaultExecHandle.aborted(DefaultExecHandle.java:365)
at org.gradle.process.internal.ExecHandleRunner.completed(ExecHandleRunner.java:108)
at org.gradle.process.internal.ExecHandleRunner.run(ExecHandleRunner.java:84)
at org.gradle.internal.operations.CurrentBuildOperationPreservingRunnable.run(CurrentBuildOperationPreservingRunnable.java:42)
at org.gradle.internal.concurrent.ExecutorPolicy$CatchAndRecordFailures.onExecute(ExecutorPolicy.java:64)
at org.gradle.internal.concurrent.ManagedExecutorImpl$1.run(ManagedExecutorImpl.java:48)
at java.util.concurrent.ThreadPoolExecutor.runWorker(ThreadPoolExecutor.java:1149)
at java.util.concurrent.ThreadPoolExecutor$Worker.run(ThreadPoolExecutor.java:624)
at java.lang.Thread.run(Thread.java:748)
----- End of the daemon log -----
FAILURE: Build failed with an exception.
* What went wrong:
Gradle build daemon disappeared unexpectedly (it may have been killed or may have crashed)
* Try:
> Run with --stacktrace option to get the stack trace.
> Run with --info or --debug option to get more log output.
> Run with --scan to get full insights.
* Get more help at https://help.gradle.org
> Task :runners:google-cloud-dataflow-java:cleanUpDockerJavaImages
Untagged: us.gcr.io/apache-beam-testing/java-postcommit-it/java:20220521234525
Untagged: us.gcr.io/apache-beam-testing/java-postcommit-it/java@sha256:640939408edae571856b686696d8bc30cb5d810775e5ef3e1cb595c9832659ae
Build step 'Invoke Gradle script' changed build result to FAILURE
Build step 'Invoke Gradle script' marked build as failure
---------------------------------------------------------------------
To unsubscribe, e-mail: builds-unsubscribe@beam.apache.org
For additional commands, e-mail: builds-help@beam.apache.org
Jenkins build is back to normal : beam_PostCommit_Java_Examples_Dataflow_V2_java11 #2133
Posted by Apache Jenkins Server <je...@builds.apache.org>.
See <https://ci-beam.apache.org/job/beam_PostCommit_Java_Examples_Dataflow_V2_java11/2133/display/redirect>
---------------------------------------------------------------------
To unsubscribe, e-mail: builds-unsubscribe@beam.apache.org
For additional commands, e-mail: builds-help@beam.apache.org