You are viewing a plain text version of this content. The canonical link for it is here.
Posted to dev@mesos.apache.org by Apache Jenkins Server <je...@builds.apache.org> on 2014/02/12 04:23:12 UTC
Build failed in Jenkins:
Mesos-Trunk-Ubuntu-Build-Out-Of-Src-Set-JAVA_HOME #1887
See <https://builds.apache.org/job/Mesos-Trunk-Ubuntu-Build-Out-Of-Src-Set-JAVA_HOME/1887/changes>
Changes:
[vinod] Revise os::killtree semantics if process not found.
[vinod] Added missing return value for hashmap::containsValue and test.
[vinod] Containerizer (part 1)
[vinod] Containerizer - launchers (part 2).
[vinod] Containerizer - isolators (part 3).
[vinod] Containerizer - cgroup isolators (part 4).
[vinod] Containerizer - updated tests (part 5).
[vinod] Added a release guide for doing official releases.
[vinod] Updated upgrades document for 0.18.0.
------------------------------------------
[...truncated 2974 lines...]
running build
running build_py
Generating google/protobuf/descriptor_pb2.py...
Generating google/protobuf/compiler/plugin_pb2.py...
Generating google/protobuf/unittest_pb2.py...
Generating google/protobuf/unittest_custom_options_pb2.py...
Generating google/protobuf/unittest_import_pb2.py...
Generating google/protobuf/unittest_import_public_pb2.py...
Generating google/protobuf/unittest_mset_pb2.py...
Generating google/protobuf/unittest_no_generic_services_pb2.py...
Generating google/protobuf/internal/test_bad_identifiers_pb2.py...
Generating google/protobuf/internal/more_extensions_pb2.py...
Generating google/protobuf/internal/more_extensions_dynamic_pb2.py...
Generating google/protobuf/internal/more_messages_pb2.py...
Generating google/protobuf/internal/factory_test1_pb2.py...
Generating google/protobuf/internal/factory_test2_pb2.py...
creating build
creating build/lib.linux-x86_64-2.7
creating build/lib.linux-x86_64-2.7/google
creating build/lib.linux-x86_64-2.7/google/protobuf
creating build/lib.linux-x86_64-2.7/google/protobuf/internal
copying google/protobuf/internal/__init__.py -> build/lib.linux-x86_64-2.7/google/protobuf/internal
copying google/protobuf/internal/api_implementation.py -> build/lib.linux-x86_64-2.7/google/protobuf/internal
copying google/protobuf/internal/containers.py -> build/lib.linux-x86_64-2.7/google/protobuf/internal
copying google/protobuf/internal/cpp_message.py -> build/lib.linux-x86_64-2.7/google/protobuf/internal
copying google/protobuf/internal/decoder.py -> build/lib.linux-x86_64-2.7/google/protobuf/internal
copying google/protobuf/internal/encoder.py -> build/lib.linux-x86_64-2.7/google/protobuf/internal
copying google/protobuf/internal/enum_type_wrapper.py -> build/lib.linux-x86_64-2.7/google/protobuf/internal
copying google/protobuf/internal/message_listener.py -> build/lib.linux-x86_64-2.7/google/protobuf/internal
copying google/protobuf/internal/python_message.py -> build/lib.linux-x86_64-2.7/google/protobuf/internal
copying google/protobuf/internal/type_checkers.py -> build/lib.linux-x86_64-2.7/google/protobuf/internal
copying google/protobuf/internal/wire_format.py -> build/lib.linux-x86_64-2.7/google/protobuf/internal
copying google/protobuf/__init__.py -> build/lib.linux-x86_64-2.7/google/protobuf
copying google/protobuf/descriptor.py -> build/lib.linux-x86_64-2.7/google/protobuf
copying google/protobuf/descriptor_pb2.py -> build/lib.linux-x86_64-2.7/google/protobuf
creating build/lib.linux-x86_64-2.7/google/protobuf/compiler
copying google/protobuf/compiler/__init__.py -> build/lib.linux-x86_64-2.7/google/protobuf/compiler
copying google/protobuf/compiler/plugin_pb2.py -> build/lib.linux-x86_64-2.7/google/protobuf/compiler
copying google/protobuf/message.py -> build/lib.linux-x86_64-2.7/google/protobuf
copying google/protobuf/descriptor_database.py -> build/lib.linux-x86_64-2.7/google/protobuf
copying google/protobuf/descriptor_pool.py -> build/lib.linux-x86_64-2.7/google/protobuf
copying google/protobuf/message_factory.py -> build/lib.linux-x86_64-2.7/google/protobuf
copying google/protobuf/reflection.py -> build/lib.linux-x86_64-2.7/google/protobuf
copying google/protobuf/service.py -> build/lib.linux-x86_64-2.7/google/protobuf
copying google/protobuf/service_reflection.py -> build/lib.linux-x86_64-2.7/google/protobuf
copying google/protobuf/text_format.py -> build/lib.linux-x86_64-2.7/google/protobuf
copying google/__init__.py -> build/lib.linux-x86_64-2.7/google
running bdist_egg
running egg_info
creating protobuf.egg-info
writing requirements to protobuf.egg-info/requires.txt
writing protobuf.egg-info/PKG-INFO
writing namespace_packages to protobuf.egg-info/namespace_packages.txt
writing top-level names to protobuf.egg-info/top_level.txt
writing dependency_links to protobuf.egg-info/dependency_links.txt
writing manifest file 'protobuf.egg-info/SOURCES.txt'
reading manifest file 'protobuf.egg-info/SOURCES.txt'
writing manifest file 'protobuf.egg-info/SOURCES.txt'
installing library code to build/bdist.linux-x86_64/egg
running install_lib
creating build/bdist.linux-x86_64
creating build/bdist.linux-x86_64/egg
creating build/bdist.linux-x86_64/egg/google
creating build/bdist.linux-x86_64/egg/google/protobuf
copying build/lib.linux-x86_64-2.7/google/protobuf/text_format.py -> build/bdist.linux-x86_64/egg/google/protobuf
copying build/lib.linux-x86_64-2.7/google/protobuf/message.py -> build/bdist.linux-x86_64/egg/google/protobuf
copying build/lib.linux-x86_64-2.7/google/protobuf/message_factory.py -> build/bdist.linux-x86_64/egg/google/protobuf
copying build/lib.linux-x86_64-2.7/google/protobuf/descriptor_database.py -> build/bdist.linux-x86_64/egg/google/protobuf
creating build/bdist.linux-x86_64/egg/google/protobuf/compiler
copying build/lib.linux-x86_64-2.7/google/protobuf/compiler/plugin_pb2.py -> build/bdist.linux-x86_64/egg/google/protobuf/compiler
copying build/lib.linux-x86_64-2.7/google/protobuf/compiler/__init__.py -> build/bdist.linux-x86_64/egg/google/protobuf/compiler
copying build/lib.linux-x86_64-2.7/google/protobuf/service_reflection.py -> build/bdist.linux-x86_64/egg/google/protobuf
copying build/lib.linux-x86_64-2.7/google/protobuf/__init__.py -> build/bdist.linux-x86_64/egg/google/protobuf
creating build/bdist.linux-x86_64/egg/google/protobuf/internal
copying build/lib.linux-x86_64-2.7/google/protobuf/internal/encoder.py -> build/bdist.linux-x86_64/egg/google/protobuf/internal
copying build/lib.linux-x86_64-2.7/google/protobuf/internal/decoder.py -> build/bdist.linux-x86_64/egg/google/protobuf/internal
copying build/lib.linux-x86_64-2.7/google/protobuf/internal/type_checkers.py -> build/bdist.linux-x86_64/egg/google/protobuf/internal
copying build/lib.linux-x86_64-2.7/google/protobuf/internal/api_implementation.py -> build/bdist.linux-x86_64/egg/google/protobuf/internal
copying build/lib.linux-x86_64-2.7/google/protobuf/internal/containers.py -> build/bdist.linux-x86_64/egg/google/protobuf/internal
copying build/lib.linux-x86_64-2.7/google/protobuf/internal/enum_type_wrapper.py -> build/bdist.linux-x86_64/egg/google/protobuf/internal
copying build/lib.linux-x86_64-2.7/google/protobuf/internal/wire_format.py -> build/bdist.linux-x86_64/egg/google/protobuf/internal
copying build/lib.linux-x86_64-2.7/google/protobuf/internal/message_listener.py -> build/bdist.linux-x86_64/egg/google/protobuf/internal
copying build/lib.linux-x86_64-2.7/google/protobuf/internal/__init__.py -> build/bdist.linux-x86_64/egg/google/protobuf/internal
copying build/lib.linux-x86_64-2.7/google/protobuf/internal/cpp_message.py -> build/bdist.linux-x86_64/egg/google/protobuf/internal
copying build/lib.linux-x86_64-2.7/google/protobuf/internal/python_message.py -> build/bdist.linux-x86_64/egg/google/protobuf/internal
copying build/lib.linux-x86_64-2.7/google/protobuf/descriptor_pool.py -> build/bdist.linux-x86_64/egg/google/protobuf
copying build/lib.linux-x86_64-2.7/google/protobuf/descriptor_pb2.py -> build/bdist.linux-x86_64/egg/google/protobuf
copying build/lib.linux-x86_64-2.7/google/protobuf/descriptor.py -> build/bdist.linux-x86_64/egg/google/protobuf
copying build/lib.linux-x86_64-2.7/google/protobuf/service.py -> build/bdist.linux-x86_64/egg/google/protobuf
copying build/lib.linux-x86_64-2.7/google/protobuf/reflection.py -> build/bdist.linux-x86_64/egg/google/protobuf
copying build/lib.linux-x86_64-2.7/google/__init__.py -> build/bdist.linux-x86_64/egg/google
byte-compiling build/bdist.linux-x86_64/egg/google/protobuf/text_format.py to text_format.pyc
byte-compiling build/bdist.linux-x86_64/egg/google/protobuf/message.py to message.pyc
byte-compiling build/bdist.linux-x86_64/egg/google/protobuf/message_factory.py to message_factory.pyc
byte-compiling build/bdist.linux-x86_64/egg/google/protobuf/descriptor_database.py to descriptor_database.pyc
byte-compiling build/bdist.linux-x86_64/egg/google/protobuf/compiler/plugin_pb2.py to plugin_pb2.pyc
byte-compiling build/bdist.linux-x86_64/egg/google/protobuf/compiler/__init__.py to __init__.pyc
byte-compiling build/bdist.linux-x86_64/egg/google/protobuf/service_reflection.py to service_reflection.pyc
byte-compiling build/bdist.linux-x86_64/egg/google/protobuf/__init__.py to __init__.pyc
byte-compiling build/bdist.linux-x86_64/egg/google/protobuf/internal/encoder.py to encoder.pyc
byte-compiling build/bdist.linux-x86_64/egg/google/protobuf/internal/decoder.py to decoder.pyc
byte-compiling build/bdist.linux-x86_64/egg/google/protobuf/internal/type_checkers.py to type_checkers.pyc
byte-compiling build/bdist.linux-x86_64/egg/google/protobuf/internal/api_implementation.py to api_implementation.pyc
byte-compiling build/bdist.linux-x86_64/egg/google/protobuf/internal/containers.py to containers.pyc
byte-compiling build/bdist.linux-x86_64/egg/google/protobuf/internal/enum_type_wrapper.py to enum_type_wrapper.pyc
byte-compiling build/bdist.linux-x86_64/egg/google/protobuf/internal/wire_format.py to wire_format.pyc
byte-compiling build/bdist.linux-x86_64/egg/google/protobuf/internal/message_listener.py to message_listener.pyc
byte-compiling build/bdist.linux-x86_64/egg/google/protobuf/internal/__init__.py to __init__.pyc
byte-compiling build/bdist.linux-x86_64/egg/google/protobuf/internal/cpp_message.py to cpp_message.pyc
byte-compiling build/bdist.linux-x86_64/egg/google/protobuf/internal/python_message.py to python_message.pyc
byte-compiling build/bdist.linux-x86_64/egg/google/protobuf/descriptor_pool.py to descriptor_pool.pyc
byte-compiling build/bdist.linux-x86_64/egg/google/protobuf/descriptor_pb2.py to descriptor_pb2.pyc
byte-compiling build/bdist.linux-x86_64/egg/google/protobuf/descriptor.py to descriptor.pyc
byte-compiling build/bdist.linux-x86_64/egg/google/protobuf/service.py to service.pyc
byte-compiling build/bdist.linux-x86_64/egg/google/protobuf/reflection.py to reflection.pyc
byte-compiling build/bdist.linux-x86_64/egg/google/__init__.py to __init__.pyc
creating build/bdist.linux-x86_64/egg/EGG-INFO
copying protobuf.egg-info/PKG-INFO -> build/bdist.linux-x86_64/egg/EGG-INFO
copying protobuf.egg-info/SOURCES.txt -> build/bdist.linux-x86_64/egg/EGG-INFO
copying protobuf.egg-info/dependency_links.txt -> build/bdist.linux-x86_64/egg/EGG-INFO
copying protobuf.egg-info/namespace_packages.txt -> build/bdist.linux-x86_64/egg/EGG-INFO
copying protobuf.egg-info/requires.txt -> build/bdist.linux-x86_64/egg/EGG-INFO
copying protobuf.egg-info/top_level.txt -> build/bdist.linux-x86_64/egg/EGG-INFO
zip_safe flag not set; analyzing archive contents...
creating dist
creating 'dist/protobuf-2.5.0-py2.7.egg' and adding 'build/bdist.linux-x86_64/egg' to it
removing 'build/bdist.linux-x86_64/egg' (and everything under it)
Building Mesos Python egg ...
WARNING: '.' not a valid package name; please use only.-separated package names in setup.py
running bdist_egg
running egg_info
creating src/mesos.egg-info
writing requirements to src/mesos.egg-info/requires.txt
writing src/mesos.egg-info/PKG-INFO
writing top-level names to src/mesos.egg-info/top_level.txt
writing dependency_links to src/mesos.egg-info/dependency_links.txt
writing manifest file 'src/mesos.egg-info/SOURCES.txt'
package init file 'src/__init__.py' not found (or not a regular file)
reading manifest file 'src/mesos.egg-info/SOURCES.txt'
writing manifest file 'src/mesos.egg-info/SOURCES.txt'
installing library code to build/bdist.linux-x86_64/egg
running install_lib
running build_py
creating build
creating build/lib.linux-x86_64-2.7
copying src/mesos_pb2.py -> build/lib.linux-x86_64-2.7
copying src/mesos.py -> build/lib.linux-x86_64-2.7
running build_ext
building '_mesos' extension
creating build/temp.linux-x86_64-2.7
creating build/temp.linux-x86_64-2.7/native
gcc -fno-strict-aliasing -DNDEBUG -g -fwrapv -O2 -Wall -Wstrict-prototypes -fPIC -I<https://builds.apache.org/job/Mesos-Trunk-Ubuntu-Build-Out-Of-Src-Set-JAVA_HOME/ws/build/../include> -I<https://builds.apache.org/job/Mesos-Trunk-Ubuntu-Build-Out-Of-Src-Set-JAVA_HOME/ws/build/include> -I<https://builds.apache.org/job/Mesos-Trunk-Ubuntu-Build-Out-Of-Src-Set-JAVA_HOME/ws/build/src> -I<https://builds.apache.org/job/Mesos-Trunk-Ubuntu-Build-Out-Of-Src-Set-JAVA_HOME/ws/build/src/python/native> -I<https://builds.apache.org/job/Mesos-Trunk-Ubuntu-Build-Out-Of-Src-Set-JAVA_HOME/ws/build/3rdparty/libprocess/3rdparty/protobuf-2.5.0/src> -I/usr/include/python2.7 -c native/proxy_executor.cpp -o build/temp.linux-x86_64-2.7/native/proxy_executor.o
cc1plus: warning: command line option '-Wstrict-prototypes' is valid for Ada/C/ObjC but not for C++ [enabled by default]
gcc -fno-strict-aliasing -DNDEBUG -g -fwrapv -O2 -Wall -Wstrict-prototypes -fPIC -I<https://builds.apache.org/job/Mesos-Trunk-Ubuntu-Build-Out-Of-Src-Set-JAVA_HOME/ws/build/../include> -I<https://builds.apache.org/job/Mesos-Trunk-Ubuntu-Build-Out-Of-Src-Set-JAVA_HOME/ws/build/include> -I<https://builds.apache.org/job/Mesos-Trunk-Ubuntu-Build-Out-Of-Src-Set-JAVA_HOME/ws/build/src> -I<https://builds.apache.org/job/Mesos-Trunk-Ubuntu-Build-Out-Of-Src-Set-JAVA_HOME/ws/build/src/python/native> -I<https://builds.apache.org/job/Mesos-Trunk-Ubuntu-Build-Out-Of-Src-Set-JAVA_HOME/ws/build/3rdparty/libprocess/3rdparty/protobuf-2.5.0/src> -I/usr/include/python2.7 -c native/mesos_scheduler_driver_impl.cpp -o build/temp.linux-x86_64-2.7/native/mesos_scheduler_driver_impl.o
cc1plus: warning: command line option '-Wstrict-prototypes' is valid for Ada/C/ObjC but not for C++ [enabled by default]
gcc -fno-strict-aliasing -DNDEBUG -g -fwrapv -O2 -Wall -Wstrict-prototypes -fPIC -I<https://builds.apache.org/job/Mesos-Trunk-Ubuntu-Build-Out-Of-Src-Set-JAVA_HOME/ws/build/../include> -I<https://builds.apache.org/job/Mesos-Trunk-Ubuntu-Build-Out-Of-Src-Set-JAVA_HOME/ws/build/include> -I<https://builds.apache.org/job/Mesos-Trunk-Ubuntu-Build-Out-Of-Src-Set-JAVA_HOME/ws/build/src> -I<https://builds.apache.org/job/Mesos-Trunk-Ubuntu-Build-Out-Of-Src-Set-JAVA_HOME/ws/build/src/python/native> -I<https://builds.apache.org/job/Mesos-Trunk-Ubuntu-Build-Out-Of-Src-Set-JAVA_HOME/ws/build/3rdparty/libprocess/3rdparty/protobuf-2.5.0/src> -I/usr/include/python2.7 -c native/module.cpp -o build/temp.linux-x86_64-2.7/native/module.o
cc1plus: warning: command line option '-Wstrict-prototypes' is valid for Ada/C/ObjC but not for C++ [enabled by default]
gcc -fno-strict-aliasing -DNDEBUG -g -fwrapv -O2 -Wall -Wstrict-prototypes -fPIC -I<https://builds.apache.org/job/Mesos-Trunk-Ubuntu-Build-Out-Of-Src-Set-JAVA_HOME/ws/build/../include> -I<https://builds.apache.org/job/Mesos-Trunk-Ubuntu-Build-Out-Of-Src-Set-JAVA_HOME/ws/build/include> -I<https://builds.apache.org/job/Mesos-Trunk-Ubuntu-Build-Out-Of-Src-Set-JAVA_HOME/ws/build/src> -I<https://builds.apache.org/job/Mesos-Trunk-Ubuntu-Build-Out-Of-Src-Set-JAVA_HOME/ws/build/src/python/native> -I<https://builds.apache.org/job/Mesos-Trunk-Ubuntu-Build-Out-Of-Src-Set-JAVA_HOME/ws/build/3rdparty/libprocess/3rdparty/protobuf-2.5.0/src> -I/usr/include/python2.7 -c native/proxy_scheduler.cpp -o build/temp.linux-x86_64-2.7/native/proxy_scheduler.o
cc1plus: warning: command line option '-Wstrict-prototypes' is valid for Ada/C/ObjC but not for C++ [enabled by default]
gcc -fno-strict-aliasing -DNDEBUG -g -fwrapv -O2 -Wall -Wstrict-prototypes -fPIC -I<https://builds.apache.org/job/Mesos-Trunk-Ubuntu-Build-Out-Of-Src-Set-JAVA_HOME/ws/build/../include> -I<https://builds.apache.org/job/Mesos-Trunk-Ubuntu-Build-Out-Of-Src-Set-JAVA_HOME/ws/build/include> -I<https://builds.apache.org/job/Mesos-Trunk-Ubuntu-Build-Out-Of-Src-Set-JAVA_HOME/ws/build/src> -I<https://builds.apache.org/job/Mesos-Trunk-Ubuntu-Build-Out-Of-Src-Set-JAVA_HOME/ws/build/src/python/native> -I<https://builds.apache.org/job/Mesos-Trunk-Ubuntu-Build-Out-Of-Src-Set-JAVA_HOME/ws/build/3rdparty/libprocess/3rdparty/protobuf-2.5.0/src> -I/usr/include/python2.7 -c native/mesos_executor_driver_impl.cpp -o build/temp.linux-x86_64-2.7/native/mesos_executor_driver_impl.o
cc1plus: warning: command line option '-Wstrict-prototypes' is valid for Ada/C/ObjC but not for C++ [enabled by default]
g++ -pthread -shared -Wl,-O1 -Wl,-Bsymbolic-functions -Wl,-Bsymbolic-functions -Wl,-z,relro build/temp.linux-x86_64-2.7/native/proxy_executor.o build/temp.linux-x86_64-2.7/native/mesos_scheduler_driver_impl.o build/temp.linux-x86_64-2.7/native/module.o build/temp.linux-x86_64-2.7/native/proxy_scheduler.o build/temp.linux-x86_64-2.7/native/mesos_executor_driver_impl.o <https://builds.apache.org/job/Mesos-Trunk-Ubuntu-Build-Out-Of-Src-Set-JAVA_HOME/ws/build/src/.libs/libmesos_no_3rdparty.a> <https://builds.apache.org/job/Mesos-Trunk-Ubuntu-Build-Out-Of-Src-Set-JAVA_HOME/ws/build/3rdparty/libprocess/3rdparty/protobuf-2.5.0/src/.libs/libprotobuf.a> <https://builds.apache.org/job/Mesos-Trunk-Ubuntu-Build-Out-Of-Src-Set-JAVA_HOME/ws/build/3rdparty/leveldb/libleveldb.a> <https://builds.apache.org/job/Mesos-Trunk-Ubuntu-Build-Out-Of-Src-Set-JAVA_HOME/ws/build/3rdparty/zookeeper-3.4.5/src/c/.libs/libzookeeper_mt.a> <https://builds.apache.org/job/Mesos-Trunk-Ubuntu-Build-Out-Of-Src-Set-JAVA_HOME/ws/build/3rdparty/libprocess/.libs/libprocess.a> <https://builds.apache.org/job/Mesos-Trunk-Ubuntu-Build-Out-Of-Src-Set-JAVA_HOME/ws/build/3rdparty/libprocess/3rdparty/glog-0.3.3/.libs/libglog.a> <https://builds.apache.org/job/Mesos-Trunk-Ubuntu-Build-Out-Of-Src-Set-JAVA_HOME/ws/build/3rdparty/libprocess/3rdparty/libev-4.15/.libs/libev.a> -o build/lib.linux-x86_64-2.7/_mesos.so -lsasl2 -lcurl -lz -lrt
creating build/bdist.linux-x86_64
creating build/bdist.linux-x86_64/egg
copying build/lib.linux-x86_64-2.7/mesos_pb2.py -> build/bdist.linux-x86_64/egg
copying build/lib.linux-x86_64-2.7/mesos.py -> build/bdist.linux-x86_64/egg
copying build/lib.linux-x86_64-2.7/_mesos.so -> build/bdist.linux-x86_64/egg
byte-compiling build/bdist.linux-x86_64/egg/mesos_pb2.py to mesos_pb2.pyc
byte-compiling build/bdist.linux-x86_64/egg/mesos.py to mesos.pyc
creating stub loader for _mesos.so
byte-compiling build/bdist.linux-x86_64/egg/_mesos.py to _mesos.pyc
creating build/bdist.linux-x86_64/egg/EGG-INFO
copying src/mesos.egg-info/PKG-INFO -> build/bdist.linux-x86_64/egg/EGG-INFO
copying src/mesos.egg-info/SOURCES.txt -> build/bdist.linux-x86_64/egg/EGG-INFO
copying src/mesos.egg-info/dependency_links.txt -> build/bdist.linux-x86_64/egg/EGG-INFO
copying src/mesos.egg-info/requires.txt -> build/bdist.linux-x86_64/egg/EGG-INFO
copying src/mesos.egg-info/top_level.txt -> build/bdist.linux-x86_64/egg/EGG-INFO
writing build/bdist.linux-x86_64/egg/EGG-INFO/native_libs.txt
zip_safe flag not set; analyzing archive contents...
creating dist
creating 'dist/mesos-0.18.0-py2.7-linux-x86_64.egg' and adding 'build/bdist.linux-x86_64/egg' to it
removing 'build/bdist.linux-x86_64/egg' (and everything under it)
make test-framework test-executor long-lived-framework long-lived-executor no-executor-framework balloon-framework balloon-executor mesos-tests examples/python/test_framework.py examples/python/test-framework examples/python/test_executor.py examples/python/test-executor \
tests/balloon_framework_test.sh tests/test_framework_test.sh tests/no_executor_framework_test.sh tests/java_exception_test.sh tests/java_framework_test.sh tests/python_framework_test.sh
make[3]: Entering directory `<https://builds.apache.org/job/Mesos-Trunk-Ubuntu-Build-Out-Of-Src-Set-JAVA_HOME/ws/build/src'>
g++ -DPACKAGE_NAME=\"mesos\" -DPACKAGE_TARNAME=\"mesos\" -DPACKAGE_VERSION=\"0.18.0\" -DPACKAGE_STRING=\"mesos\ 0.18.0\" -DPACKAGE_BUGREPORT=\"\" -DPACKAGE_URL=\"\" -DPACKAGE=\"mesos\" -DVERSION=\"0.18.0\" -DSTDC_HEADERS=1 -DHAVE_SYS_TYPES_H=1 -DHAVE_SYS_STAT_H=1 -DHAVE_STDLIB_H=1 -DHAVE_STRING_H=1 -DHAVE_MEMORY_H=1 -DHAVE_STRINGS_H=1 -DHAVE_INTTYPES_H=1 -DHAVE_STDINT_H=1 -DHAVE_UNISTD_H=1 -DHAVE_DLFCN_H=1 -DLT_OBJDIR=\".libs/\" -DHAVE_PTHREAD=1 -DMESOS_HAS_JAVA=1 -DHAVE_PYTHON=\"2.7\" -DMESOS_HAS_PYTHON=1 -DHAVE_LIBZ=1 -DHAVE_LIBCURL=1 -DHAVE_LIBSASL2=1 -I. -I../../src -Wall -Werror -DLIBDIR=\"/usr/local/lib\" -DPKGLIBEXECDIR=\"/usr/local/libexec/mesos\" -DPKGDATADIR=\"/usr/local/share/mesos\" -I../../include -I../../3rdparty/libprocess/include -I../../3rdparty/libprocess/3rdparty/stout/include -I../include -I../3rdparty/libprocess/3rdparty/boost-1.53.0 -I../3rdparty/libprocess/3rdparty/protobuf-2.5.0/src -I../3rdparty/libprocess/3rdparty/glog-0.3.3/src -I../3rdparty/zookeeper-3.4.5/src/c/include -I../3rdparty/zookeeper-3.4.5/src/c/generated -pthread -g -g2 -O2 -MT examples/test_framework-test_framework.o -MD -MP -MF examples/.deps/test_framework-test_framework.Tpo -c -o examples/test_framework-test_framework.o `test -f 'examples/test_framework.cpp' || echo '../../src/'`examples/test_framework.cpp
mv -f examples/.deps/test_framework-test_framework.Tpo examples/.deps/test_framework-test_framework.Po
/bin/bash ../libtool --tag=CXX --mode=link g++ -pthread -g -g2 -O2 -o test-framework examples/test_framework-test_framework.o libmesos.la -lsasl2 -lcurl -lz -lrt
libtool: link: g++ -pthread -g -g2 -O2 -o .libs/test-framework examples/test_framework-test_framework.o ./.libs/libmesos.so -lsasl2 /usr/lib/x86_64-linux-gnu/libcurl.so -lz -lrt -pthread
g++ -DPACKAGE_NAME=\"mesos\" -DPACKAGE_TARNAME=\"mesos\" -DPACKAGE_VERSION=\"0.18.0\" -DPACKAGE_STRING=\"mesos\ 0.18.0\" -DPACKAGE_BUGREPORT=\"\" -DPACKAGE_URL=\"\" -DPACKAGE=\"mesos\" -DVERSION=\"0.18.0\" -DSTDC_HEADERS=1 -DHAVE_SYS_TYPES_H=1 -DHAVE_SYS_STAT_H=1 -DHAVE_STDLIB_H=1 -DHAVE_STRING_H=1 -DHAVE_MEMORY_H=1 -DHAVE_STRINGS_H=1 -DHAVE_INTTYPES_H=1 -DHAVE_STDINT_H=1 -DHAVE_UNISTD_H=1 -DHAVE_DLFCN_H=1 -DLT_OBJDIR=\".libs/\" -DHAVE_PTHREAD=1 -DMESOS_HAS_JAVA=1 -DHAVE_PYTHON=\"2.7\" -DMESOS_HAS_PYTHON=1 -DHAVE_LIBZ=1 -DHAVE_LIBCURL=1 -DHAVE_LIBSASL2=1 -I. -I../../src -Wall -Werror -DLIBDIR=\"/usr/local/lib\" -DPKGLIBEXECDIR=\"/usr/local/libexec/mesos\" -DPKGDATADIR=\"/usr/local/share/mesos\" -I../../include -I../../3rdparty/libprocess/include -I../../3rdparty/libprocess/3rdparty/stout/include -I../include -I../3rdparty/libprocess/3rdparty/boost-1.53.0 -I../3rdparty/libprocess/3rdparty/protobuf-2.5.0/src -I../3rdparty/libprocess/3rdparty/glog-0.3.3/src -I../3rdparty/zookeeper-3.4.5/src/c/include -I../3rdparty/zookeeper-3.4.5/src/c/generated -pthread -g -g2 -O2 -MT examples/test_executor-test_executor.o -MD -MP -MF examples/.deps/test_executor-test_executor.Tpo -c -o examples/test_executor-test_executor.o `test -f 'examples/test_executor.cpp' || echo '../../src/'`examples/test_executor.cpp
mv -f examples/.deps/test_executor-test_executor.Tpo examples/.deps/test_executor-test_executor.Po
/bin/bash ../libtool --tag=CXX --mode=link g++ -pthread -g -g2 -O2 -o test-executor examples/test_executor-test_executor.o libmesos.la -lsasl2 -lcurl -lz -lrt
libtool: link: g++ -pthread -g -g2 -O2 -o .libs/test-executor examples/test_executor-test_executor.o ./.libs/libmesos.so -lsasl2 /usr/lib/x86_64-linux-gnu/libcurl.so -lz -lrt -pthread
g++ -DPACKAGE_NAME=\"mesos\" -DPACKAGE_TARNAME=\"mesos\" -DPACKAGE_VERSION=\"0.18.0\" -DPACKAGE_STRING=\"mesos\ 0.18.0\" -DPACKAGE_BUGREPORT=\"\" -DPACKAGE_URL=\"\" -DPACKAGE=\"mesos\" -DVERSION=\"0.18.0\" -DSTDC_HEADERS=1 -DHAVE_SYS_TYPES_H=1 -DHAVE_SYS_STAT_H=1 -DHAVE_STDLIB_H=1 -DHAVE_STRING_H=1 -DHAVE_MEMORY_H=1 -DHAVE_STRINGS_H=1 -DHAVE_INTTYPES_H=1 -DHAVE_STDINT_H=1 -DHAVE_UNISTD_H=1 -DHAVE_DLFCN_H=1 -DLT_OBJDIR=\".libs/\" -DHAVE_PTHREAD=1 -DMESOS_HAS_JAVA=1 -DHAVE_PYTHON=\"2.7\" -DMESOS_HAS_PYTHON=1 -DHAVE_LIBZ=1 -DHAVE_LIBCURL=1 -DHAVE_LIBSASL2=1 -I. -I../../src -Wall -Werror -DLIBDIR=\"/usr/local/lib\" -DPKGLIBEXECDIR=\"/usr/local/libexec/mesos\" -DPKGDATADIR=\"/usr/local/share/mesos\" -I../../include -I../../3rdparty/libprocess/include -I../../3rdparty/libprocess/3rdparty/stout/include -I../include -I../3rdparty/libprocess/3rdparty/boost-1.53.0 -I../3rdparty/libprocess/3rdparty/protobuf-2.5.0/src -I../3rdparty/libprocess/3rdparty/glog-0.3.3/src -I../3rdparty/zookeeper-3.4.5/src/c/include -I../3rdparty/zookeeper-3.4.5/src/c/generated -pthread -g -g2 -O2 -MT examples/long_lived_framework-long_lived_framework.o -MD -MP -MF examples/.deps/long_lived_framework-long_lived_framework.Tpo -c -o examples/long_lived_framework-long_lived_framework.o `test -f 'examples/long_lived_framework.cpp' || echo '../../src/'`examples/long_lived_framework.cpp
mv -f examples/.deps/long_lived_framework-long_lived_framework.Tpo examples/.deps/long_lived_framework-long_lived_framework.Po
/bin/bash ../libtool --tag=CXX --mode=link g++ -pthread -g -g2 -O2 -o long-lived-framework examples/long_lived_framework-long_lived_framework.o libmesos.la -lsasl2 -lcurl -lz -lrt
libtool: link: g++ -pthread -g -g2 -O2 -o .libs/long-lived-framework examples/long_lived_framework-long_lived_framework.o ./.libs/libmesos.so -lsasl2 /usr/lib/x86_64-linux-gnu/libcurl.so -lz -lrt -pthread
g++ -DPACKAGE_NAME=\"mesos\" -DPACKAGE_TARNAME=\"mesos\" -DPACKAGE_VERSION=\"0.18.0\" -DPACKAGE_STRING=\"mesos\ 0.18.0\" -DPACKAGE_BUGREPORT=\"\" -DPACKAGE_URL=\"\" -DPACKAGE=\"mesos\" -DVERSION=\"0.18.0\" -DSTDC_HEADERS=1 -DHAVE_SYS_TYPES_H=1 -DHAVE_SYS_STAT_H=1 -DHAVE_STDLIB_H=1 -DHAVE_STRING_H=1 -DHAVE_MEMORY_H=1 -DHAVE_STRINGS_H=1 -DHAVE_INTTYPES_H=1 -DHAVE_STDINT_H=1 -DHAVE_UNISTD_H=1 -DHAVE_DLFCN_H=1 -DLT_OBJDIR=\".libs/\" -DHAVE_PTHREAD=1 -DMESOS_HAS_JAVA=1 -DHAVE_PYTHON=\"2.7\" -DMESOS_HAS_PYTHON=1 -DHAVE_LIBZ=1 -DHAVE_LIBCURL=1 -DHAVE_LIBSASL2=1 -I. -I../../src -Wall -Werror -DLIBDIR=\"/usr/local/lib\" -DPKGLIBEXECDIR=\"/usr/local/libexec/mesos\" -DPKGDATADIR=\"/usr/local/share/mesos\" -I../../include -I../../3rdparty/libprocess/include -I../../3rdparty/libprocess/3rdparty/stout/include -I../include -I../3rdparty/libprocess/3rdparty/boost-1.53.0 -I../3rdparty/libprocess/3rdparty/protobuf-2.5.0/src -I../3rdparty/libprocess/3rdparty/glog-0.3.3/src -I../3rdparty/zookeeper-3.4.5/src/c/include -I../3rdparty/zookeeper-3.4.5/src/c/generated -pthread -g -g2 -O2 -MT examples/long_lived_executor-long_lived_executor.o -MD -MP -MF examples/.deps/long_lived_executor-long_lived_executor.Tpo -c -o examples/long_lived_executor-long_lived_executor.o `test -f 'examples/long_lived_executor.cpp' || echo '../../src/'`examples/long_lived_executor.cpp
mv -f examples/.deps/long_lived_executor-long_lived_executor.Tpo examples/.deps/long_lived_executor-long_lived_executor.Po
/bin/bash ../libtool --tag=CXX --mode=link g++ -pthread -g -g2 -O2 -o long-lived-executor examples/long_lived_executor-long_lived_executor.o libmesos.la -lsasl2 -lcurl -lz -lrt
libtool: link: g++ -pthread -g -g2 -O2 -o .libs/long-lived-executor examples/long_lived_executor-long_lived_executor.o ./.libs/libmesos.so -lsasl2 /usr/lib/x86_64-linux-gnu/libcurl.so -lz -lrt -pthread
g++ -DPACKAGE_NAME=\"mesos\" -DPACKAGE_TARNAME=\"mesos\" -DPACKAGE_VERSION=\"0.18.0\" -DPACKAGE_STRING=\"mesos\ 0.18.0\" -DPACKAGE_BUGREPORT=\"\" -DPACKAGE_URL=\"\" -DPACKAGE=\"mesos\" -DVERSION=\"0.18.0\" -DSTDC_HEADERS=1 -DHAVE_SYS_TYPES_H=1 -DHAVE_SYS_STAT_H=1 -DHAVE_STDLIB_H=1 -DHAVE_STRING_H=1 -DHAVE_MEMORY_H=1 -DHAVE_STRINGS_H=1 -DHAVE_INTTYPES_H=1 -DHAVE_STDINT_H=1 -DHAVE_UNISTD_H=1 -DHAVE_DLFCN_H=1 -DLT_OBJDIR=\".libs/\" -DHAVE_PTHREAD=1 -DMESOS_HAS_JAVA=1 -DHAVE_PYTHON=\"2.7\" -DMESOS_HAS_PYTHON=1 -DHAVE_LIBZ=1 -DHAVE_LIBCURL=1 -DHAVE_LIBSASL2=1 -I. -I../../src -Wall -Werror -DLIBDIR=\"/usr/local/lib\" -DPKGLIBEXECDIR=\"/usr/local/libexec/mesos\" -DPKGDATADIR=\"/usr/local/share/mesos\" -I../../include -I../../3rdparty/libprocess/include -I../../3rdparty/libprocess/3rdparty/stout/include -I../include -I../3rdparty/libprocess/3rdparty/boost-1.53.0 -I../3rdparty/libprocess/3rdparty/protobuf-2.5.0/src -I../3rdparty/libprocess/3rdparty/glog-0.3.3/src -I../3rdparty/zookeeper-3.4.5/src/c/include -I../3rdparty/zookeeper-3.4.5/src/c/generated -pthread -g -g2 -O2 -MT examples/no_executor_framework-no_executor_framework.o -MD -MP -MF examples/.deps/no_executor_framework-no_executor_framework.Tpo -c -o examples/no_executor_framework-no_executor_framework.o `test -f 'examples/no_executor_framework.cpp' || echo '../../src/'`examples/no_executor_framework.cpp
mv -f examples/.deps/no_executor_framework-no_executor_framework.Tpo examples/.deps/no_executor_framework-no_executor_framework.Po
/bin/bash ../libtool --tag=CXX --mode=link g++ -pthread -g -g2 -O2 -o no-executor-framework examples/no_executor_framework-no_executor_framework.o libmesos.la -lsasl2 -lcurl -lz -lrt
libtool: link: g++ -pthread -g -g2 -O2 -o .libs/no-executor-framework examples/no_executor_framework-no_executor_framework.o ./.libs/libmesos.so -lsasl2 /usr/lib/x86_64-linux-gnu/libcurl.so -lz -lrt -pthread
g++ -DPACKAGE_NAME=\"mesos\" -DPACKAGE_TARNAME=\"mesos\" -DPACKAGE_VERSION=\"0.18.0\" -DPACKAGE_STRING=\"mesos\ 0.18.0\" -DPACKAGE_BUGREPORT=\"\" -DPACKAGE_URL=\"\" -DPACKAGE=\"mesos\" -DVERSION=\"0.18.0\" -DSTDC_HEADERS=1 -DHAVE_SYS_TYPES_H=1 -DHAVE_SYS_STAT_H=1 -DHAVE_STDLIB_H=1 -DHAVE_STRING_H=1 -DHAVE_MEMORY_H=1 -DHAVE_STRINGS_H=1 -DHAVE_INTTYPES_H=1 -DHAVE_STDINT_H=1 -DHAVE_UNISTD_H=1 -DHAVE_DLFCN_H=1 -DLT_OBJDIR=\".libs/\" -DHAVE_PTHREAD=1 -DMESOS_HAS_JAVA=1 -DHAVE_PYTHON=\"2.7\" -DMESOS_HAS_PYTHON=1 -DHAVE_LIBZ=1 -DHAVE_LIBCURL=1 -DHAVE_LIBSASL2=1 -I. -I../../src -Wall -Werror -DLIBDIR=\"/usr/local/lib\" -DPKGLIBEXECDIR=\"/usr/local/libexec/mesos\" -DPKGDATADIR=\"/usr/local/share/mesos\" -I../../include -I../../3rdparty/libprocess/include -I../../3rdparty/libprocess/3rdparty/stout/include -I../include -I../3rdparty/libprocess/3rdparty/boost-1.53.0 -I../3rdparty/libprocess/3rdparty/protobuf-2.5.0/src -I../3rdparty/libprocess/3rdparty/glog-0.3.3/src -I../3rdparty/zookeeper-3.4.5/src/c/include -I../3rdparty/zookeeper-3.4.5/src/c/generated -pthread -g -g2 -O2 -MT examples/balloon_framework-balloon_framework.o -MD -MP -MF examples/.deps/balloon_framework-balloon_framework.Tpo -c -o examples/balloon_framework-balloon_framework.o `test -f 'examples/balloon_framework.cpp' || echo '../../src/'`examples/balloon_framework.cpp
mv -f examples/.deps/balloon_framework-balloon_framework.Tpo examples/.deps/balloon_framework-balloon_framework.Po
/bin/bash ../libtool --tag=CXX --mode=link g++ -pthread -g -g2 -O2 -o balloon-framework examples/balloon_framework-balloon_framework.o libmesos.la -lsasl2 -lcurl -lz -lrt
libtool: link: g++ -pthread -g -g2 -O2 -o .libs/balloon-framework examples/balloon_framework-balloon_framework.o ./.libs/libmesos.so -lsasl2 /usr/lib/x86_64-linux-gnu/libcurl.so -lz -lrt -pthread
g++ -DPACKAGE_NAME=\"mesos\" -DPACKAGE_TARNAME=\"mesos\" -DPACKAGE_VERSION=\"0.18.0\" -DPACKAGE_STRING=\"mesos\ 0.18.0\" -DPACKAGE_BUGREPORT=\"\" -DPACKAGE_URL=\"\" -DPACKAGE=\"mesos\" -DVERSION=\"0.18.0\" -DSTDC_HEADERS=1 -DHAVE_SYS_TYPES_H=1 -DHAVE_SYS_STAT_H=1 -DHAVE_STDLIB_H=1 -DHAVE_STRING_H=1 -DHAVE_MEMORY_H=1 -DHAVE_STRINGS_H=1 -DHAVE_INTTYPES_H=1 -DHAVE_STDINT_H=1 -DHAVE_UNISTD_H=1 -DHAVE_DLFCN_H=1 -DLT_OBJDIR=\".libs/\" -DHAVE_PTHREAD=1 -DMESOS_HAS_JAVA=1 -DHAVE_PYTHON=\"2.7\" -DMESOS_HAS_PYTHON=1 -DHAVE_LIBZ=1 -DHAVE_LIBCURL=1 -DHAVE_LIBSASL2=1 -I. -I../../src -Wall -Werror -DLIBDIR=\"/usr/local/lib\" -DPKGLIBEXECDIR=\"/usr/local/libexec/mesos\" -DPKGDATADIR=\"/usr/local/share/mesos\" -I../../include -I../../3rdparty/libprocess/include -I../../3rdparty/libprocess/3rdparty/stout/include -I../include -I../3rdparty/libprocess/3rdparty/boost-1.53.0 -I../3rdparty/libprocess/3rdparty/protobuf-2.5.0/src -I../3rdparty/libprocess/3rdparty/glog-0.3.3/src -I../3rdparty/zookeeper-3.4.5/src/c/include -I../3rdparty/zookeeper-3.4.5/src/c/generated -pthread -g -g2 -O2 -MT examples/balloon_executor-balloon_executor.o -MD -MP -MF examples/.deps/balloon_executor-balloon_executor.Tpo -c -o examples/balloon_executor-balloon_executor.o `test -f 'examples/balloon_executor.cpp' || echo '../../src/'`examples/balloon_executor.cpp
mv -f examples/.deps/balloon_executor-balloon_executor.Tpo examples/.deps/balloon_executor-balloon_executor.Po
/bin/bash ../libtool --tag=CXX --mode=link g++ -pthread -g -g2 -O2 -o balloon-executor examples/balloon_executor-balloon_executor.o libmesos.la -lsasl2 -lcurl -lz -lrt
libtool: link: g++ -pthread -g -g2 -O2 -o .libs/balloon-executor examples/balloon_executor-balloon_executor.o ./.libs/libmesos.so -lsasl2 /usr/lib/x86_64-linux-gnu/libcurl.so -lz -lrt -pthread
g++ -DPACKAGE_NAME=\"mesos\" -DPACKAGE_TARNAME=\"mesos\" -DPACKAGE_VERSION=\"0.18.0\" -DPACKAGE_STRING=\"mesos\ 0.18.0\" -DPACKAGE_BUGREPORT=\"\" -DPACKAGE_URL=\"\" -DPACKAGE=\"mesos\" -DVERSION=\"0.18.0\" -DSTDC_HEADERS=1 -DHAVE_SYS_TYPES_H=1 -DHAVE_SYS_STAT_H=1 -DHAVE_STDLIB_H=1 -DHAVE_STRING_H=1 -DHAVE_MEMORY_H=1 -DHAVE_STRINGS_H=1 -DHAVE_INTTYPES_H=1 -DHAVE_STDINT_H=1 -DHAVE_UNISTD_H=1 -DHAVE_DLFCN_H=1 -DLT_OBJDIR=\".libs/\" -DHAVE_PTHREAD=1 -DMESOS_HAS_JAVA=1 -DHAVE_PYTHON=\"2.7\" -DMESOS_HAS_PYTHON=1 -DHAVE_LIBZ=1 -DHAVE_LIBCURL=1 -DHAVE_LIBSASL2=1 -I. -I../../src -Wall -Werror -DLIBDIR=\"/usr/local/lib\" -DPKGLIBEXECDIR=\"/usr/local/libexec/mesos\" -DPKGDATADIR=\"/usr/local/share/mesos\" -I../../include -I../../3rdparty/libprocess/include -I../../3rdparty/libprocess/3rdparty/stout/include -I../include -I../3rdparty/libprocess/3rdparty/boost-1.53.0 -I../3rdparty/libprocess/3rdparty/protobuf-2.5.0/src -I../3rdparty/libprocess/3rdparty/glog-0.3.3/src -I../3rdparty/zookeeper-3.4.5/src/c/include -I../3rdparty/zookeeper-3.4.5/src/c/generated -DSOURCE_DIR=\"<https://builds.apache.org/job/Mesos-Trunk-Ubuntu-Build-Out-Of-Src-Set-JAVA_HOME/ws/build/..\"> -DBUILD_DIR=\"<https://builds.apache.org/job/Mesos-Trunk-Ubuntu-Build-Out-Of-Src-Set-JAVA_HOME/ws/build\"> -I../3rdparty/libprocess/3rdparty/gmock-1.6.0/gtest/include -I../3rdparty/libprocess/3rdparty/gmock-1.6.0/include -I/home/jenkins/tools/java/jdk1.6.0_20-64/include -I/home/jenkins/tools/java/jdk1.6.0_20-64/include/linux -DZOOKEEPER_VERSION=\"3.4.5\" -pthread -g -g2 -O2 -MT tests/mesos_tests-allocator_tests.o -MD -MP -MF tests/.deps/mesos_tests-allocator_tests.Tpo -c -o tests/mesos_tests-allocator_tests.o `test -f 'tests/allocator_tests.cpp' || echo '../../src/'`tests/allocator_tests.cpp
mv -f tests/.deps/mesos_tests-allocator_tests.Tpo tests/.deps/mesos_tests-allocator_tests.Po
g++ -DPACKAGE_NAME=\"mesos\" -DPACKAGE_TARNAME=\"mesos\" -DPACKAGE_VERSION=\"0.18.0\" -DPACKAGE_STRING=\"mesos\ 0.18.0\" -DPACKAGE_BUGREPORT=\"\" -DPACKAGE_URL=\"\" -DPACKAGE=\"mesos\" -DVERSION=\"0.18.0\" -DSTDC_HEADERS=1 -DHAVE_SYS_TYPES_H=1 -DHAVE_SYS_STAT_H=1 -DHAVE_STDLIB_H=1 -DHAVE_STRING_H=1 -DHAVE_MEMORY_H=1 -DHAVE_STRINGS_H=1 -DHAVE_INTTYPES_H=1 -DHAVE_STDINT_H=1 -DHAVE_UNISTD_H=1 -DHAVE_DLFCN_H=1 -DLT_OBJDIR=\".libs/\" -DHAVE_PTHREAD=1 -DMESOS_HAS_JAVA=1 -DHAVE_PYTHON=\"2.7\" -DMESOS_HAS_PYTHON=1 -DHAVE_LIBZ=1 -DHAVE_LIBCURL=1 -DHAVE_LIBSASL2=1 -I. -I../../src -Wall -Werror -DLIBDIR=\"/usr/local/lib\" -DPKGLIBEXECDIR=\"/usr/local/libexec/mesos\" -DPKGDATADIR=\"/usr/local/share/mesos\" -I../../include -I../../3rdparty/libprocess/include -I../../3rdparty/libprocess/3rdparty/stout/include -I../include -I../3rdparty/libprocess/3rdparty/boost-1.53.0 -I../3rdparty/libprocess/3rdparty/protobuf-2.5.0/src -I../3rdparty/libprocess/3rdparty/glog-0.3.3/src -I../3rdparty/zookeeper-3.4.5/src/c/include -I../3rdparty/zookeeper-3.4.5/src/c/generated -DSOURCE_DIR=\"<https://builds.apache.org/job/Mesos-Trunk-Ubuntu-Build-Out-Of-Src-Set-JAVA_HOME/ws/build/..\"> -DBUILD_DIR=\"<https://builds.apache.org/job/Mesos-Trunk-Ubuntu-Build-Out-Of-Src-Set-JAVA_HOME/ws/build\"> -I../3rdparty/libprocess/3rdparty/gmock-1.6.0/gtest/include -I../3rdparty/libprocess/3rdparty/gmock-1.6.0/include -I/home/jenkins/tools/java/jdk1.6.0_20-64/include -I/home/jenkins/tools/java/jdk1.6.0_20-64/include/linux -DZOOKEEPER_VERSION=\"3.4.5\" -pthread -g -g2 -O2 -MT tests/mesos_tests-attributes_tests.o -MD -MP -MF tests/.deps/mesos_tests-attributes_tests.Tpo -c -o tests/mesos_tests-attributes_tests.o `test -f 'tests/attributes_tests.cpp' || echo '../../src/'`tests/attributes_tests.cpp
mv -f tests/.deps/mesos_tests-attributes_tests.Tpo tests/.deps/mesos_tests-attributes_tests.Po
g++ -DPACKAGE_NAME=\"mesos\" -DPACKAGE_TARNAME=\"mesos\" -DPACKAGE_VERSION=\"0.18.0\" -DPACKAGE_STRING=\"mesos\ 0.18.0\" -DPACKAGE_BUGREPORT=\"\" -DPACKAGE_URL=\"\" -DPACKAGE=\"mesos\" -DVERSION=\"0.18.0\" -DSTDC_HEADERS=1 -DHAVE_SYS_TYPES_H=1 -DHAVE_SYS_STAT_H=1 -DHAVE_STDLIB_H=1 -DHAVE_STRING_H=1 -DHAVE_MEMORY_H=1 -DHAVE_STRINGS_H=1 -DHAVE_INTTYPES_H=1 -DHAVE_STDINT_H=1 -DHAVE_UNISTD_H=1 -DHAVE_DLFCN_H=1 -DLT_OBJDIR=\".libs/\" -DHAVE_PTHREAD=1 -DMESOS_HAS_JAVA=1 -DHAVE_PYTHON=\"2.7\" -DMESOS_HAS_PYTHON=1 -DHAVE_LIBZ=1 -DHAVE_LIBCURL=1 -DHAVE_LIBSASL2=1 -I. -I../../src -Wall -Werror -DLIBDIR=\"/usr/local/lib\" -DPKGLIBEXECDIR=\"/usr/local/libexec/mesos\" -DPKGDATADIR=\"/usr/local/share/mesos\" -I../../include -I../../3rdparty/libprocess/include -I../../3rdparty/libprocess/3rdparty/stout/include -I../include -I../3rdparty/libprocess/3rdparty/boost-1.53.0 -I../3rdparty/libprocess/3rdparty/protobuf-2.5.0/src -I../3rdparty/libprocess/3rdparty/glog-0.3.3/src -I../3rdparty/zookeeper-3.4.5/src/c/include -I../3rdparty/zookeeper-3.4.5/src/c/generated -DSOURCE_DIR=\"<https://builds.apache.org/job/Mesos-Trunk-Ubuntu-Build-Out-Of-Src-Set-JAVA_HOME/ws/build/..\"> -DBUILD_DIR=\"<https://builds.apache.org/job/Mesos-Trunk-Ubuntu-Build-Out-Of-Src-Set-JAVA_HOME/ws/build\"> -I../3rdparty/libprocess/3rdparty/gmock-1.6.0/gtest/include -I../3rdparty/libprocess/3rdparty/gmock-1.6.0/include -I/home/jenkins/tools/java/jdk1.6.0_20-64/include -I/home/jenkins/tools/java/jdk1.6.0_20-64/include/linux -DZOOKEEPER_VERSION=\"3.4.5\" -pthread -g -g2 -O2 -MT tests/mesos_tests-authentication_tests.o -MD -MP -MF tests/.deps/mesos_tests-authentication_tests.Tpo -c -o tests/mesos_tests-authentication_tests.o `test -f 'tests/authentication_tests.cpp' || echo '../../src/'`tests/authentication_tests.cpp
mv -f tests/.deps/mesos_tests-authentication_tests.Tpo tests/.deps/mesos_tests-authentication_tests.Po
g++ -DPACKAGE_NAME=\"mesos\" -DPACKAGE_TARNAME=\"mesos\" -DPACKAGE_VERSION=\"0.18.0\" -DPACKAGE_STRING=\"mesos\ 0.18.0\" -DPACKAGE_BUGREPORT=\"\" -DPACKAGE_URL=\"\" -DPACKAGE=\"mesos\" -DVERSION=\"0.18.0\" -DSTDC_HEADERS=1 -DHAVE_SYS_TYPES_H=1 -DHAVE_SYS_STAT_H=1 -DHAVE_STDLIB_H=1 -DHAVE_STRING_H=1 -DHAVE_MEMORY_H=1 -DHAVE_STRINGS_H=1 -DHAVE_INTTYPES_H=1 -DHAVE_STDINT_H=1 -DHAVE_UNISTD_H=1 -DHAVE_DLFCN_H=1 -DLT_OBJDIR=\".libs/\" -DHAVE_PTHREAD=1 -DMESOS_HAS_JAVA=1 -DHAVE_PYTHON=\"2.7\" -DMESOS_HAS_PYTHON=1 -DHAVE_LIBZ=1 -DHAVE_LIBCURL=1 -DHAVE_LIBSASL2=1 -I. -I../../src -Wall -Werror -DLIBDIR=\"/usr/local/lib\" -DPKGLIBEXECDIR=\"/usr/local/libexec/mesos\" -DPKGDATADIR=\"/usr/local/share/mesos\" -I../../include -I../../3rdparty/libprocess/include -I../../3rdparty/libprocess/3rdparty/stout/include -I../include -I../3rdparty/libprocess/3rdparty/boost-1.53.0 -I../3rdparty/libprocess/3rdparty/protobuf-2.5.0/src -I../3rdparty/libprocess/3rdparty/glog-0.3.3/src -I../3rdparty/zookeeper-3.4.5/src/c/include -I../3rdparty/zookeeper-3.4.5/src/c/generated -DSOURCE_DIR=\"<https://builds.apache.org/job/Mesos-Trunk-Ubuntu-Build-Out-Of-Src-Set-JAVA_HOME/ws/build/..\"> -DBUILD_DIR=\"<https://builds.apache.org/job/Mesos-Trunk-Ubuntu-Build-Out-Of-Src-Set-JAVA_HOME/ws/build\"> -I../3rdparty/libprocess/3rdparty/gmock-1.6.0/gtest/include -I../3rdparty/libprocess/3rdparty/gmock-1.6.0/include -I/home/jenkins/tools/java/jdk1.6.0_20-64/include -I/home/jenkins/tools/java/jdk1.6.0_20-64/include/linux -DZOOKEEPER_VERSION=\"3.4.5\" -pthread -g -g2 -O2 -MT tests/mesos_tests-containerizer.o -MD -MP -MF tests/.deps/mesos_tests-containerizer.Tpo -c -o tests/mesos_tests-containerizer.o `test -f 'tests/containerizer.cpp' || echo '../../src/'`tests/containerizer.cpp
mv -f tests/.deps/mesos_tests-containerizer.Tpo tests/.deps/mesos_tests-containerizer.Po
g++ -DPACKAGE_NAME=\"mesos\" -DPACKAGE_TARNAME=\"mesos\" -DPACKAGE_VERSION=\"0.18.0\" -DPACKAGE_STRING=\"mesos\ 0.18.0\" -DPACKAGE_BUGREPORT=\"\" -DPACKAGE_URL=\"\" -DPACKAGE=\"mesos\" -DVERSION=\"0.18.0\" -DSTDC_HEADERS=1 -DHAVE_SYS_TYPES_H=1 -DHAVE_SYS_STAT_H=1 -DHAVE_STDLIB_H=1 -DHAVE_STRING_H=1 -DHAVE_MEMORY_H=1 -DHAVE_STRINGS_H=1 -DHAVE_INTTYPES_H=1 -DHAVE_STDINT_H=1 -DHAVE_UNISTD_H=1 -DHAVE_DLFCN_H=1 -DLT_OBJDIR=\".libs/\" -DHAVE_PTHREAD=1 -DMESOS_HAS_JAVA=1 -DHAVE_PYTHON=\"2.7\" -DMESOS_HAS_PYTHON=1 -DHAVE_LIBZ=1 -DHAVE_LIBCURL=1 -DHAVE_LIBSASL2=1 -I. -I../../src -Wall -Werror -DLIBDIR=\"/usr/local/lib\" -DPKGLIBEXECDIR=\"/usr/local/libexec/mesos\" -DPKGDATADIR=\"/usr/local/share/mesos\" -I../../include -I../../3rdparty/libprocess/include -I../../3rdparty/libprocess/3rdparty/stout/include -I../include -I../3rdparty/libprocess/3rdparty/boost-1.53.0 -I../3rdparty/libprocess/3rdparty/protobuf-2.5.0/src -I../3rdparty/libprocess/3rdparty/glog-0.3.3/src -I../3rdparty/zookeeper-3.4.5/src/c/include -I../3rdparty/zookeeper-3.4.5/src/c/generated -DSOURCE_DIR=\"<https://builds.apache.org/job/Mesos-Trunk-Ubuntu-Build-Out-Of-Src-Set-JAVA_HOME/ws/build/..\"> -DBUILD_DIR=\"<https://builds.apache.org/job/Mesos-Trunk-Ubuntu-Build-Out-Of-Src-Set-JAVA_HOME/ws/build\"> -I../3rdparty/libprocess/3rdparty/gmock-1.6.0/gtest/include -I../3rdparty/libprocess/3rdparty/gmock-1.6.0/include -I/home/jenkins/tools/java/jdk1.6.0_20-64/include -I/home/jenkins/tools/java/jdk1.6.0_20-64/include/linux -DZOOKEEPER_VERSION=\"3.4.5\" -pthread -g -g2 -O2 -MT tests/mesos_tests-environment.o -MD -MP -MF tests/.deps/mesos_tests-environment.Tpo -c -o tests/mesos_tests-environment.o `test -f 'tests/environment.cpp' || echo '../../src/'`tests/environment.cpp
mv -f tests/.deps/mesos_tests-environment.Tpo tests/.deps/mesos_tests-environment.Po
g++ -DPACKAGE_NAME=\"mesos\" -DPACKAGE_TARNAME=\"mesos\" -DPACKAGE_VERSION=\"0.18.0\" -DPACKAGE_STRING=\"mesos\ 0.18.0\" -DPACKAGE_BUGREPORT=\"\" -DPACKAGE_URL=\"\" -DPACKAGE=\"mesos\" -DVERSION=\"0.18.0\" -DSTDC_HEADERS=1 -DHAVE_SYS_TYPES_H=1 -DHAVE_SYS_STAT_H=1 -DHAVE_STDLIB_H=1 -DHAVE_STRING_H=1 -DHAVE_MEMORY_H=1 -DHAVE_STRINGS_H=1 -DHAVE_INTTYPES_H=1 -DHAVE_STDINT_H=1 -DHAVE_UNISTD_H=1 -DHAVE_DLFCN_H=1 -DLT_OBJDIR=\".libs/\" -DHAVE_PTHREAD=1 -DMESOS_HAS_JAVA=1 -DHAVE_PYTHON=\"2.7\" -DMESOS_HAS_PYTHON=1 -DHAVE_LIBZ=1 -DHAVE_LIBCURL=1 -DHAVE_LIBSASL2=1 -I. -I../../src -Wall -Werror -DLIBDIR=\"/usr/local/lib\" -DPKGLIBEXECDIR=\"/usr/local/libexec/mesos\" -DPKGDATADIR=\"/usr/local/share/mesos\" -I../../include -I../../3rdparty/libprocess/include -I../../3rdparty/libprocess/3rdparty/stout/include -I../include -I../3rdparty/libprocess/3rdparty/boost-1.53.0 -I../3rdparty/libprocess/3rdparty/protobuf-2.5.0/src -I../3rdparty/libprocess/3rdparty/glog-0.3.3/src -I../3rdparty/zookeeper-3.4.5/src/c/include -I../3rdparty/zookeeper-3.4.5/src/c/generated -DSOURCE_DIR=\"<https://builds.apache.org/job/Mesos-Trunk-Ubuntu-Build-Out-Of-Src-Set-JAVA_HOME/ws/build/..\"> -DBUILD_DIR=\"<https://builds.apache.org/job/Mesos-Trunk-Ubuntu-Build-Out-Of-Src-Set-JAVA_HOME/ws/build\"> -I../3rdparty/libprocess/3rdparty/gmock-1.6.0/gtest/include -I../3rdparty/libprocess/3rdparty/gmock-1.6.0/include -I/home/jenkins/tools/java/jdk1.6.0_20-64/include -I/home/jenkins/tools/java/jdk1.6.0_20-64/include/linux -DZOOKEEPER_VERSION=\"3.4.5\" -pthread -g -g2 -O2 -MT tests/mesos_tests-examples_tests.o -MD -MP -MF tests/.deps/mesos_tests-examples_tests.Tpo -c -o tests/mesos_tests-examples_tests.o `test -f 'tests/examples_tests.cpp' || echo '../../src/'`tests/examples_tests.cpp
mv -f tests/.deps/mesos_tests-examples_tests.Tpo tests/.deps/mesos_tests-examples_tests.Po
g++ -DPACKAGE_NAME=\"mesos\" -DPACKAGE_TARNAME=\"mesos\" -DPACKAGE_VERSION=\"0.18.0\" -DPACKAGE_STRING=\"mesos\ 0.18.0\" -DPACKAGE_BUGREPORT=\"\" -DPACKAGE_URL=\"\" -DPACKAGE=\"mesos\" -DVERSION=\"0.18.0\" -DSTDC_HEADERS=1 -DHAVE_SYS_TYPES_H=1 -DHAVE_SYS_STAT_H=1 -DHAVE_STDLIB_H=1 -DHAVE_STRING_H=1 -DHAVE_MEMORY_H=1 -DHAVE_STRINGS_H=1 -DHAVE_INTTYPES_H=1 -DHAVE_STDINT_H=1 -DHAVE_UNISTD_H=1 -DHAVE_DLFCN_H=1 -DLT_OBJDIR=\".libs/\" -DHAVE_PTHREAD=1 -DMESOS_HAS_JAVA=1 -DHAVE_PYTHON=\"2.7\" -DMESOS_HAS_PYTHON=1 -DHAVE_LIBZ=1 -DHAVE_LIBCURL=1 -DHAVE_LIBSASL2=1 -I. -I../../src -Wall -Werror -DLIBDIR=\"/usr/local/lib\" -DPKGLIBEXECDIR=\"/usr/local/libexec/mesos\" -DPKGDATADIR=\"/usr/local/share/mesos\" -I../../include -I../../3rdparty/libprocess/include -I../../3rdparty/libprocess/3rdparty/stout/include -I../include -I../3rdparty/libprocess/3rdparty/boost-1.53.0 -I../3rdparty/libprocess/3rdparty/protobuf-2.5.0/src -I../3rdparty/libprocess/3rdparty/glog-0.3.3/src -I../3rdparty/zookeeper-3.4.5/src/c/include -I../3rdparty/zookeeper-3.4.5/src/c/generated -DSOURCE_DIR=\"<https://builds.apache.org/job/Mesos-Trunk-Ubuntu-Build-Out-Of-Src-Set-JAVA_HOME/ws/build/..\"> -DBUILD_DIR=\"<https://builds.apache.org/job/Mesos-Trunk-Ubuntu-Build-Out-Of-Src-Set-JAVA_HOME/ws/build\"> -I../3rdparty/libprocess/3rdparty/gmock-1.6.0/gtest/include -I../3rdparty/libprocess/3rdparty/gmock-1.6.0/include -I/home/jenkins/tools/java/jdk1.6.0_20-64/include -I/home/jenkins/tools/java/jdk1.6.0_20-64/include/linux -DZOOKEEPER_VERSION=\"3.4.5\" -pthread -g -g2 -O2 -MT tests/mesos_tests-exception_tests.o -MD -MP -MF tests/.deps/mesos_tests-exception_tests.Tpo -c -o tests/mesos_tests-exception_tests.o `test -f 'tests/exception_tests.cpp' || echo '../../src/'`tests/exception_tests.cpp
mv -f tests/.deps/mesos_tests-exception_tests.Tpo tests/.deps/mesos_tests-exception_tests.Po
g++ -DPACKAGE_NAME=\"mesos\" -DPACKAGE_TARNAME=\"mesos\" -DPACKAGE_VERSION=\"0.18.0\" -DPACKAGE_STRING=\"mesos\ 0.18.0\" -DPACKAGE_BUGREPORT=\"\" -DPACKAGE_URL=\"\" -DPACKAGE=\"mesos\" -DVERSION=\"0.18.0\" -DSTDC_HEADERS=1 -DHAVE_SYS_TYPES_H=1 -DHAVE_SYS_STAT_H=1 -DHAVE_STDLIB_H=1 -DHAVE_STRING_H=1 -DHAVE_MEMORY_H=1 -DHAVE_STRINGS_H=1 -DHAVE_INTTYPES_H=1 -DHAVE_STDINT_H=1 -DHAVE_UNISTD_H=1 -DHAVE_DLFCN_H=1 -DLT_OBJDIR=\".libs/\" -DHAVE_PTHREAD=1 -DMESOS_HAS_JAVA=1 -DHAVE_PYTHON=\"2.7\" -DMESOS_HAS_PYTHON=1 -DHAVE_LIBZ=1 -DHAVE_LIBCURL=1 -DHAVE_LIBSASL2=1 -I. -I../../src -Wall -Werror -DLIBDIR=\"/usr/local/lib\" -DPKGLIBEXECDIR=\"/usr/local/libexec/mesos\" -DPKGDATADIR=\"/usr/local/share/mesos\" -I../../include -I../../3rdparty/libprocess/include -I../../3rdparty/libprocess/3rdparty/stout/include -I../include -I../3rdparty/libprocess/3rdparty/boost-1.53.0 -I../3rdparty/libprocess/3rdparty/protobuf-2.5.0/src -I../3rdparty/libprocess/3rdparty/glog-0.3.3/src -I../3rdparty/zookeeper-3.4.5/src/c/include -I../3rdparty/zookeeper-3.4.5/src/c/generated -DSOURCE_DIR=\"<https://builds.apache.org/job/Mesos-Trunk-Ubuntu-Build-Out-Of-Src-Set-JAVA_HOME/ws/build/..\"> -DBUILD_DIR=\"<https://builds.apache.org/job/Mesos-Trunk-Ubuntu-Build-Out-Of-Src-Set-JAVA_HOME/ws/build\"> -I../3rdparty/libprocess/3rdparty/gmock-1.6.0/gtest/include -I../3rdparty/libprocess/3rdparty/gmock-1.6.0/include -I/home/jenkins/tools/java/jdk1.6.0_20-64/include -I/home/jenkins/tools/java/jdk1.6.0_20-64/include/linux -DZOOKEEPER_VERSION=\"3.4.5\" -pthread -g -g2 -O2 -MT tests/mesos_tests-fault_tolerance_tests.o -MD -MP -MF tests/.deps/mesos_tests-fault_tolerance_tests.Tpo -c -o tests/mesos_tests-fault_tolerance_tests.o `test -f 'tests/fault_tolerance_tests.cpp' || echo '../../src/'`tests/fault_tolerance_tests.cpp
mv -f tests/.deps/mesos_tests-fault_tolerance_tests.Tpo tests/.deps/mesos_tests-fault_tolerance_tests.Po
g++ -DPACKAGE_NAME=\"mesos\" -DPACKAGE_TARNAME=\"mesos\" -DPACKAGE_VERSION=\"0.18.0\" -DPACKAGE_STRING=\"mesos\ 0.18.0\" -DPACKAGE_BUGREPORT=\"\" -DPACKAGE_URL=\"\" -DPACKAGE=\"mesos\" -DVERSION=\"0.18.0\" -DSTDC_HEADERS=1 -DHAVE_SYS_TYPES_H=1 -DHAVE_SYS_STAT_H=1 -DHAVE_STDLIB_H=1 -DHAVE_STRING_H=1 -DHAVE_MEMORY_H=1 -DHAVE_STRINGS_H=1 -DHAVE_INTTYPES_H=1 -DHAVE_STDINT_H=1 -DHAVE_UNISTD_H=1 -DHAVE_DLFCN_H=1 -DLT_OBJDIR=\".libs/\" -DHAVE_PTHREAD=1 -DMESOS_HAS_JAVA=1 -DHAVE_PYTHON=\"2.7\" -DMESOS_HAS_PYTHON=1 -DHAVE_LIBZ=1 -DHAVE_LIBCURL=1 -DHAVE_LIBSASL2=1 -I. -I../../src -Wall -Werror -DLIBDIR=\"/usr/local/lib\" -DPKGLIBEXECDIR=\"/usr/local/libexec/mesos\" -DPKGDATADIR=\"/usr/local/share/mesos\" -I../../include -I../../3rdparty/libprocess/include -I../../3rdparty/libprocess/3rdparty/stout/include -I../include -I../3rdparty/libprocess/3rdparty/boost-1.53.0 -I../3rdparty/libprocess/3rdparty/protobuf-2.5.0/src -I../3rdparty/libprocess/3rdparty/glog-0.3.3/src -I../3rdparty/zookeeper-3.4.5/src/c/include -I../3rdparty/zookeeper-3.4.5/src/c/generated -DSOURCE_DIR=\"<https://builds.apache.org/job/Mesos-Trunk-Ubuntu-Build-Out-Of-Src-Set-JAVA_HOME/ws/build/..\"> -DBUILD_DIR=\"<https://builds.apache.org/job/Mesos-Trunk-Ubuntu-Build-Out-Of-Src-Set-JAVA_HOME/ws/build\"> -I../3rdparty/libprocess/3rdparty/gmock-1.6.0/gtest/include -I../3rdparty/libprocess/3rdparty/gmock-1.6.0/include -I/home/jenkins/tools/java/jdk1.6.0_20-64/include -I/home/jenkins/tools/java/jdk1.6.0_20-64/include/linux -DZOOKEEPER_VERSION=\"3.4.5\" -pthread -g -g2 -O2 -MT tests/mesos_tests-files_tests.o -MD -MP -MF tests/.deps/mesos_tests-files_tests.Tpo -c -o tests/mesos_tests-files_tests.o `test -f 'tests/files_tests.cpp' || echo '../../src/'`tests/files_tests.cpp
mv -f tests/.deps/mesos_tests-files_tests.Tpo tests/.deps/mesos_tests-files_tests.Po
g++ -DPACKAGE_NAME=\"mesos\" -DPACKAGE_TARNAME=\"mesos\" -DPACKAGE_VERSION=\"0.18.0\" -DPACKAGE_STRING=\"mesos\ 0.18.0\" -DPACKAGE_BUGREPORT=\"\" -DPACKAGE_URL=\"\" -DPACKAGE=\"mesos\" -DVERSION=\"0.18.0\" -DSTDC_HEADERS=1 -DHAVE_SYS_TYPES_H=1 -DHAVE_SYS_STAT_H=1 -DHAVE_STDLIB_H=1 -DHAVE_STRING_H=1 -DHAVE_MEMORY_H=1 -DHAVE_STRINGS_H=1 -DHAVE_INTTYPES_H=1 -DHAVE_STDINT_H=1 -DHAVE_UNISTD_H=1 -DHAVE_DLFCN_H=1 -DLT_OBJDIR=\".libs/\" -DHAVE_PTHREAD=1 -DMESOS_HAS_JAVA=1 -DHAVE_PYTHON=\"2.7\" -DMESOS_HAS_PYTHON=1 -DHAVE_LIBZ=1 -DHAVE_LIBCURL=1 -DHAVE_LIBSASL2=1 -I. -I../../src -Wall -Werror -DLIBDIR=\"/usr/local/lib\" -DPKGLIBEXECDIR=\"/usr/local/libexec/mesos\" -DPKGDATADIR=\"/usr/local/share/mesos\" -I../../include -I../../3rdparty/libprocess/include -I../../3rdparty/libprocess/3rdparty/stout/include -I../include -I../3rdparty/libprocess/3rdparty/boost-1.53.0 -I../3rdparty/libprocess/3rdparty/protobuf-2.5.0/src -I../3rdparty/libprocess/3rdparty/glog-0.3.3/src -I../3rdparty/zookeeper-3.4.5/src/c/include -I../3rdparty/zookeeper-3.4.5/src/c/generated -DSOURCE_DIR=\"<https://builds.apache.org/job/Mesos-Trunk-Ubuntu-Build-Out-Of-Src-Set-JAVA_HOME/ws/build/..\"> -DBUILD_DIR=\"<https://builds.apache.org/job/Mesos-Trunk-Ubuntu-Build-Out-Of-Src-Set-JAVA_HOME/ws/build\"> -I../3rdparty/libprocess/3rdparty/gmock-1.6.0/gtest/include -I../3rdparty/libprocess/3rdparty/gmock-1.6.0/include -I/home/jenkins/tools/java/jdk1.6.0_20-64/include -I/home/jenkins/tools/java/jdk1.6.0_20-64/include/linux -DZOOKEEPER_VERSION=\"3.4.5\" -pthread -g -g2 -O2 -MT tests/mesos_tests-flags.o -MD -MP -MF tests/.deps/mesos_tests-flags.Tpo -c -o tests/mesos_tests-flags.o `test -f 'tests/flags.cpp' || echo '../../src/'`tests/flags.cpp
mv -f tests/.deps/mesos_tests-flags.Tpo tests/.deps/mesos_tests-flags.Po
g++ -DPACKAGE_NAME=\"mesos\" -DPACKAGE_TARNAME=\"mesos\" -DPACKAGE_VERSION=\"0.18.0\" -DPACKAGE_STRING=\"mesos\ 0.18.0\" -DPACKAGE_BUGREPORT=\"\" -DPACKAGE_URL=\"\" -DPACKAGE=\"mesos\" -DVERSION=\"0.18.0\" -DSTDC_HEADERS=1 -DHAVE_SYS_TYPES_H=1 -DHAVE_SYS_STAT_H=1 -DHAVE_STDLIB_H=1 -DHAVE_STRING_H=1 -DHAVE_MEMORY_H=1 -DHAVE_STRINGS_H=1 -DHAVE_INTTYPES_H=1 -DHAVE_STDINT_H=1 -DHAVE_UNISTD_H=1 -DHAVE_DLFCN_H=1 -DLT_OBJDIR=\".libs/\" -DHAVE_PTHREAD=1 -DMESOS_HAS_JAVA=1 -DHAVE_PYTHON=\"2.7\" -DMESOS_HAS_PYTHON=1 -DHAVE_LIBZ=1 -DHAVE_LIBCURL=1 -DHAVE_LIBSASL2=1 -I. -I../../src -Wall -Werror -DLIBDIR=\"/usr/local/lib\" -DPKGLIBEXECDIR=\"/usr/local/libexec/mesos\" -DPKGDATADIR=\"/usr/local/share/mesos\" -I../../include -I../../3rdparty/libprocess/include -I../../3rdparty/libprocess/3rdparty/stout/include -I../include -I../3rdparty/libprocess/3rdparty/boost-1.53.0 -I../3rdparty/libprocess/3rdparty/protobuf-2.5.0/src -I../3rdparty/libprocess/3rdparty/glog-0.3.3/src -I../3rdparty/zookeeper-3.4.5/src/c/include -I../3rdparty/zookeeper-3.4.5/src/c/generated -DSOURCE_DIR=\"<https://builds.apache.org/job/Mesos-Trunk-Ubuntu-Build-Out-Of-Src-Set-JAVA_HOME/ws/build/..\"> -DBUILD_DIR=\"<https://builds.apache.org/job/Mesos-Trunk-Ubuntu-Build-Out-Of-Src-Set-JAVA_HOME/ws/build\"> -I../3rdparty/libprocess/3rdparty/gmock-1.6.0/gtest/include -I../3rdparty/libprocess/3rdparty/gmock-1.6.0/include -I/home/jenkins/tools/java/jdk1.6.0_20-64/include -I/home/jenkins/tools/java/jdk1.6.0_20-64/include/linux -DZOOKEEPER_VERSION=\"3.4.5\" -pthread -g -g2 -O2 -MT tests/mesos_tests-gc_tests.o -MD -MP -MF tests/.deps/mesos_tests-gc_tests.Tpo -c -o tests/mesos_tests-gc_tests.o `test -f 'tests/gc_tests.cpp' || echo '../../src/'`tests/gc_tests.cpp
mv -f tests/.deps/mesos_tests-gc_tests.Tpo tests/.deps/mesos_tests-gc_tests.Po
g++ -DPACKAGE_NAME=\"mesos\" -DPACKAGE_TARNAME=\"mesos\" -DPACKAGE_VERSION=\"0.18.0\" -DPACKAGE_STRING=\"mesos\ 0.18.0\" -DPACKAGE_BUGREPORT=\"\" -DPACKAGE_URL=\"\" -DPACKAGE=\"mesos\" -DVERSION=\"0.18.0\" -DSTDC_HEADERS=1 -DHAVE_SYS_TYPES_H=1 -DHAVE_SYS_STAT_H=1 -DHAVE_STDLIB_H=1 -DHAVE_STRING_H=1 -DHAVE_MEMORY_H=1 -DHAVE_STRINGS_H=1 -DHAVE_INTTYPES_H=1 -DHAVE_STDINT_H=1 -DHAVE_UNISTD_H=1 -DHAVE_DLFCN_H=1 -DLT_OBJDIR=\".libs/\" -DHAVE_PTHREAD=1 -DMESOS_HAS_JAVA=1 -DHAVE_PYTHON=\"2.7\" -DMESOS_HAS_PYTHON=1 -DHAVE_LIBZ=1 -DHAVE_LIBCURL=1 -DHAVE_LIBSASL2=1 -I. -I../../src -Wall -Werror -DLIBDIR=\"/usr/local/lib\" -DPKGLIBEXECDIR=\"/usr/local/libexec/mesos\" -DPKGDATADIR=\"/usr/local/share/mesos\" -I../../include -I../../3rdparty/libprocess/include -I../../3rdparty/libprocess/3rdparty/stout/include -I../include -I../3rdparty/libprocess/3rdparty/boost-1.53.0 -I../3rdparty/libprocess/3rdparty/protobuf-2.5.0/src -I../3rdparty/libprocess/3rdparty/glog-0.3.3/src -I../3rdparty/zookeeper-3.4.5/src/c/include -I../3rdparty/zookeeper-3.4.5/src/c/generated -DSOURCE_DIR=\"<https://builds.apache.org/job/Mesos-Trunk-Ubuntu-Build-Out-Of-Src-Set-JAVA_HOME/ws/build/..\"> -DBUILD_DIR=\"<https://builds.apache.org/job/Mesos-Trunk-Ubuntu-Build-Out-Of-Src-Set-JAVA_HOME/ws/build\"> -I../3rdparty/libprocess/3rdparty/gmock-1.6.0/gtest/include -I../3rdparty/libprocess/3rdparty/gmock-1.6.0/include -I/home/jenkins/tools/java/jdk1.6.0_20-64/include -I/home/jenkins/tools/java/jdk1.6.0_20-64/include/linux -DZOOKEEPER_VERSION=\"3.4.5\" -pthread -g -g2 -O2 -MT tests/mesos_tests-isolator_tests.o -MD -MP -MF tests/.deps/mesos_tests-isolator_tests.Tpo -c -o tests/mesos_tests-isolator_tests.o `test -f 'tests/isolator_tests.cpp' || echo '../../src/'`tests/isolator_tests.cpp
../../src/tests/isolator_tests.cpp: In function 'int consumeMemory(const Bytes&, const Duration&, int*)':
../../src/tests/isolator_tests.cpp:319:38: error: ignoring return value of 'ssize_t read(int, void*, size_t)', declared with attribute warn_unused_result [-Werror=unused-result]
../../src/tests/isolator_tests.cpp: In function 'int execute(const string&, int*)':
../../src/tests/isolator_tests.cpp:88:38: error: ignoring return value of 'ssize_t read(int, void*, size_t)', declared with attribute warn_unused_result [-Werror=unused-result]
cc1plus: all warnings being treated as errors
make[3]: *** [tests/mesos_tests-isolator_tests.o] Error 1
make[3]: Leaving directory `<https://builds.apache.org/job/Mesos-Trunk-Ubuntu-Build-Out-Of-Src-Set-JAVA_HOME/ws/build/src'>
make[2]: *** [check-am] Error 2
make[2]: Leaving directory `<https://builds.apache.org/job/Mesos-Trunk-Ubuntu-Build-Out-Of-Src-Set-JAVA_HOME/ws/build/src'>
make[1]: *** [check] Error 2
make[1]: Leaving directory `<https://builds.apache.org/job/Mesos-Trunk-Ubuntu-Build-Out-Of-Src-Set-JAVA_HOME/ws/build/src'>
make: *** [check-recursive] Error 1
Build step 'Execute shell' marked build as failure
Jenkins build is back to normal :
Mesos-Trunk-Ubuntu-Build-Out-Of-Src-Set-JAVA_HOME #1891
Posted by Apache Jenkins Server <je...@builds.apache.org>.
See <https://builds.apache.org/job/Mesos-Trunk-Ubuntu-Build-Out-Of-Src-Set-JAVA_HOME/1891/changes>
Build failed in Jenkins:
Mesos-Trunk-Ubuntu-Build-Out-Of-Src-Set-JAVA_HOME #1890
Posted by Apache Jenkins Server <je...@builds.apache.org>.
See <https://builds.apache.org/job/Mesos-Trunk-Ubuntu-Build-Out-Of-Src-Set-JAVA_HOME/1890/changes>
Changes:
[bmahler] Disable SIGPIPE on OS X upon socket creation.
------------------------------------------
[...truncated 18788 lines...]
I0213 21:18:41.219928 27395 master.cpp:818] Received registration request from scheduler(101)@67.195.138.9:40941
I0213 21:18:41.219982 27395 master.cpp:836] Registering framework 2014-02-13-21:18:41-160088899-40941-27372-0000 at scheduler(101)@67.195.138.9:40941
I0213 21:18:41.220068 27396 sched.cpp:391] Framework registered with 2014-02-13-21:18:41-160088899-40941-27372-0000
I0213 21:18:41.220088 27395 hierarchical_allocator_process.hpp:332] Added framework 2014-02-13-21:18:41-160088899-40941-27372-0000
I0213 21:18:41.220090 27396 sched.cpp:405] Scheduler::registered took 8962ns
I0213 21:18:41.220144 27395 hierarchical_allocator_process.hpp:752] Offering cpus(*):2; mem(*):1024; disk(*):1024; ports(*):[31000-32000] on slave 2014-02-13-21:18:41-160088899-40941-27372-0 to framework 2014-02-13-21:18:41-160088899-40941-27372-0000
I0213 21:18:41.220288 27395 hierarchical_allocator_process.hpp:688] Performed allocation for 1 slaves in 178396ns
I0213 21:18:41.220371 27392 master.hpp:439] Adding offer 2014-02-13-21:18:41-160088899-40941-27372-0 with resources cpus(*):2; mem(*):1024; disk(*):1024; ports(*):[31000-32000] on slave 2014-02-13-21:18:41-160088899-40941-27372-0 (vesta.apache.org)
I0213 21:18:41.220420 27392 master.cpp:2278] Sending 1 offers to framework 2014-02-13-21:18:41-160088899-40941-27372-0000
I0213 21:18:41.220568 27398 sched.cpp:525] Scheduler::resourceOffers took 24512ns
I0213 21:18:41.220954 27395 sched.cpp:898] Attempting to launch task 2 with an unknown offer 2014-02-13-21:18:41-160088899-40941-27372-0
I0213 21:18:41.221129 27398 master.hpp:449] Removing offer 2014-02-13-21:18:41-160088899-40941-27372-0 with resources cpus(*):2; mem(*):1024; disk(*):1024; ports(*):[31000-32000] on slave 2014-02-13-21:18:41-160088899-40941-27372-0 (vesta.apache.org)
I0213 21:18:41.221185 27398 master.cpp:1574] Processing reply for offers: [ 2014-02-13-21:18:41-160088899-40941-27372-0 ] on slave 2014-02-13-21:18:41-160088899-40941-27372-0 (vesta.apache.org) for framework 2014-02-13-21:18:41-160088899-40941-27372-0000
I0213 21:18:41.221259 27398 master.hpp:411] Adding task 1 with resources cpus(*):1; mem(*):512 on slave 2014-02-13-21:18:41-160088899-40941-27372-0 (vesta.apache.org)
I0213 21:18:41.221290 27398 master.cpp:2447] Launching task 1 of framework 2014-02-13-21:18:41-160088899-40941-27372-0000 with resources cpus(*):1; mem(*):512 on slave 2014-02-13-21:18:41-160088899-40941-27372-0 (vesta.apache.org)
I0213 21:18:41.221364 27395 slave.cpp:625] Got assigned task 1 for framework 2014-02-13-21:18:41-160088899-40941-27372-0000
W0213 21:18:41.221458 27398 master.cpp:1608] Failed to validate task 2 : Task has invalid ExecutorInfo (existing ExecutorInfo with same ExecutorID is not compatible).
------------------------------------------------------------
Existing ExecutorInfo:
executor_id {
value: "default"
}
command {
value: "exit 1"
}
framework_id {
value: "2014-02-13-21:18:41-160088899-40941-27372-0000"
}
------------------------------------------------------------
Task's ExecutorInfo:
executor_id {
value: "default"
}
command {
value: "exit 2"
}
framework_id {
value: "2014-02-13-21:18:41-160088899-40941-27372-0000"
}
------------------------------------------------------------
I0213 21:18:41.221534 27395 slave.cpp:734] Launching task 1 for framework 2014-02-13-21:18:41-160088899-40941-27372-0000
I0213 21:18:41.223247 27398 master.cpp:1618] Sending status update TASK_LOST (UUID: 1e6c4ce1-8f5f-4251-9fc3-b1045ca84b00) for task 2 of framework 2014-02-13-21:18:41-160088899-40941-27372-0000 for invalid task
I0213 21:18:41.223338 27393 sched.cpp:616] Scheduler::statusUpdate took 13626ns
I0213 21:18:41.223399 27394 hierarchical_allocator_process.hpp:547] Framework 2014-02-13-21:18:41-160088899-40941-27372-0000 left cpus(*):1; mem(*):512; disk(*):1024; ports(*):[31000-32000] unused on slave 2014-02-13-21:18:41-160088899-40941-27372-0
I0213 21:18:41.223510 27394 hierarchical_allocator_process.hpp:590] Framework 2014-02-13-21:18:41-160088899-40941-27372-0000 filtered slave 2014-02-13-21:18:41-160088899-40941-27372-0 for 5secs
I0213 21:18:41.224647 27395 exec.cpp:131] Version: 0.18.0
I0213 21:18:41.224733 27393 exec.cpp:181] Executor started at: executor(37)@67.195.138.9:40941 with pid 27372
I0213 21:18:41.224788 27395 slave.cpp:844] Queuing task '1' for executor default of framework '2014-02-13-21:18:41-160088899-40941-27372-0000
I0213 21:18:41.224841 27395 slave.cpp:358] Successfully attached file '/tmp/MultipleExecutorsTest_TasksExecutorInfoDiffers_AE3G64/slaves/2014-02-13-21:18:41-160088899-40941-27372-0/frameworks/2014-02-13-21:18:41-160088899-40941-27372-0000/executors/default/runs/16251407-1d40-42a1-aa34-47c483906ada'
I0213 21:18:41.224869 27395 slave.cpp:1989] Monitoring executor 'default' of framework '2014-02-13-21:18:41-160088899-40941-27372-0000' in container '16251407-1d40-42a1-aa34-47c483906ada'
I0213 21:18:41.224936 27395 slave.cpp:1316] Got registration for executor 'default' of framework 2014-02-13-21:18:41-160088899-40941-27372-0000
I0213 21:18:41.225087 27395 slave.cpp:1434] Flushing queued task 1 for executor 'default' of framework 2014-02-13-21:18:41-160088899-40941-27372-0000
I0213 21:18:41.225118 27394 exec.cpp:205] Executor registered on slave 2014-02-13-21:18:41-160088899-40941-27372-0
I0213 21:18:41.226194 27394 exec.cpp:217] Executor::registered took 9894ns
I0213 21:18:41.226244 27394 exec.cpp:292] Executor asked to run task '1'
I0213 21:18:41.226285 27394 exec.cpp:301] Executor::launchTask took 28605ns
I0213 21:18:41.226434 27372 master.cpp:587] Master terminating
I0213 21:18:41.226472 27372 master.cpp:247] Shutting down master
I0213 21:18:41.226486 27394 slave.cpp:1844] master@67.195.138.9:40941 exited
W0213 21:18:41.226500 27394 slave.cpp:1847] Master disconnected! Waiting for a new master to be elected
I0213 21:18:41.226529 27397 sched.cpp:727] Stopping framework '2014-02-13-21:18:41-160088899-40941-27372-0000'
I0213 21:18:41.226531 27372 master.hpp:429] Removing task 1 with resources cpus(*):1; mem(*):512 on slave 2014-02-13-21:18:41-160088899-40941-27372-0 (vesta.apache.org)
I0213 21:18:41.226619 27372 master.cpp:290] Removing slave 2014-02-13-21:18:41-160088899-40941-27372-0 (vesta.apache.org)
I0213 21:18:41.226663 27393 hierarchical_allocator_process.hpp:637] Recovered cpus(*):1; mem(*):512 (total allocatable: cpus(*):2; mem(*):1024; disk(*):1024; ports(*):[31000-32000]) on slave 2014-02-13-21:18:41-160088899-40941-27372-0 from framework 2014-02-13-21:18:41-160088899-40941-27372-0000
I0213 21:18:41.329572 27372 slave.cpp:287] Slave terminating
I0213 21:18:41.329640 27372 slave.cpp:1027] Asked to shut down framework 2014-02-13-21:18:41-160088899-40941-27372-0000 by @0.0.0.0:0
I0213 21:18:41.329671 27372 slave.cpp:1052] Shutting down framework 2014-02-13-21:18:41-160088899-40941-27372-0000
I0213 21:18:41.329694 27372 slave.cpp:2332] Shutting down executor 'default' of framework 2014-02-13-21:18:41-160088899-40941-27372-0000
I0213 21:18:41.329797 27395 exec.cpp:378] Executor asked to shutdown
I0213 21:18:41.329849 27395 exec.cpp:393] Executor::shutdown took 16564ns
[ OK ] MultipleExecutorsTest.TasksExecutorInfoDiffers (116 ms)
[----------] 1 test from MultipleExecutorsTest (116 ms total)
[----------] 34 tests from ResourcesTest
[ RUN ] ResourcesTest.Parsing
[ OK ] ResourcesTest.Parsing (0 ms)
[ RUN ] ResourcesTest.ParsingWithRoles
[ OK ] ResourcesTest.ParsingWithRoles (0 ms)
[ RUN ] ResourcesTest.ParseError
[ OK ] ResourcesTest.ParseError (0 ms)
[ RUN ] ResourcesTest.Resources
[ OK ] ResourcesTest.Resources (1 ms)
[ RUN ] ResourcesTest.Printing
[ OK ] ResourcesTest.Printing (0 ms)
[ RUN ] ResourcesTest.InitializedIsEmpty
[ OK ] ResourcesTest.InitializedIsEmpty (0 ms)
[ RUN ] ResourcesTest.BadResourcesNotAllocatable
[ OK ] ResourcesTest.BadResourcesNotAllocatable (0 ms)
[ RUN ] ResourcesTest.ScalarEquals
[ OK ] ResourcesTest.ScalarEquals (0 ms)
[ RUN ] ResourcesTest.ScalarSubset
[ OK ] ResourcesTest.ScalarSubset (0 ms)
[ RUN ] ResourcesTest.ScalarSubset2
[ OK ] ResourcesTest.ScalarSubset2 (0 ms)
[ RUN ] ResourcesTest.ScalarAddition
[ OK ] ResourcesTest.ScalarAddition (0 ms)
[ RUN ] ResourcesTest.ScalarAddition2
[ OK ] ResourcesTest.ScalarAddition2 (0 ms)
[ RUN ] ResourcesTest.ScalarSubtraction
[ OK ] ResourcesTest.ScalarSubtraction (0 ms)
[ RUN ] ResourcesTest.ScalarSubtraction2
[ OK ] ResourcesTest.ScalarSubtraction2 (0 ms)
[ RUN ] ResourcesTest.RangesEquals
[ OK ] ResourcesTest.RangesEquals (0 ms)
[ RUN ] ResourcesTest.RangesSubset
[ OK ] ResourcesTest.RangesSubset (0 ms)
[ RUN ] ResourcesTest.RangesAddition
[ OK ] ResourcesTest.RangesAddition (0 ms)
[ RUN ] ResourcesTest.RangesAddition2
[ OK ] ResourcesTest.RangesAddition2 (0 ms)
[ RUN ] ResourcesTest.RangesAdditon3
[ OK ] ResourcesTest.RangesAdditon3 (0 ms)
[ RUN ] ResourcesTest.RangesAddition4
[ OK ] ResourcesTest.RangesAddition4 (1 ms)
[ RUN ] ResourcesTest.RangesSubtraction
[ OK ] ResourcesTest.RangesSubtraction (0 ms)
[ RUN ] ResourcesTest.RangesSubtraction1
[ OK ] ResourcesTest.RangesSubtraction1 (0 ms)
[ RUN ] ResourcesTest.RangesSubtraction2
[ OK ] ResourcesTest.RangesSubtraction2 (0 ms)
[ RUN ] ResourcesTest.RangesSubtraction3
[ OK ] ResourcesTest.RangesSubtraction3 (0 ms)
[ RUN ] ResourcesTest.RangesSubtraction4
[ OK ] ResourcesTest.RangesSubtraction4 (0 ms)
[ RUN ] ResourcesTest.RangesSubtraction5
[ OK ] ResourcesTest.RangesSubtraction5 (0 ms)
[ RUN ] ResourcesTest.RangesSubtraction6
[ OK ] ResourcesTest.RangesSubtraction6 (0 ms)
[ RUN ] ResourcesTest.SetEquals
[ OK ] ResourcesTest.SetEquals (0 ms)
[ RUN ] ResourcesTest.SetSubset
[ OK ] ResourcesTest.SetSubset (0 ms)
[ RUN ] ResourcesTest.SetAddition
[ OK ] ResourcesTest.SetAddition (0 ms)
[ RUN ] ResourcesTest.SetSubtraction
[ OK ] ResourcesTest.SetSubtraction (0 ms)
[ RUN ] ResourcesTest.EmptyUnequal
[ OK ] ResourcesTest.EmptyUnequal (0 ms)
[ RUN ] ResourcesTest.FlattenRoles
[ OK ] ResourcesTest.FlattenRoles (0 ms)
[ RUN ] ResourcesTest.Find
[ OK ] ResourcesTest.Find (1 ms)
[----------] 34 tests from ResourcesTest (3 ms total)
[----------] 3 tests from SASL
[ RUN ] SASL.success
I0213 21:18:41.333744 27398 authenticatee.hpp:124] Creating new client SASL connection
I0213 21:18:41.334008 27398 authenticator.hpp:140] Creating new server SASL connection
I0213 21:18:41.334120 27397 authenticatee.hpp:212] Received SASL authentication mechanisms: CRAM-MD5
I0213 21:18:41.334149 27397 authenticatee.hpp:238] Attempting to authenticate with mechanism 'CRAM-MD5'
I0213 21:18:41.334178 27397 authenticator.hpp:243] Received SASL authentication start
I0213 21:18:41.334259 27397 authenticator.hpp:325] Authentication requires more steps
I0213 21:18:41.334293 27397 authenticatee.hpp:258] Received SASL authentication step
I0213 21:18:41.334358 27393 authenticator.hpp:271] Received SASL authentication step
I0213 21:18:41.334383 27393 auxprop.cpp:81] Request to lookup properties for user: 'benh' realm: 'vesta.apache.org' server FQDN: 'vesta.apache.org' SASL_AUXPROP_VERIFY_AGAINST_HASH: false SASL_AUXPROP_OVERRIDE: false SASL_AUXPROP_AUTHZID: false
I0213 21:18:41.334393 27393 auxprop.cpp:153] Looking up auxiliary property '*userPassword'
I0213 21:18:41.334408 27393 auxprop.cpp:153] Looking up auxiliary property '*cmusaslsecretCRAM-MD5'
I0213 21:18:41.334419 27393 auxprop.cpp:81] Request to lookup properties for user: 'benh' realm: 'vesta.apache.org' server FQDN: 'vesta.apache.org' SASL_AUXPROP_VERIFY_AGAINST_HASH: false SASL_AUXPROP_OVERRIDE: false SASL_AUXPROP_AUTHZID: true
I0213 21:18:41.334424 27393 auxprop.cpp:103] Skipping auxiliary property '*userPassword' since SASL_AUXPROP_AUTHZID == true
I0213 21:18:41.334431 27393 auxprop.cpp:103] Skipping auxiliary property '*cmusaslsecretCRAM-MD5' since SASL_AUXPROP_AUTHZID == true
I0213 21:18:41.334444 27393 authenticator.hpp:317] Authentication success
I0213 21:18:41.334468 27393 authenticatee.hpp:298] Authentication success
[ OK ] SASL.success (1 ms)
[ RUN ] SASL.failed1
I0213 21:18:41.334858 27393 authenticatee.hpp:124] Creating new client SASL connection
I0213 21:18:41.335151 27391 authenticator.hpp:140] Creating new server SASL connection
I0213 21:18:41.335252 27395 authenticatee.hpp:212] Received SASL authentication mechanisms: CRAM-MD5
I0213 21:18:41.335268 27395 authenticatee.hpp:238] Attempting to authenticate with mechanism 'CRAM-MD5'
I0213 21:18:41.335300 27395 authenticator.hpp:243] Received SASL authentication start
I0213 21:18:41.335361 27395 authenticator.hpp:325] Authentication requires more steps
I0213 21:18:41.335392 27395 authenticatee.hpp:258] Received SASL authentication step
I0213 21:18:41.335454 27395 authenticator.hpp:271] Received SASL authentication step
I0213 21:18:41.335476 27395 auxprop.cpp:81] Request to lookup properties for user: 'benh' realm: 'vesta.apache.org' server FQDN: 'vesta.apache.org' SASL_AUXPROP_VERIFY_AGAINST_HASH: false SASL_AUXPROP_OVERRIDE: false SASL_AUXPROP_AUTHZID: false
I0213 21:18:41.335484 27395 auxprop.cpp:153] Looking up auxiliary property '*userPassword'
I0213 21:18:41.335497 27395 auxprop.cpp:153] Looking up auxiliary property '*cmusaslsecretCRAM-MD5'
I0213 21:18:41.335507 27395 auxprop.cpp:81] Request to lookup properties for user: 'benh' realm: 'vesta.apache.org' server FQDN: 'vesta.apache.org' SASL_AUXPROP_VERIFY_AGAINST_HASH: false SASL_AUXPROP_OVERRIDE: false SASL_AUXPROP_AUTHZID: true
I0213 21:18:41.335513 27395 auxprop.cpp:103] Skipping auxiliary property '*userPassword' since SASL_AUXPROP_AUTHZID == true
I0213 21:18:41.335518 27395 auxprop.cpp:103] Skipping auxiliary property '*cmusaslsecretCRAM-MD5' since SASL_AUXPROP_AUTHZID == true
W0213 21:18:41.335535 27395 authenticator.hpp:331] Authentication failure: authentication failure
[ OK ] SASL.failed1 (1 ms)
[ RUN ] SASL.failed2
I0213 21:18:41.336061 27395 authenticatee.hpp:124] Creating new client SASL connection
I0213 21:18:41.336312 27394 authenticator.hpp:140] Creating new server SASL connection
I0213 21:18:41.336442 27394 authenticatee.hpp:212] Received SASL authentication mechanisms: CRAM-MD5
I0213 21:18:41.336465 27394 authenticatee.hpp:238] Attempting to authenticate with mechanism 'CRAM-MD5'
I0213 21:18:41.336491 27394 authenticator.hpp:243] Received SASL authentication start
I0213 21:18:41.336576 27394 authenticator.hpp:325] Authentication requires more steps
I0213 21:18:41.336607 27394 authenticatee.hpp:258] Received SASL authentication step
I0213 21:18:41.336647 27394 authenticator.hpp:271] Received SASL authentication step
I0213 21:18:41.336673 27394 auxprop.cpp:81] Request to lookup properties for user: 'benh' realm: 'vesta.apache.org' server FQDN: 'vesta.apache.org' SASL_AUXPROP_VERIFY_AGAINST_HASH: false SASL_AUXPROP_OVERRIDE: false SASL_AUXPROP_AUTHZID: false
I0213 21:18:41.336680 27394 auxprop.cpp:153] Looking up auxiliary property '*userPassword'
I0213 21:18:41.336688 27394 auxprop.cpp:153] Looking up auxiliary property '*cmusaslsecretCRAM-MD5'
I0213 21:18:41.336696 27394 auxprop.cpp:81] Request to lookup properties for user: 'benh' realm: 'vesta.apache.org' server FQDN: 'vesta.apache.org' SASL_AUXPROP_VERIFY_AGAINST_HASH: false SASL_AUXPROP_OVERRIDE: false SASL_AUXPROP_AUTHZID: true
I0213 21:18:41.336702 27394 auxprop.cpp:103] Skipping auxiliary property '*userPassword' since SASL_AUXPROP_AUTHZID == true
I0213 21:18:41.336707 27394 auxprop.cpp:103] Skipping auxiliary property '*cmusaslsecretCRAM-MD5' since SASL_AUXPROP_AUTHZID == true
W0213 21:18:41.336716 27394 authenticator.hpp:331] Authentication failure: user not found
[ OK ] SASL.failed2 (1 ms)
[----------] 3 tests from SASL (3 ms total)
[----------] 2 tests from SlaveStateTest
[ RUN ] SlaveStateTest.CheckpointProtobuf
Using temporary directory '/tmp/SlaveStateTest_CheckpointProtobuf_DMmh6Z'
[ OK ] SlaveStateTest.CheckpointProtobuf (0 ms)
[ RUN ] SlaveStateTest.CheckpointString
Using temporary directory '/tmp/SlaveStateTest_CheckpointString_oI3U5U'
[ OK ] SlaveStateTest.CheckpointString (0 ms)
[----------] 2 tests from SlaveStateTest (0 ms total)
[----------] 23 tests from SlaveRecoveryTest/0, where TypeParam = mesos::internal::slave::MesosContainerizer
[ RUN ] SlaveRecoveryTest/0.RecoverSlaveState
../../src/tests/mesos.cpp:336: Failure
cgroups::mount(hierarchy, subsystem): Failed to mount 'freezer' at '/tmp/mesos_test_cgroup/freezer': Operation not permitted
-------------------------------------------------------------
We cannot run any cgroups tests that require
a hierarchy with subsystem 'freezer'
because we failed to find an existing hierarchy
or create a new one (tried '/tmp/mesos_test_cgroup/freezer').
You can either remove all existing
hierarchies, or disable this test case
(i.e., --gtest_filter=-SlaveRecoveryTest/0.*).
-------------------------------------------------------------
F0213 21:18:41.338361 27372 mesos.cpp:362] CHECK_SOME(cgroups): '/tmp/mesos_test_cgroup/freezer' is not a valid hierarchy
*** Check failure stack trace: ***
@ 0x2ab150bce21d google::LogMessage::Fail()
@ 0x2ab150bd031f google::LogMessage::SendToLog()
@ 0x2ab150bcde0c google::LogMessage::Flush()
@ 0x2ab150bd0bbd google::LogMessageFatal::~LogMessageFatal()
@ 0x4d8add _CheckSome::~_CheckSome()
@ 0x6fceb4 mesos::internal::tests::ContainerizerTest<>::TearDown()
@ 0x851fbd testing::internal::HandleExceptionsInMethodIfSupported<>()
@ 0x84a1f3 testing::Test::Run()
@ 0x84a326 testing::TestInfo::Run()
@ 0x84a467 testing::TestCase::Run()
@ 0x84a7be testing::internal::UnitTestImpl::RunAllTests()
@ 0x851b3d testing::internal::HandleExceptionsInMethodIfSupported<>()
@ 0x84989e testing::UnitTest::Run()
@ 0x4b2d2b main
@ 0x2ab151f9376d (unknown)
@ 0x4bbb81 (unknown)
make[3]: *** [check-local] Aborted
make[3]: Leaving directory `/home/hudson/jenkins-slave/workspace/Mesos-Trunk-Ubuntu-Build-Out-Of-Src-Set-JAVA_HOME/build/src'
make[2]: *** [check-am] Error 2
make[2]: Leaving directory `/home/hudson/jenkins-slave/workspace/Mesos-Trunk-Ubuntu-Build-Out-Of-Src-Set-JAVA_HOME/build/src'
make[1]: *** [check] Error 2
make[1]: Leaving directory `/home/hudson/jenkins-slave/workspace/Mesos-Trunk-Ubuntu-Build-Out-Of-Src-Set-JAVA_HOME/build/src'
make: *** [check-recursive] Error 1
Build step 'Execute shell' marked build as failure
Build failed in Jenkins:
Mesos-Trunk-Ubuntu-Build-Out-Of-Src-Set-JAVA_HOME #1889
Posted by Apache Jenkins Server <je...@builds.apache.org>.
See <https://builds.apache.org/job/Mesos-Trunk-Ubuntu-Build-Out-Of-Src-Set-JAVA_HOME/1889/>
------------------------------------------
[...truncated 18777 lines...]
I0212 06:03:23.300499 32739 master.cpp:818] Received registration request from scheduler(101)@67.195.138.9:55071
I0212 06:03:23.300551 32739 master.cpp:836] Registering framework 2014-02-12-06:03:23-160088899-55071-32714-0000 at scheduler(101)@67.195.138.9:55071
I0212 06:03:23.300624 32737 sched.cpp:391] Framework registered with 2014-02-12-06:03:23-160088899-55071-32714-0000
I0212 06:03:23.300643 32739 hierarchical_allocator_process.hpp:332] Added framework 2014-02-12-06:03:23-160088899-55071-32714-0000
I0212 06:03:23.300650 32737 sched.cpp:405] Scheduler::registered took 11352ns
I0212 06:03:23.300700 32739 hierarchical_allocator_process.hpp:752] Offering cpus(*):2; mem(*):1024; disk(*):1024; ports(*):[31000-32000] on slave 2014-02-12-06:03:23-160088899-55071-32714-0 to framework 2014-02-12-06:03:23-160088899-55071-32714-0000
I0212 06:03:23.300839 32739 hierarchical_allocator_process.hpp:688] Performed allocation for 1 slaves in 182467ns
I0212 06:03:23.300891 32735 master.hpp:439] Adding offer 2014-02-12-06:03:23-160088899-55071-32714-0 with resources cpus(*):2; mem(*):1024; disk(*):1024; ports(*):[31000-32000] on slave 2014-02-12-06:03:23-160088899-55071-32714-0 (vesta.apache.org)
I0212 06:03:23.300933 32735 master.cpp:2278] Sending 1 offers to framework 2014-02-12-06:03:23-160088899-55071-32714-0000
I0212 06:03:23.301035 32739 sched.cpp:525] Scheduler::resourceOffers took 21849ns
I0212 06:03:23.301368 32740 sched.cpp:898] Attempting to launch task 2 with an unknown offer 2014-02-12-06:03:23-160088899-55071-32714-0
I0212 06:03:23.301532 32739 master.hpp:449] Removing offer 2014-02-12-06:03:23-160088899-55071-32714-0 with resources cpus(*):2; mem(*):1024; disk(*):1024; ports(*):[31000-32000] on slave 2014-02-12-06:03:23-160088899-55071-32714-0 (vesta.apache.org)
I0212 06:03:23.301579 32739 master.cpp:1574] Processing reply for offers: [ 2014-02-12-06:03:23-160088899-55071-32714-0 ] on slave 2014-02-12-06:03:23-160088899-55071-32714-0 (vesta.apache.org) for framework 2014-02-12-06:03:23-160088899-55071-32714-0000
I0212 06:03:23.301651 32739 master.hpp:411] Adding task 1 with resources cpus(*):1; mem(*):512 on slave 2014-02-12-06:03:23-160088899-55071-32714-0 (vesta.apache.org)
I0212 06:03:23.301681 32739 master.cpp:2447] Launching task 1 of framework 2014-02-12-06:03:23-160088899-55071-32714-0000 with resources cpus(*):1; mem(*):512 on slave 2014-02-12-06:03:23-160088899-55071-32714-0 (vesta.apache.org)
I0212 06:03:23.301766 32737 slave.cpp:625] Got assigned task 1 for framework 2014-02-12-06:03:23-160088899-55071-32714-0000
W0212 06:03:23.301853 32739 master.cpp:1608] Failed to validate task 2 : Task has invalid ExecutorInfo (existing ExecutorInfo with same ExecutorID is not compatible).
------------------------------------------------------------
Existing ExecutorInfo:
executor_id {
value: "default"
}
command {
value: "exit 1"
}
framework_id {
value: "2014-02-12-06:03:23-160088899-55071-32714-0000"
}
------------------------------------------------------------
Task's ExecutorInfo:
executor_id {
value: "default"
}
command {
value: "exit 2"
}
framework_id {
value: "2014-02-12-06:03:23-160088899-55071-32714-0000"
}
------------------------------------------------------------
I0212 06:03:23.301952 32737 slave.cpp:734] Launching task 1 for framework 2014-02-12-06:03:23-160088899-55071-32714-0000
I0212 06:03:23.304467 32739 master.cpp:1618] Sending status update TASK_LOST (UUID: 5f1afa5a-096b-4365-95b7-45c04856ec68) for task 2 of framework 2014-02-12-06:03:23-160088899-55071-32714-0000 for invalid task
I0212 06:03:23.304571 32735 sched.cpp:616] Scheduler::statusUpdate took 15229ns
I0212 06:03:23.304611 32736 hierarchical_allocator_process.hpp:547] Framework 2014-02-12-06:03:23-160088899-55071-32714-0000 left cpus(*):1; mem(*):512; disk(*):1024; ports(*):[31000-32000] unused on slave 2014-02-12-06:03:23-160088899-55071-32714-0
I0212 06:03:23.304743 32736 hierarchical_allocator_process.hpp:590] Framework 2014-02-12-06:03:23-160088899-55071-32714-0000 filtered slave 2014-02-12-06:03:23-160088899-55071-32714-0 for 5secs
I0212 06:03:23.306035 32737 exec.cpp:131] Version: 0.18.0
I0212 06:03:23.306078 32740 exec.cpp:181] Executor started at: executor(37)@67.195.138.9:55071 with pid 32714
I0212 06:03:23.306176 32737 slave.cpp:844] Queuing task '1' for executor default of framework '2014-02-12-06:03:23-160088899-55071-32714-0000
I0212 06:03:23.306220 32737 slave.cpp:358] Successfully attached file '/tmp/MultipleExecutorsTest_TasksExecutorInfoDiffers_pu8ZoE/slaves/2014-02-12-06:03:23-160088899-55071-32714-0/frameworks/2014-02-12-06:03:23-160088899-55071-32714-0000/executors/default/runs/d9184dc4-3b1c-4ac9-8ea4-650a991860da'
I0212 06:03:23.306238 32737 slave.cpp:1989] Monitoring executor 'default' of framework '2014-02-12-06:03:23-160088899-55071-32714-0000' in container 'd9184dc4-3b1c-4ac9-8ea4-650a991860da'
I0212 06:03:23.306290 32737 slave.cpp:1316] Got registration for executor 'default' of framework 2014-02-12-06:03:23-160088899-55071-32714-0000
I0212 06:03:23.306416 32737 slave.cpp:1434] Flushing queued task 1 for executor 'default' of framework 2014-02-12-06:03:23-160088899-55071-32714-0000
I0212 06:03:23.306429 32741 exec.cpp:205] Executor registered on slave 2014-02-12-06:03:23-160088899-55071-32714-0
I0212 06:03:23.307482 32741 exec.cpp:217] Executor::registered took 10219ns
I0212 06:03:23.307534 32741 exec.cpp:292] Executor asked to run task '1'
I0212 06:03:23.307590 32741 exec.cpp:301] Executor::launchTask took 42189ns
I0212 06:03:23.307802 32714 master.cpp:587] Master terminating
I0212 06:03:23.307807 32740 sched.cpp:727] Stopping framework '2014-02-12-06:03:23-160088899-55071-32714-0000'
I0212 06:03:23.307852 32714 master.cpp:247] Shutting down master
I0212 06:03:23.307867 32736 slave.cpp:1844] master@67.195.138.9:55071 exited
W0212 06:03:23.307883 32736 slave.cpp:1847] Master disconnected! Waiting for a new master to be elected
I0212 06:03:23.307901 32714 master.hpp:429] Removing task 1 with resources cpus(*):1; mem(*):512 on slave 2014-02-12-06:03:23-160088899-55071-32714-0 (vesta.apache.org)
I0212 06:03:23.307981 32714 master.cpp:290] Removing slave 2014-02-12-06:03:23-160088899-55071-32714-0 (vesta.apache.org)
I0212 06:03:23.308043 32737 hierarchical_allocator_process.hpp:637] Recovered cpus(*):1; mem(*):512 (total allocatable: cpus(*):2; mem(*):1024; disk(*):1024; ports(*):[31000-32000]) on slave 2014-02-12-06:03:23-160088899-55071-32714-0 from framework 2014-02-12-06:03:23-160088899-55071-32714-0000
I0212 06:03:23.661538 32714 slave.cpp:287] Slave terminating
I0212 06:03:23.661617 32714 slave.cpp:1027] Asked to shut down framework 2014-02-12-06:03:23-160088899-55071-32714-0000 by @0.0.0.0:0
I0212 06:03:23.661638 32714 slave.cpp:1052] Shutting down framework 2014-02-12-06:03:23-160088899-55071-32714-0000
I0212 06:03:23.661658 32714 slave.cpp:2332] Shutting down executor 'default' of framework 2014-02-12-06:03:23-160088899-55071-32714-0000
I0212 06:03:23.661972 32714 exec.cpp:378] Executor asked to shutdown
I0212 06:03:23.661990 32714 exec.cpp:393] Executor::shutdown took 9us
[ OK ] MultipleExecutorsTest.TasksExecutorInfoDiffers (368 ms)
[----------] 1 test from MultipleExecutorsTest (368 ms total)
[----------] 34 tests from ResourcesTest
[ RUN ] ResourcesTest.Parsing
[ OK ] ResourcesTest.Parsing (0 ms)
[ RUN ] ResourcesTest.ParsingWithRoles
[ OK ] ResourcesTest.ParsingWithRoles (0 ms)
[ RUN ] ResourcesTest.ParseError
[ OK ] ResourcesTest.ParseError (0 ms)
[ RUN ] ResourcesTest.Resources
[ OK ] ResourcesTest.Resources (0 ms)
[ RUN ] ResourcesTest.Printing
[ OK ] ResourcesTest.Printing (0 ms)
[ RUN ] ResourcesTest.InitializedIsEmpty
[ OK ] ResourcesTest.InitializedIsEmpty (0 ms)
[ RUN ] ResourcesTest.BadResourcesNotAllocatable
[ OK ] ResourcesTest.BadResourcesNotAllocatable (0 ms)
[ RUN ] ResourcesTest.ScalarEquals
[ OK ] ResourcesTest.ScalarEquals (0 ms)
[ RUN ] ResourcesTest.ScalarSubset
[ OK ] ResourcesTest.ScalarSubset (1 ms)
[ RUN ] ResourcesTest.ScalarSubset2
[ OK ] ResourcesTest.ScalarSubset2 (0 ms)
[ RUN ] ResourcesTest.ScalarAddition
[ OK ] ResourcesTest.ScalarAddition (0 ms)
[ RUN ] ResourcesTest.ScalarAddition2
[ OK ] ResourcesTest.ScalarAddition2 (0 ms)
[ RUN ] ResourcesTest.ScalarSubtraction
[ OK ] ResourcesTest.ScalarSubtraction (0 ms)
[ RUN ] ResourcesTest.ScalarSubtraction2
[ OK ] ResourcesTest.ScalarSubtraction2 (0 ms)
[ RUN ] ResourcesTest.RangesEquals
[ OK ] ResourcesTest.RangesEquals (0 ms)
[ RUN ] ResourcesTest.RangesSubset
[ OK ] ResourcesTest.RangesSubset (0 ms)
[ RUN ] ResourcesTest.RangesAddition
[ OK ] ResourcesTest.RangesAddition (0 ms)
[ RUN ] ResourcesTest.RangesAddition2
[ OK ] ResourcesTest.RangesAddition2 (0 ms)
[ RUN ] ResourcesTest.RangesAdditon3
[ OK ] ResourcesTest.RangesAdditon3 (0 ms)
[ RUN ] ResourcesTest.RangesAddition4
[ OK ] ResourcesTest.RangesAddition4 (0 ms)
[ RUN ] ResourcesTest.RangesSubtraction
[ OK ] ResourcesTest.RangesSubtraction (0 ms)
[ RUN ] ResourcesTest.RangesSubtraction1
[ OK ] ResourcesTest.RangesSubtraction1 (0 ms)
[ RUN ] ResourcesTest.RangesSubtraction2
[ OK ] ResourcesTest.RangesSubtraction2 (0 ms)
[ RUN ] ResourcesTest.RangesSubtraction3
[ OK ] ResourcesTest.RangesSubtraction3 (0 ms)
[ RUN ] ResourcesTest.RangesSubtraction4
[ OK ] ResourcesTest.RangesSubtraction4 (0 ms)
[ RUN ] ResourcesTest.RangesSubtraction5
[ OK ] ResourcesTest.RangesSubtraction5 (0 ms)
[ RUN ] ResourcesTest.RangesSubtraction6
[ OK ] ResourcesTest.RangesSubtraction6 (0 ms)
[ RUN ] ResourcesTest.SetEquals
[ OK ] ResourcesTest.SetEquals (0 ms)
[ RUN ] ResourcesTest.SetSubset
[ OK ] ResourcesTest.SetSubset (0 ms)
[ RUN ] ResourcesTest.SetAddition
[ OK ] ResourcesTest.SetAddition (0 ms)
[ RUN ] ResourcesTest.SetSubtraction
[ OK ] ResourcesTest.SetSubtraction (0 ms)
[ RUN ] ResourcesTest.EmptyUnequal
[ OK ] ResourcesTest.EmptyUnequal (0 ms)
[ RUN ] ResourcesTest.FlattenRoles
[ OK ] ResourcesTest.FlattenRoles (0 ms)
[ RUN ] ResourcesTest.Find
[ OK ] ResourcesTest.Find (0 ms)
[----------] 34 tests from ResourcesTest (2 ms total)
[----------] 3 tests from SASL
[ RUN ] SASL.success
I0212 06:03:23.665103 32740 authenticatee.hpp:124] Creating new client SASL connection
I0212 06:03:23.665453 32739 authenticator.hpp:140] Creating new server SASL connection
I0212 06:03:23.665568 32736 authenticatee.hpp:212] Received SASL authentication mechanisms: CRAM-MD5
I0212 06:03:23.665596 32736 authenticatee.hpp:238] Attempting to authenticate with mechanism 'CRAM-MD5'
I0212 06:03:23.665624 32736 authenticator.hpp:243] Received SASL authentication start
I0212 06:03:23.665674 32736 authenticator.hpp:325] Authentication requires more steps
I0212 06:03:23.665700 32736 authenticatee.hpp:258] Received SASL authentication step
I0212 06:03:23.665740 32736 authenticator.hpp:271] Received SASL authentication step
I0212 06:03:23.665760 32736 auxprop.cpp:81] Request to lookup properties for user: 'benh' realm: 'vesta.apache.org' server FQDN: 'vesta.apache.org' SASL_AUXPROP_VERIFY_AGAINST_HASH: false SASL_AUXPROP_OVERRIDE: false SASL_AUXPROP_AUTHZID: false
I0212 06:03:23.665771 32736 auxprop.cpp:153] Looking up auxiliary property '*userPassword'
I0212 06:03:23.665782 32736 auxprop.cpp:153] Looking up auxiliary property '*cmusaslsecretCRAM-MD5'
I0212 06:03:23.665791 32736 auxprop.cpp:81] Request to lookup properties for user: 'benh' realm: 'vesta.apache.org' server FQDN: 'vesta.apache.org' SASL_AUXPROP_VERIFY_AGAINST_HASH: false SASL_AUXPROP_OVERRIDE: false SASL_AUXPROP_AUTHZID: true
I0212 06:03:23.665798 32736 auxprop.cpp:103] Skipping auxiliary property '*userPassword' since SASL_AUXPROP_AUTHZID == true
I0212 06:03:23.665803 32736 auxprop.cpp:103] Skipping auxiliary property '*cmusaslsecretCRAM-MD5' since SASL_AUXPROP_AUTHZID == true
I0212 06:03:23.665813 32736 authenticator.hpp:317] Authentication success
I0212 06:03:23.665845 32739 authenticatee.hpp:298] Authentication success
[ OK ] SASL.success (2 ms)
[ RUN ] SASL.failed1
I0212 06:03:23.666290 32736 authenticatee.hpp:124] Creating new client SASL connection
I0212 06:03:23.666569 32735 authenticator.hpp:140] Creating new server SASL connection
I0212 06:03:23.666646 32736 authenticatee.hpp:212] Received SASL authentication mechanisms: CRAM-MD5
I0212 06:03:23.666678 32736 authenticatee.hpp:238] Attempting to authenticate with mechanism 'CRAM-MD5'
I0212 06:03:23.666705 32736 authenticator.hpp:243] Received SASL authentication start
I0212 06:03:23.666734 32736 authenticator.hpp:325] Authentication requires more steps
I0212 06:03:23.666762 32736 authenticatee.hpp:258] Received SASL authentication step
I0212 06:03:23.666796 32736 authenticator.hpp:271] Received SASL authentication step
I0212 06:03:23.666812 32736 auxprop.cpp:81] Request to lookup properties for user: 'benh' realm: 'vesta.apache.org' server FQDN: 'vesta.apache.org' SASL_AUXPROP_VERIFY_AGAINST_HASH: false SASL_AUXPROP_OVERRIDE: false SASL_AUXPROP_AUTHZID: false
I0212 06:03:23.666825 32736 auxprop.cpp:153] Looking up auxiliary property '*userPassword'
I0212 06:03:23.666833 32736 auxprop.cpp:153] Looking up auxiliary property '*cmusaslsecretCRAM-MD5'
I0212 06:03:23.666844 32736 auxprop.cpp:81] Request to lookup properties for user: 'benh' realm: 'vesta.apache.org' server FQDN: 'vesta.apache.org' SASL_AUXPROP_VERIFY_AGAINST_HASH: false SASL_AUXPROP_OVERRIDE: false SASL_AUXPROP_AUTHZID: true
I0212 06:03:23.666851 32736 auxprop.cpp:103] Skipping auxiliary property '*userPassword' since SASL_AUXPROP_AUTHZID == true
I0212 06:03:23.666856 32736 auxprop.cpp:103] Skipping auxiliary property '*cmusaslsecretCRAM-MD5' since SASL_AUXPROP_AUTHZID == true
W0212 06:03:23.666872 32736 authenticator.hpp:331] Authentication failure: authentication failure
[ OK ] SASL.failed1 (1 ms)
[ RUN ] SASL.failed2
I0212 06:03:23.667348 32739 authenticatee.hpp:124] Creating new client SASL connection
I0212 06:03:23.667698 32738 authenticator.hpp:140] Creating new server SASL connection
I0212 06:03:23.667814 32734 authenticatee.hpp:212] Received SASL authentication mechanisms: CRAM-MD5
I0212 06:03:23.667831 32734 authenticatee.hpp:238] Attempting to authenticate with mechanism 'CRAM-MD5'
I0212 06:03:23.667861 32734 authenticator.hpp:243] Received SASL authentication start
I0212 06:03:23.667902 32734 authenticator.hpp:325] Authentication requires more steps
I0212 06:03:23.667932 32734 authenticatee.hpp:258] Received SASL authentication step
I0212 06:03:23.668011 32739 authenticator.hpp:271] Received SASL authentication step
I0212 06:03:23.668038 32739 auxprop.cpp:81] Request to lookup properties for user: 'benh' realm: 'vesta.apache.org' server FQDN: 'vesta.apache.org' SASL_AUXPROP_VERIFY_AGAINST_HASH: false SASL_AUXPROP_OVERRIDE: false SASL_AUXPROP_AUTHZID: false
I0212 06:03:23.668046 32739 auxprop.cpp:153] Looking up auxiliary property '*userPassword'
I0212 06:03:23.668053 32739 auxprop.cpp:153] Looking up auxiliary property '*cmusaslsecretCRAM-MD5'
I0212 06:03:23.668061 32739 auxprop.cpp:81] Request to lookup properties for user: 'benh' realm: 'vesta.apache.org' server FQDN: 'vesta.apache.org' SASL_AUXPROP_VERIFY_AGAINST_HASH: false SASL_AUXPROP_OVERRIDE: false SASL_AUXPROP_AUTHZID: true
I0212 06:03:23.668067 32739 auxprop.cpp:103] Skipping auxiliary property '*userPassword' since SASL_AUXPROP_AUTHZID == true
I0212 06:03:23.668072 32739 auxprop.cpp:103] Skipping auxiliary property '*cmusaslsecretCRAM-MD5' since SASL_AUXPROP_AUTHZID == true
W0212 06:03:23.668081 32739 authenticator.hpp:331] Authentication failure: user not found
[ OK ] SASL.failed2 (1 ms)
[----------] 3 tests from SASL (4 ms total)
[----------] 2 tests from SlaveStateTest
[ RUN ] SlaveStateTest.CheckpointProtobuf
Using temporary directory '/tmp/SlaveStateTest_CheckpointProtobuf_7B9JDH'
[ OK ] SlaveStateTest.CheckpointProtobuf (0 ms)
[ RUN ] SlaveStateTest.CheckpointString
Using temporary directory '/tmp/SlaveStateTest_CheckpointString_sJwxSK'
[ OK ] SlaveStateTest.CheckpointString (0 ms)
[----------] 2 tests from SlaveStateTest (0 ms total)
[----------] 23 tests from SlaveRecoveryTest/0, where TypeParam = mesos::internal::slave::MesosContainerizer
[ RUN ] SlaveRecoveryTest/0.RecoverSlaveState
../../src/tests/mesos.cpp:336: Failure
cgroups::mount(hierarchy, subsystem): Failed to mount 'freezer' at '/tmp/mesos_test_cgroup/freezer': Operation not permitted
-------------------------------------------------------------
We cannot run any cgroups tests that require
a hierarchy with subsystem 'freezer'
because we failed to find an existing hierarchy
or create a new one (tried '/tmp/mesos_test_cgroup/freezer').
You can either remove all existing
hierarchies, or disable this test case
(i.e., --gtest_filter=-SlaveRecoveryTest/0.*).
-------------------------------------------------------------
F0212 06:03:23.686146 32714 mesos.cpp:362] CHECK_SOME(cgroups): '/tmp/mesos_test_cgroup/freezer' is not a valid hierarchy
*** Check failure stack trace: ***
@ 0x2b53b860df1d google::LogMessage::Fail()
@ 0x2b53b861001f google::LogMessage::SendToLog()
@ 0x2b53b860db0c google::LogMessage::Flush()
@ 0x2b53b86108bd google::LogMessageFatal::~LogMessageFatal()
@ 0x4d8add _CheckSome::~_CheckSome()
@ 0x6fceb4 mesos::internal::tests::ContainerizerTest<>::TearDown()
@ 0x851fbd testing::internal::HandleExceptionsInMethodIfSupported<>()
@ 0x84a1f3 testing::Test::Run()
@ 0x84a326 testing::TestInfo::Run()
@ 0x84a467 testing::TestCase::Run()
@ 0x84a7be testing::internal::UnitTestImpl::RunAllTests()
@ 0x851b3d testing::internal::HandleExceptionsInMethodIfSupported<>()
@ 0x84989e testing::UnitTest::Run()
@ 0x4b2d2b main
@ 0x2b53b99d376d (unknown)
@ 0x4bbb81 (unknown)
make[3]: *** [check-local] Aborted
make[3]: Leaving directory `/home/hudson/jenkins-slave/workspace/Mesos-Trunk-Ubuntu-Build-Out-Of-Src-Set-JAVA_HOME/build/src'
make[2]: *** [check-am] Error 2
make[2]: Leaving directory `/home/hudson/jenkins-slave/workspace/Mesos-Trunk-Ubuntu-Build-Out-Of-Src-Set-JAVA_HOME/build/src'
make[1]: *** [check] Error 2
make[1]: Leaving directory `/home/hudson/jenkins-slave/workspace/Mesos-Trunk-Ubuntu-Build-Out-Of-Src-Set-JAVA_HOME/build/src'
make: *** [check-recursive] Error 1
Build step 'Execute shell' marked build as failure
Re: Build failed in Jenkins: Mesos-Trunk-Ubuntu-Build-Out-Of-Src-Set-JAVA_HOME
#1888
Posted by Vinod Kone <vi...@twitter.com>.
+ian
Looks like these cgroups tests are no longer being disabled at runtime when
we are running as non-root? If thats the case it is a regression and need
to be fixed because we don't root perms on apache jenkins.
@vinodkone
On Tue, Feb 11, 2014 at 9:13 PM, Apache Jenkins Server <
jenkins@builds.apache.org> wrote:
> See <
> https://builds.apache.org/job/Mesos-Trunk-Ubuntu-Build-Out-Of-Src-Set-JAVA_HOME/1888/changes
> >
>
> Changes:
>
> [vinod] Fixed build error in make check on src/tests/isolator_tests.cpp.
>
> ------------------------------------------
> [...truncated 18886 lines...]
> I0212 05:13:06.390861 23385 master.cpp:818] Received registration request
> from scheduler(101)@140.211.11.27:58984
> I0212 05:13:06.390993 23385 master.cpp:836] Registering framework
> 2014-02-12-05:13:06-453759884-58984-23279-0000 at scheduler(101)@
> 140.211.11.27:58984
> I0212 05:13:06.391161 23383 sched.cpp:391] Framework registered with
> 2014-02-12-05:13:06-453759884-58984-23279-0000
> I0212 05:13:06.391187 23383 sched.cpp:405] Scheduler::registered took
> 9192ns
> I0212 05:13:06.391401 23372 hierarchical_allocator_process.hpp:332] Added
> framework 2014-02-12-05:13:06-453759884-58984-23279-0000
> I0212 05:13:06.391455 23372 hierarchical_allocator_process.hpp:752]
> Offering cpus(*):2; mem(*):1024; disk(*):1024; ports(*):[31000-32000] on
> slave 2014-02-12-05:13:06-453759884-58984-23279-0 to framework
> 2014-02-12-05:13:06-453759884-58984-23279-0000
> I0212 05:13:06.391584 23372 hierarchical_allocator_process.hpp:688]
> Performed allocation for 1 slaves in 160207ns
> I0212 05:13:06.391667 23375 master.hpp:439] Adding offer
> 2014-02-12-05:13:06-453759884-58984-23279-0 with resources cpus(*):2;
> mem(*):1024; disk(*):1024; ports(*):[31000-32000] on slave
> 2014-02-12-05:13:06-453759884-58984-23279-0 (hemera.apache.org)
> I0212 05:13:06.391726 23375 master.cpp:2278] Sending 1 offers to framework
> 2014-02-12-05:13:06-453759884-58984-23279-0000
> I0212 05:13:06.391876 23373 sched.cpp:525] Scheduler::resourceOffers took
> 26384ns
> I0212 05:13:06.392393 23389 sched.cpp:898] Attempting to launch task 2
> with an unknown offer 2014-02-12-05:13:06-453759884-58984-23279-0
> I0212 05:13:06.392658 23380 master.hpp:449] Removing offer
> 2014-02-12-05:13:06-453759884-58984-23279-0 with resources cpus(*):2;
> mem(*):1024; disk(*):1024; ports(*):[31000-32000] on slave
> 2014-02-12-05:13:06-453759884-58984-23279-0 (hemera.apache.org)
> I0212 05:13:06.392726 23380 master.cpp:1574] Processing reply for offers:
> [ 2014-02-12-05:13:06-453759884-58984-23279-0 ] on slave
> 2014-02-12-05:13:06-453759884-58984-23279-0 (hemera.apache.org) for
> framework 2014-02-12-05:13:06-453759884-58984-23279-0000
> I0212 05:13:06.392802 23380 master.hpp:411] Adding task 1 with resources
> cpus(*):1; mem(*):512 on slave 2014-02-12-05:13:06-453759884-58984-23279-0 (
> hemera.apache.org)
> I0212 05:13:06.392834 23380 master.cpp:2447] Launching task 1 of framework
> 2014-02-12-05:13:06-453759884-58984-23279-0000 with resources cpus(*):1;
> mem(*):512 on slave 2014-02-12-05:13:06-453759884-58984-23279-0 (
> hemera.apache.org)
> I0212 05:13:06.392948 23379 slave.cpp:625] Got assigned task 1 for
> framework 2014-02-12-05:13:06-453759884-58984-23279-0000
> W0212 05:13:06.393010 23380 master.cpp:1608] Failed to validate task 2 :
> Task has invalid ExecutorInfo (existing ExecutorInfo with same ExecutorID
> is not compatible).
> ------------------------------------------------------------
> Existing ExecutorInfo:
> executor_id {
> value: "default"
> }
> command {
> value: "exit 1"
> }
> framework_id {
> value: "2014-02-12-05:13:06-453759884-58984-23279-0000"
> }
>
> ------------------------------------------------------------
> Task's ExecutorInfo:
> executor_id {
> value: "default"
> }
> command {
> value: "exit 2"
> }
> framework_id {
> value: "2014-02-12-05:13:06-453759884-58984-23279-0000"
> }
>
> ------------------------------------------------------------
> I0212 05:13:06.393178 23379 slave.cpp:734] Launching task 1 for framework
> 2014-02-12-05:13:06-453759884-58984-23279-0000
> I0212 05:13:06.396800 23380 master.cpp:1618] Sending status update
> TASK_LOST (UUID: 4b8ae1ff-d654-486a-8120-46121cc1c8ed) for task 2 of
> framework 2014-02-12-05:13:06-453759884-58984-23279-0000 for invalid task
> I0212 05:13:06.396955 23369 sched.cpp:616] Scheduler::statusUpdate took
> 12710ns
> I0212 05:13:06.397055 23380 hierarchical_allocator_process.hpp:547]
> Framework 2014-02-12-05:13:06-453759884-58984-23279-0000 left cpus(*):1;
> mem(*):512; disk(*):1024; ports(*):[31000-32000] unused on slave
> 2014-02-12-05:13:06-453759884-58984-23279-0
> I0212 05:13:06.397164 23380 hierarchical_allocator_process.hpp:590]
> Framework 2014-02-12-05:13:06-453759884-58984-23279-0000 filtered slave
> 2014-02-12-05:13:06-453759884-58984-23279-0 for 5secs
> I0212 05:13:06.403065 23379 exec.cpp:131] Version: 0.18.0
> I0212 05:13:06.403214 23369 exec.cpp:181] Executor started at:
> executor(37)@140.211.11.27:58984 with pid 23279
> I0212 05:13:06.403219 23379 slave.cpp:844] Queuing task '1' for executor
> default of framework '2014-02-12-05:13:06-453759884-58984-23279-0000
> I0212 05:13:06.403364 23379 slave.cpp:358] Successfully attached file
> '/tmp/MultipleExecutorsTest_TasksExecutorInfoDiffers_YNqnva/slaves/2014-02-12-05:13:06-453759884-58984-23279-0/frameworks/2014-02-12-05:13:06-453759884-58984-23279-0000/executors/default/runs/4167543b-f737-4d3b-8fa6-278b73f4bbdf'
> I0212 05:13:06.403406 23379 slave.cpp:1989] Monitoring executor 'default'
> of framework '2014-02-12-05:13:06-453759884-58984-23279-0000' in container
> '4167543b-f737-4d3b-8fa6-278b73f4bbdf'
> I0212 05:13:06.403625 23379 slave.cpp:1316] Got registration for executor
> 'default' of framework 2014-02-12-05:13:06-453759884-58984-23279-0000
> I0212 05:13:06.403810 23379 slave.cpp:1434] Flushing queued task 1 for
> executor 'default' of framework
> 2014-02-12-05:13:06-453759884-58984-23279-0000
> I0212 05:13:06.403867 23383 exec.cpp:205] Executor registered on slave
> 2014-02-12-05:13:06-453759884-58984-23279-0
> I0212 05:13:06.405926 23383 exec.cpp:217] Executor::registered took 15714ns
> I0212 05:13:06.405992 23383 exec.cpp:292] Executor asked to run task '1'
> I0212 05:13:06.406031 23383 exec.cpp:301] Executor::launchTask took 28274ns
> I0212 05:13:06.406245 23279 master.cpp:587] Master terminating
> I0212 05:13:06.406282 23387 sched.cpp:727] Stopping framework
> '2014-02-12-05:13:06-453759884-58984-23279-0000'
> I0212 05:13:06.406288 23279 master.cpp:247] Shutting down master
> I0212 05:13:06.406416 23279 master.hpp:429] Removing task 1 with resources
> cpus(*):1; mem(*):512 on slave 2014-02-12-05:13:06-453759884-58984-23279-0 (
> hemera.apache.org)
> I0212 05:13:06.406416 23369 slave.cpp:1844] master@140.211.11.27:58984exited
> W0212 05:13:06.406544 23369 slave.cpp:1847] Master disconnected! Waiting
> for a new master to be elected
> I0212 05:13:06.406739 23279 master.cpp:290] Removing slave
> 2014-02-12-05:13:06-453759884-58984-23279-0 (hemera.apache.org)
> I0212 05:13:06.406802 23367 hierarchical_allocator_process.hpp:637]
> Recovered cpus(*):1; mem(*):512 (total allocatable: cpus(*):2; mem(*):1024;
> disk(*):1024; ports(*):[31000-32000]) on slave
> 2014-02-12-05:13:06-453759884-58984-23279-0 from framework
> 2014-02-12-05:13:06-453759884-58984-23279-0000
> I0212 05:13:06.441829 23279 slave.cpp:287] Slave terminating
> I0212 05:13:06.441854 23279 slave.cpp:1027] Asked to shut down framework
> 2014-02-12-05:13:06-453759884-58984-23279-0000 by @0.0.0.0:0
> I0212 05:13:06.441866 23279 slave.cpp:1052] Shutting down framework
> 2014-02-12-05:13:06-453759884-58984-23279-0000
> I0212 05:13:06.441879 23279 slave.cpp:2332] Shutting down executor
> 'default' of framework 2014-02-12-05:13:06-453759884-58984-23279-0000
> I0212 05:13:06.442039 23373 exec.cpp:378] Executor asked to shutdown
> I0212 05:13:06.442072 23373 exec.cpp:393] Executor::shutdown took 8892ns
> [ OK ] MultipleExecutorsTest.TasksExecutorInfoDiffers (70 ms)
> [----------] 1 test from MultipleExecutorsTest (70 ms total)
>
> [----------] 34 tests from ResourcesTest
> [ RUN ] ResourcesTest.Parsing
> [ OK ] ResourcesTest.Parsing (0 ms)
> [ RUN ] ResourcesTest.ParsingWithRoles
> [ OK ] ResourcesTest.ParsingWithRoles (0 ms)
> [ RUN ] ResourcesTest.ParseError
> [ OK ] ResourcesTest.ParseError (0 ms)
> [ RUN ] ResourcesTest.Resources
> [ OK ] ResourcesTest.Resources (1 ms)
> [ RUN ] ResourcesTest.Printing
> [ OK ] ResourcesTest.Printing (0 ms)
> [ RUN ] ResourcesTest.InitializedIsEmpty
> [ OK ] ResourcesTest.InitializedIsEmpty (0 ms)
> [ RUN ] ResourcesTest.BadResourcesNotAllocatable
> [ OK ] ResourcesTest.BadResourcesNotAllocatable (0 ms)
> [ RUN ] ResourcesTest.ScalarEquals
> [ OK ] ResourcesTest.ScalarEquals (0 ms)
> [ RUN ] ResourcesTest.ScalarSubset
> [ OK ] ResourcesTest.ScalarSubset (0 ms)
> [ RUN ] ResourcesTest.ScalarSubset2
> [ OK ] ResourcesTest.ScalarSubset2 (0 ms)
> [ RUN ] ResourcesTest.ScalarAddition
> [ OK ] ResourcesTest.ScalarAddition (0 ms)
> [ RUN ] ResourcesTest.ScalarAddition2
> [ OK ] ResourcesTest.ScalarAddition2 (0 ms)
> [ RUN ] ResourcesTest.ScalarSubtraction
> [ OK ] ResourcesTest.ScalarSubtraction (0 ms)
> [ RUN ] ResourcesTest.ScalarSubtraction2
> [ OK ] ResourcesTest.ScalarSubtraction2 (0 ms)
> [ RUN ] ResourcesTest.RangesEquals
> [ OK ] ResourcesTest.RangesEquals (0 ms)
> [ RUN ] ResourcesTest.RangesSubset
> [ OK ] ResourcesTest.RangesSubset (0 ms)
> [ RUN ] ResourcesTest.RangesAddition
> [ OK ] ResourcesTest.RangesAddition (0 ms)
> [ RUN ] ResourcesTest.RangesAddition2
> [ OK ] ResourcesTest.RangesAddition2 (0 ms)
> [ RUN ] ResourcesTest.RangesAdditon3
> [ OK ] ResourcesTest.RangesAdditon3 (0 ms)
> [ RUN ] ResourcesTest.RangesAddition4
> [ OK ] ResourcesTest.RangesAddition4 (1 ms)
> [ RUN ] ResourcesTest.RangesSubtraction
> [ OK ] ResourcesTest.RangesSubtraction (0 ms)
> [ RUN ] ResourcesTest.RangesSubtraction1
> [ OK ] ResourcesTest.RangesSubtraction1 (0 ms)
> [ RUN ] ResourcesTest.RangesSubtraction2
> [ OK ] ResourcesTest.RangesSubtraction2 (0 ms)
> [ RUN ] ResourcesTest.RangesSubtraction3
> [ OK ] ResourcesTest.RangesSubtraction3 (0 ms)
> [ RUN ] ResourcesTest.RangesSubtraction4
> [ OK ] ResourcesTest.RangesSubtraction4 (0 ms)
> [ RUN ] ResourcesTest.RangesSubtraction5
> [ OK ] ResourcesTest.RangesSubtraction5 (0 ms)
> [ RUN ] ResourcesTest.RangesSubtraction6
> [ OK ] ResourcesTest.RangesSubtraction6 (0 ms)
> [ RUN ] ResourcesTest.SetEquals
> [ OK ] ResourcesTest.SetEquals (0 ms)
> [ RUN ] ResourcesTest.SetSubset
> [ OK ] ResourcesTest.SetSubset (0 ms)
> [ RUN ] ResourcesTest.SetAddition
> [ OK ] ResourcesTest.SetAddition (0 ms)
> [ RUN ] ResourcesTest.SetSubtraction
> [ OK ] ResourcesTest.SetSubtraction (0 ms)
> [ RUN ] ResourcesTest.EmptyUnequal
> [ OK ] ResourcesTest.EmptyUnequal (0 ms)
> [ RUN ] ResourcesTest.FlattenRoles
> [ OK ] ResourcesTest.FlattenRoles (0 ms)
> [ RUN ] ResourcesTest.Find
> [ OK ] ResourcesTest.Find (1 ms)
> [----------] 34 tests from ResourcesTest (3 ms total)
>
> [----------] 3 tests from SASL
> [ RUN ] SASL.success
> I0212 05:13:06.445623 23382 authenticatee.hpp:124] Creating new client
> SASL connection
> I0212 05:13:06.446563 23374 authenticator.hpp:140] Creating new server
> SASL connection
> I0212 05:13:06.447540 23377 authenticatee.hpp:212] Received SASL
> authentication mechanisms: CRAM-MD5
> I0212 05:13:06.447573 23377 authenticatee.hpp:238] Attempting to
> authenticate with mechanism 'CRAM-MD5'
> I0212 05:13:06.447681 23377 authenticator.hpp:243] Received SASL
> authentication start
> I0212 05:13:06.447798 23377 authenticator.hpp:325] Authentication requires
> more steps
> I0212 05:13:06.447926 23377 authenticatee.hpp:258] Received SASL
> authentication step
> I0212 05:13:06.448007 23377 authenticator.hpp:271] Received SASL
> authentication step
> I0212 05:13:06.448040 23377 auxprop.cpp:81] Request to lookup properties
> for user: 'benh' realm: 'hemera.apache.org' server FQDN: '
> hemera.apache.org' SASL_AUXPROP_VERIFY_AGAINST_HASH: false
> SASL_AUXPROP_OVERRIDE: false SASL_AUXPROP_AUTHZID: false
> I0212 05:13:06.448055 23377 auxprop.cpp:153] Looking up auxiliary property
> '*userPassword'
> I0212 05:13:06.448076 23377 auxprop.cpp:153] Looking up auxiliary property
> '*cmusaslsecretCRAM-MD5'
> I0212 05:13:06.448089 23377 auxprop.cpp:81] Request to lookup properties
> for user: 'benh' realm: 'hemera.apache.org' server FQDN: '
> hemera.apache.org' SASL_AUXPROP_VERIFY_AGAINST_HASH: false
> SASL_AUXPROP_OVERRIDE: false SASL_AUXPROP_AUTHZID: true
> I0212 05:13:06.448110 23377 auxprop.cpp:103] Skipping auxiliary property
> '*userPassword' since SASL_AUXPROP_AUTHZID == true
> I0212 05:13:06.448123 23377 auxprop.cpp:103] Skipping auxiliary property
> '*cmusaslsecretCRAM-MD5' since SASL_AUXPROP_AUTHZID == true
> I0212 05:13:06.448144 23377 authenticator.hpp:317] Authentication success
> I0212 05:13:06.448827 23381 authenticatee.hpp:298] Authentication success
> [ OK ] SASL.success (5 ms)
> [ RUN ] SASL.failed1
> I0212 05:13:06.451129 23376 authenticatee.hpp:124] Creating new client
> SASL connection
> I0212 05:13:06.452395 23376 authenticator.hpp:140] Creating new server
> SASL connection
> I0212 05:13:06.452823 23373 authenticatee.hpp:212] Received SASL
> authentication mechanisms: CRAM-MD5
> I0212 05:13:06.452847 23373 authenticatee.hpp:238] Attempting to
> authenticate with mechanism 'CRAM-MD5'
> I0212 05:13:06.452931 23377 authenticator.hpp:243] Received SASL
> authentication start
> I0212 05:13:06.453129 23377 authenticator.hpp:325] Authentication requires
> more steps
> I0212 05:13:06.453446 23374 authenticatee.hpp:258] Received SASL
> authentication step
> I0212 05:13:06.453614 23376 authenticator.hpp:271] Received SASL
> authentication step
> I0212 05:13:06.453641 23376 auxprop.cpp:81] Request to lookup properties
> for user: 'benh' realm: 'hemera.apache.org' server FQDN: '
> hemera.apache.org' SASL_AUXPROP_VERIFY_AGAINST_HASH: false
> SASL_AUXPROP_OVERRIDE: false SASL_AUXPROP_AUTHZID: false
> I0212 05:13:06.453649 23376 auxprop.cpp:153] Looking up auxiliary property
> '*userPassword'
> I0212 05:13:06.453661 23376 auxprop.cpp:153] Looking up auxiliary property
> '*cmusaslsecretCRAM-MD5'
> I0212 05:13:06.453671 23376 auxprop.cpp:81] Request to lookup properties
> for user: 'benh' realm: 'hemera.apache.org' server FQDN: '
> hemera.apache.org' SASL_AUXPROP_VERIFY_AGAINST_HASH: false
> SASL_AUXPROP_OVERRIDE: false SASL_AUXPROP_AUTHZID: true
> I0212 05:13:06.453680 23376 auxprop.cpp:103] Skipping auxiliary property
> '*userPassword' since SASL_AUXPROP_AUTHZID == true
> I0212 05:13:06.453685 23376 auxprop.cpp:103] Skipping auxiliary property
> '*cmusaslsecretCRAM-MD5' since SASL_AUXPROP_AUTHZID == true
> W0212 05:13:06.453702 23376 authenticator.hpp:331] Authentication failure:
> authentication failure
> [ OK ] SASL.failed1 (4 ms)
> [ RUN ] SASL.failed2
> I0212 05:13:06.454721 23387 authenticatee.hpp:124] Creating new client
> SASL connection
> I0212 05:13:06.455508 23383 authenticator.hpp:140] Creating new server
> SASL connection
> I0212 05:13:06.455739 23384 authenticatee.hpp:212] Received SASL
> authentication mechanisms: CRAM-MD5
> I0212 05:13:06.455822 23384 authenticatee.hpp:238] Attempting to
> authenticate with mechanism 'CRAM-MD5'
> I0212 05:13:06.456053 23378 authenticator.hpp:243] Received SASL
> authentication start
> I0212 05:13:06.456142 23378 authenticator.hpp:325] Authentication requires
> more steps
> I0212 05:13:06.456183 23378 authenticatee.hpp:258] Received SASL
> authentication step
> I0212 05:13:06.456226 23378 authenticator.hpp:271] Received SASL
> authentication step
> I0212 05:13:06.456265 23378 auxprop.cpp:81] Request to lookup properties
> for user: 'benh' realm: 'hemera.apache.org' server FQDN: '
> hemera.apache.org' SASL_AUXPROP_VERIFY_AGAINST_HASH: false
> SASL_AUXPROP_OVERRIDE: false SASL_AUXPROP_AUTHZID: false
> I0212 05:13:06.456275 23378 auxprop.cpp:153] Looking up auxiliary property
> '*userPassword'
> I0212 05:13:06.456282 23378 auxprop.cpp:153] Looking up auxiliary property
> '*cmusaslsecretCRAM-MD5'
> I0212 05:13:06.456290 23378 auxprop.cpp:81] Request to lookup properties
> for user: 'benh' realm: 'hemera.apache.org' server FQDN: '
> hemera.apache.org' SASL_AUXPROP_VERIFY_AGAINST_HASH: false
> SASL_AUXPROP_OVERRIDE: false SASL_AUXPROP_AUTHZID: true
> I0212 05:13:06.456296 23378 auxprop.cpp:103] Skipping auxiliary property
> '*userPassword' since SASL_AUXPROP_AUTHZID == true
> I0212 05:13:06.456302 23378 auxprop.cpp:103] Skipping auxiliary property
> '*cmusaslsecretCRAM-MD5' since SASL_AUXPROP_AUTHZID == true
> W0212 05:13:06.456310 23378 authenticator.hpp:331] Authentication failure:
> user not found
> [ OK ] SASL.failed2 (3 ms)
> [----------] 3 tests from SASL (12 ms total)
>
> [----------] 2 tests from SlaveStateTest
> [ RUN ] SlaveStateTest.CheckpointProtobuf
> Using temporary directory '/tmp/SlaveStateTest_CheckpointProtobuf_fKQnFc'
> [ OK ] SlaveStateTest.CheckpointProtobuf (1 ms)
> [ RUN ] SlaveStateTest.CheckpointString
> Using temporary directory '/tmp/SlaveStateTest_CheckpointString_rIpsPe'
> [ OK ] SlaveStateTest.CheckpointString (0 ms)
> [----------] 2 tests from SlaveStateTest (1 ms total)
>
> [----------] 23 tests from SlaveRecoveryTest/0, where TypeParam =
> mesos::internal::slave::MesosContainerizer
> [ RUN ] SlaveRecoveryTest/0.RecoverSlaveState
> ../../src/tests/mesos.cpp:336: Failure
> cgroups::mount(hierarchy, subsystem): Failed to mount 'freezer' at
> '/tmp/mesos_test_cgroup/freezer': Operation not permitted
> -------------------------------------------------------------
> We cannot run any cgroups tests that require
> a hierarchy with subsystem 'freezer'
> because we failed to find an existing hierarchy
> or create a new one (tried '/tmp/mesos_test_cgroup/freezer').
> You can either remove all existing
> hierarchies, or disable this test case
> (i.e., --gtest_filter=-SlaveRecoveryTest/0.*).
> -------------------------------------------------------------
> F0212 05:13:06.459239 23279 mesos.cpp:362] CHECK_SOME(cgroups):
> '/tmp/mesos_test_cgroup/freezer' is not a valid hierarchy
> *** Check failure stack trace: ***
> @ 0x2b2f61676f1d google::LogMessage::Fail()
> @ 0x2b2f6167901f google::LogMessage::SendToLog()
> @ 0x2b2f61676b0c google::LogMessage::Flush()
> @ 0x2b2f616798bd google::LogMessageFatal::~LogMessageFatal()
> @ 0x4d8add _CheckSome::~_CheckSome()
> @ 0x6fceb4
> mesos::internal::tests::ContainerizerTest<>::TearDown()
> @ 0x851fbd
> testing::internal::HandleExceptionsInMethodIfSupported<>()
> @ 0x84a1f3 testing::Test::Run()
> @ 0x84a326 testing::TestInfo::Run()
> @ 0x84a467 testing::TestCase::Run()
> @ 0x84a7be testing::internal::UnitTestImpl::RunAllTests()
> @ 0x851b3d
> testing::internal::HandleExceptionsInMethodIfSupported<>()
> @ 0x84989e testing::UnitTest::Run()
> @ 0x4b2d2b main
> @ 0x2b2f62a3d76d (unknown)
> @ 0x4bbb81 (unknown)
> make[3]: *** [check-local] Aborted (core dumped)
> make[3]: Leaving directory
> `/x1/jenkins/jenkins-slave/workspace/Mesos-Trunk-Ubuntu-Build-Out-Of-Src-Set-JAVA_HOME/build/src'
> make[2]: *** [check-am] Error 2
> make[2]: Leaving directory
> `/x1/jenkins/jenkins-slave/workspace/Mesos-Trunk-Ubuntu-Build-Out-Of-Src-Set-JAVA_HOME/build/src'
> make[1]: *** [check] Error 2
> make[1]: Leaving directory
> `/x1/jenkins/jenkins-slave/workspace/Mesos-Trunk-Ubuntu-Build-Out-Of-Src-Set-JAVA_HOME/build/src'
> make: *** [check-recursive] Error 1
> Build step 'Execute shell' marked build as failure
>
Build failed in Jenkins:
Mesos-Trunk-Ubuntu-Build-Out-Of-Src-Set-JAVA_HOME #1888
Posted by Apache Jenkins Server <je...@builds.apache.org>.
See <https://builds.apache.org/job/Mesos-Trunk-Ubuntu-Build-Out-Of-Src-Set-JAVA_HOME/1888/changes>
Changes:
[vinod] Fixed build error in make check on src/tests/isolator_tests.cpp.
------------------------------------------
[...truncated 18886 lines...]
I0212 05:13:06.390861 23385 master.cpp:818] Received registration request from scheduler(101)@140.211.11.27:58984
I0212 05:13:06.390993 23385 master.cpp:836] Registering framework 2014-02-12-05:13:06-453759884-58984-23279-0000 at scheduler(101)@140.211.11.27:58984
I0212 05:13:06.391161 23383 sched.cpp:391] Framework registered with 2014-02-12-05:13:06-453759884-58984-23279-0000
I0212 05:13:06.391187 23383 sched.cpp:405] Scheduler::registered took 9192ns
I0212 05:13:06.391401 23372 hierarchical_allocator_process.hpp:332] Added framework 2014-02-12-05:13:06-453759884-58984-23279-0000
I0212 05:13:06.391455 23372 hierarchical_allocator_process.hpp:752] Offering cpus(*):2; mem(*):1024; disk(*):1024; ports(*):[31000-32000] on slave 2014-02-12-05:13:06-453759884-58984-23279-0 to framework 2014-02-12-05:13:06-453759884-58984-23279-0000
I0212 05:13:06.391584 23372 hierarchical_allocator_process.hpp:688] Performed allocation for 1 slaves in 160207ns
I0212 05:13:06.391667 23375 master.hpp:439] Adding offer 2014-02-12-05:13:06-453759884-58984-23279-0 with resources cpus(*):2; mem(*):1024; disk(*):1024; ports(*):[31000-32000] on slave 2014-02-12-05:13:06-453759884-58984-23279-0 (hemera.apache.org)
I0212 05:13:06.391726 23375 master.cpp:2278] Sending 1 offers to framework 2014-02-12-05:13:06-453759884-58984-23279-0000
I0212 05:13:06.391876 23373 sched.cpp:525] Scheduler::resourceOffers took 26384ns
I0212 05:13:06.392393 23389 sched.cpp:898] Attempting to launch task 2 with an unknown offer 2014-02-12-05:13:06-453759884-58984-23279-0
I0212 05:13:06.392658 23380 master.hpp:449] Removing offer 2014-02-12-05:13:06-453759884-58984-23279-0 with resources cpus(*):2; mem(*):1024; disk(*):1024; ports(*):[31000-32000] on slave 2014-02-12-05:13:06-453759884-58984-23279-0 (hemera.apache.org)
I0212 05:13:06.392726 23380 master.cpp:1574] Processing reply for offers: [ 2014-02-12-05:13:06-453759884-58984-23279-0 ] on slave 2014-02-12-05:13:06-453759884-58984-23279-0 (hemera.apache.org) for framework 2014-02-12-05:13:06-453759884-58984-23279-0000
I0212 05:13:06.392802 23380 master.hpp:411] Adding task 1 with resources cpus(*):1; mem(*):512 on slave 2014-02-12-05:13:06-453759884-58984-23279-0 (hemera.apache.org)
I0212 05:13:06.392834 23380 master.cpp:2447] Launching task 1 of framework 2014-02-12-05:13:06-453759884-58984-23279-0000 with resources cpus(*):1; mem(*):512 on slave 2014-02-12-05:13:06-453759884-58984-23279-0 (hemera.apache.org)
I0212 05:13:06.392948 23379 slave.cpp:625] Got assigned task 1 for framework 2014-02-12-05:13:06-453759884-58984-23279-0000
W0212 05:13:06.393010 23380 master.cpp:1608] Failed to validate task 2 : Task has invalid ExecutorInfo (existing ExecutorInfo with same ExecutorID is not compatible).
------------------------------------------------------------
Existing ExecutorInfo:
executor_id {
value: "default"
}
command {
value: "exit 1"
}
framework_id {
value: "2014-02-12-05:13:06-453759884-58984-23279-0000"
}
------------------------------------------------------------
Task's ExecutorInfo:
executor_id {
value: "default"
}
command {
value: "exit 2"
}
framework_id {
value: "2014-02-12-05:13:06-453759884-58984-23279-0000"
}
------------------------------------------------------------
I0212 05:13:06.393178 23379 slave.cpp:734] Launching task 1 for framework 2014-02-12-05:13:06-453759884-58984-23279-0000
I0212 05:13:06.396800 23380 master.cpp:1618] Sending status update TASK_LOST (UUID: 4b8ae1ff-d654-486a-8120-46121cc1c8ed) for task 2 of framework 2014-02-12-05:13:06-453759884-58984-23279-0000 for invalid task
I0212 05:13:06.396955 23369 sched.cpp:616] Scheduler::statusUpdate took 12710ns
I0212 05:13:06.397055 23380 hierarchical_allocator_process.hpp:547] Framework 2014-02-12-05:13:06-453759884-58984-23279-0000 left cpus(*):1; mem(*):512; disk(*):1024; ports(*):[31000-32000] unused on slave 2014-02-12-05:13:06-453759884-58984-23279-0
I0212 05:13:06.397164 23380 hierarchical_allocator_process.hpp:590] Framework 2014-02-12-05:13:06-453759884-58984-23279-0000 filtered slave 2014-02-12-05:13:06-453759884-58984-23279-0 for 5secs
I0212 05:13:06.403065 23379 exec.cpp:131] Version: 0.18.0
I0212 05:13:06.403214 23369 exec.cpp:181] Executor started at: executor(37)@140.211.11.27:58984 with pid 23279
I0212 05:13:06.403219 23379 slave.cpp:844] Queuing task '1' for executor default of framework '2014-02-12-05:13:06-453759884-58984-23279-0000
I0212 05:13:06.403364 23379 slave.cpp:358] Successfully attached file '/tmp/MultipleExecutorsTest_TasksExecutorInfoDiffers_YNqnva/slaves/2014-02-12-05:13:06-453759884-58984-23279-0/frameworks/2014-02-12-05:13:06-453759884-58984-23279-0000/executors/default/runs/4167543b-f737-4d3b-8fa6-278b73f4bbdf'
I0212 05:13:06.403406 23379 slave.cpp:1989] Monitoring executor 'default' of framework '2014-02-12-05:13:06-453759884-58984-23279-0000' in container '4167543b-f737-4d3b-8fa6-278b73f4bbdf'
I0212 05:13:06.403625 23379 slave.cpp:1316] Got registration for executor 'default' of framework 2014-02-12-05:13:06-453759884-58984-23279-0000
I0212 05:13:06.403810 23379 slave.cpp:1434] Flushing queued task 1 for executor 'default' of framework 2014-02-12-05:13:06-453759884-58984-23279-0000
I0212 05:13:06.403867 23383 exec.cpp:205] Executor registered on slave 2014-02-12-05:13:06-453759884-58984-23279-0
I0212 05:13:06.405926 23383 exec.cpp:217] Executor::registered took 15714ns
I0212 05:13:06.405992 23383 exec.cpp:292] Executor asked to run task '1'
I0212 05:13:06.406031 23383 exec.cpp:301] Executor::launchTask took 28274ns
I0212 05:13:06.406245 23279 master.cpp:587] Master terminating
I0212 05:13:06.406282 23387 sched.cpp:727] Stopping framework '2014-02-12-05:13:06-453759884-58984-23279-0000'
I0212 05:13:06.406288 23279 master.cpp:247] Shutting down master
I0212 05:13:06.406416 23279 master.hpp:429] Removing task 1 with resources cpus(*):1; mem(*):512 on slave 2014-02-12-05:13:06-453759884-58984-23279-0 (hemera.apache.org)
I0212 05:13:06.406416 23369 slave.cpp:1844] master@140.211.11.27:58984 exited
W0212 05:13:06.406544 23369 slave.cpp:1847] Master disconnected! Waiting for a new master to be elected
I0212 05:13:06.406739 23279 master.cpp:290] Removing slave 2014-02-12-05:13:06-453759884-58984-23279-0 (hemera.apache.org)
I0212 05:13:06.406802 23367 hierarchical_allocator_process.hpp:637] Recovered cpus(*):1; mem(*):512 (total allocatable: cpus(*):2; mem(*):1024; disk(*):1024; ports(*):[31000-32000]) on slave 2014-02-12-05:13:06-453759884-58984-23279-0 from framework 2014-02-12-05:13:06-453759884-58984-23279-0000
I0212 05:13:06.441829 23279 slave.cpp:287] Slave terminating
I0212 05:13:06.441854 23279 slave.cpp:1027] Asked to shut down framework 2014-02-12-05:13:06-453759884-58984-23279-0000 by @0.0.0.0:0
I0212 05:13:06.441866 23279 slave.cpp:1052] Shutting down framework 2014-02-12-05:13:06-453759884-58984-23279-0000
I0212 05:13:06.441879 23279 slave.cpp:2332] Shutting down executor 'default' of framework 2014-02-12-05:13:06-453759884-58984-23279-0000
I0212 05:13:06.442039 23373 exec.cpp:378] Executor asked to shutdown
I0212 05:13:06.442072 23373 exec.cpp:393] Executor::shutdown took 8892ns
[ OK ] MultipleExecutorsTest.TasksExecutorInfoDiffers (70 ms)
[----------] 1 test from MultipleExecutorsTest (70 ms total)
[----------] 34 tests from ResourcesTest
[ RUN ] ResourcesTest.Parsing
[ OK ] ResourcesTest.Parsing (0 ms)
[ RUN ] ResourcesTest.ParsingWithRoles
[ OK ] ResourcesTest.ParsingWithRoles (0 ms)
[ RUN ] ResourcesTest.ParseError
[ OK ] ResourcesTest.ParseError (0 ms)
[ RUN ] ResourcesTest.Resources
[ OK ] ResourcesTest.Resources (1 ms)
[ RUN ] ResourcesTest.Printing
[ OK ] ResourcesTest.Printing (0 ms)
[ RUN ] ResourcesTest.InitializedIsEmpty
[ OK ] ResourcesTest.InitializedIsEmpty (0 ms)
[ RUN ] ResourcesTest.BadResourcesNotAllocatable
[ OK ] ResourcesTest.BadResourcesNotAllocatable (0 ms)
[ RUN ] ResourcesTest.ScalarEquals
[ OK ] ResourcesTest.ScalarEquals (0 ms)
[ RUN ] ResourcesTest.ScalarSubset
[ OK ] ResourcesTest.ScalarSubset (0 ms)
[ RUN ] ResourcesTest.ScalarSubset2
[ OK ] ResourcesTest.ScalarSubset2 (0 ms)
[ RUN ] ResourcesTest.ScalarAddition
[ OK ] ResourcesTest.ScalarAddition (0 ms)
[ RUN ] ResourcesTest.ScalarAddition2
[ OK ] ResourcesTest.ScalarAddition2 (0 ms)
[ RUN ] ResourcesTest.ScalarSubtraction
[ OK ] ResourcesTest.ScalarSubtraction (0 ms)
[ RUN ] ResourcesTest.ScalarSubtraction2
[ OK ] ResourcesTest.ScalarSubtraction2 (0 ms)
[ RUN ] ResourcesTest.RangesEquals
[ OK ] ResourcesTest.RangesEquals (0 ms)
[ RUN ] ResourcesTest.RangesSubset
[ OK ] ResourcesTest.RangesSubset (0 ms)
[ RUN ] ResourcesTest.RangesAddition
[ OK ] ResourcesTest.RangesAddition (0 ms)
[ RUN ] ResourcesTest.RangesAddition2
[ OK ] ResourcesTest.RangesAddition2 (0 ms)
[ RUN ] ResourcesTest.RangesAdditon3
[ OK ] ResourcesTest.RangesAdditon3 (0 ms)
[ RUN ] ResourcesTest.RangesAddition4
[ OK ] ResourcesTest.RangesAddition4 (1 ms)
[ RUN ] ResourcesTest.RangesSubtraction
[ OK ] ResourcesTest.RangesSubtraction (0 ms)
[ RUN ] ResourcesTest.RangesSubtraction1
[ OK ] ResourcesTest.RangesSubtraction1 (0 ms)
[ RUN ] ResourcesTest.RangesSubtraction2
[ OK ] ResourcesTest.RangesSubtraction2 (0 ms)
[ RUN ] ResourcesTest.RangesSubtraction3
[ OK ] ResourcesTest.RangesSubtraction3 (0 ms)
[ RUN ] ResourcesTest.RangesSubtraction4
[ OK ] ResourcesTest.RangesSubtraction4 (0 ms)
[ RUN ] ResourcesTest.RangesSubtraction5
[ OK ] ResourcesTest.RangesSubtraction5 (0 ms)
[ RUN ] ResourcesTest.RangesSubtraction6
[ OK ] ResourcesTest.RangesSubtraction6 (0 ms)
[ RUN ] ResourcesTest.SetEquals
[ OK ] ResourcesTest.SetEquals (0 ms)
[ RUN ] ResourcesTest.SetSubset
[ OK ] ResourcesTest.SetSubset (0 ms)
[ RUN ] ResourcesTest.SetAddition
[ OK ] ResourcesTest.SetAddition (0 ms)
[ RUN ] ResourcesTest.SetSubtraction
[ OK ] ResourcesTest.SetSubtraction (0 ms)
[ RUN ] ResourcesTest.EmptyUnequal
[ OK ] ResourcesTest.EmptyUnequal (0 ms)
[ RUN ] ResourcesTest.FlattenRoles
[ OK ] ResourcesTest.FlattenRoles (0 ms)
[ RUN ] ResourcesTest.Find
[ OK ] ResourcesTest.Find (1 ms)
[----------] 34 tests from ResourcesTest (3 ms total)
[----------] 3 tests from SASL
[ RUN ] SASL.success
I0212 05:13:06.445623 23382 authenticatee.hpp:124] Creating new client SASL connection
I0212 05:13:06.446563 23374 authenticator.hpp:140] Creating new server SASL connection
I0212 05:13:06.447540 23377 authenticatee.hpp:212] Received SASL authentication mechanisms: CRAM-MD5
I0212 05:13:06.447573 23377 authenticatee.hpp:238] Attempting to authenticate with mechanism 'CRAM-MD5'
I0212 05:13:06.447681 23377 authenticator.hpp:243] Received SASL authentication start
I0212 05:13:06.447798 23377 authenticator.hpp:325] Authentication requires more steps
I0212 05:13:06.447926 23377 authenticatee.hpp:258] Received SASL authentication step
I0212 05:13:06.448007 23377 authenticator.hpp:271] Received SASL authentication step
I0212 05:13:06.448040 23377 auxprop.cpp:81] Request to lookup properties for user: 'benh' realm: 'hemera.apache.org' server FQDN: 'hemera.apache.org' SASL_AUXPROP_VERIFY_AGAINST_HASH: false SASL_AUXPROP_OVERRIDE: false SASL_AUXPROP_AUTHZID: false
I0212 05:13:06.448055 23377 auxprop.cpp:153] Looking up auxiliary property '*userPassword'
I0212 05:13:06.448076 23377 auxprop.cpp:153] Looking up auxiliary property '*cmusaslsecretCRAM-MD5'
I0212 05:13:06.448089 23377 auxprop.cpp:81] Request to lookup properties for user: 'benh' realm: 'hemera.apache.org' server FQDN: 'hemera.apache.org' SASL_AUXPROP_VERIFY_AGAINST_HASH: false SASL_AUXPROP_OVERRIDE: false SASL_AUXPROP_AUTHZID: true
I0212 05:13:06.448110 23377 auxprop.cpp:103] Skipping auxiliary property '*userPassword' since SASL_AUXPROP_AUTHZID == true
I0212 05:13:06.448123 23377 auxprop.cpp:103] Skipping auxiliary property '*cmusaslsecretCRAM-MD5' since SASL_AUXPROP_AUTHZID == true
I0212 05:13:06.448144 23377 authenticator.hpp:317] Authentication success
I0212 05:13:06.448827 23381 authenticatee.hpp:298] Authentication success
[ OK ] SASL.success (5 ms)
[ RUN ] SASL.failed1
I0212 05:13:06.451129 23376 authenticatee.hpp:124] Creating new client SASL connection
I0212 05:13:06.452395 23376 authenticator.hpp:140] Creating new server SASL connection
I0212 05:13:06.452823 23373 authenticatee.hpp:212] Received SASL authentication mechanisms: CRAM-MD5
I0212 05:13:06.452847 23373 authenticatee.hpp:238] Attempting to authenticate with mechanism 'CRAM-MD5'
I0212 05:13:06.452931 23377 authenticator.hpp:243] Received SASL authentication start
I0212 05:13:06.453129 23377 authenticator.hpp:325] Authentication requires more steps
I0212 05:13:06.453446 23374 authenticatee.hpp:258] Received SASL authentication step
I0212 05:13:06.453614 23376 authenticator.hpp:271] Received SASL authentication step
I0212 05:13:06.453641 23376 auxprop.cpp:81] Request to lookup properties for user: 'benh' realm: 'hemera.apache.org' server FQDN: 'hemera.apache.org' SASL_AUXPROP_VERIFY_AGAINST_HASH: false SASL_AUXPROP_OVERRIDE: false SASL_AUXPROP_AUTHZID: false
I0212 05:13:06.453649 23376 auxprop.cpp:153] Looking up auxiliary property '*userPassword'
I0212 05:13:06.453661 23376 auxprop.cpp:153] Looking up auxiliary property '*cmusaslsecretCRAM-MD5'
I0212 05:13:06.453671 23376 auxprop.cpp:81] Request to lookup properties for user: 'benh' realm: 'hemera.apache.org' server FQDN: 'hemera.apache.org' SASL_AUXPROP_VERIFY_AGAINST_HASH: false SASL_AUXPROP_OVERRIDE: false SASL_AUXPROP_AUTHZID: true
I0212 05:13:06.453680 23376 auxprop.cpp:103] Skipping auxiliary property '*userPassword' since SASL_AUXPROP_AUTHZID == true
I0212 05:13:06.453685 23376 auxprop.cpp:103] Skipping auxiliary property '*cmusaslsecretCRAM-MD5' since SASL_AUXPROP_AUTHZID == true
W0212 05:13:06.453702 23376 authenticator.hpp:331] Authentication failure: authentication failure
[ OK ] SASL.failed1 (4 ms)
[ RUN ] SASL.failed2
I0212 05:13:06.454721 23387 authenticatee.hpp:124] Creating new client SASL connection
I0212 05:13:06.455508 23383 authenticator.hpp:140] Creating new server SASL connection
I0212 05:13:06.455739 23384 authenticatee.hpp:212] Received SASL authentication mechanisms: CRAM-MD5
I0212 05:13:06.455822 23384 authenticatee.hpp:238] Attempting to authenticate with mechanism 'CRAM-MD5'
I0212 05:13:06.456053 23378 authenticator.hpp:243] Received SASL authentication start
I0212 05:13:06.456142 23378 authenticator.hpp:325] Authentication requires more steps
I0212 05:13:06.456183 23378 authenticatee.hpp:258] Received SASL authentication step
I0212 05:13:06.456226 23378 authenticator.hpp:271] Received SASL authentication step
I0212 05:13:06.456265 23378 auxprop.cpp:81] Request to lookup properties for user: 'benh' realm: 'hemera.apache.org' server FQDN: 'hemera.apache.org' SASL_AUXPROP_VERIFY_AGAINST_HASH: false SASL_AUXPROP_OVERRIDE: false SASL_AUXPROP_AUTHZID: false
I0212 05:13:06.456275 23378 auxprop.cpp:153] Looking up auxiliary property '*userPassword'
I0212 05:13:06.456282 23378 auxprop.cpp:153] Looking up auxiliary property '*cmusaslsecretCRAM-MD5'
I0212 05:13:06.456290 23378 auxprop.cpp:81] Request to lookup properties for user: 'benh' realm: 'hemera.apache.org' server FQDN: 'hemera.apache.org' SASL_AUXPROP_VERIFY_AGAINST_HASH: false SASL_AUXPROP_OVERRIDE: false SASL_AUXPROP_AUTHZID: true
I0212 05:13:06.456296 23378 auxprop.cpp:103] Skipping auxiliary property '*userPassword' since SASL_AUXPROP_AUTHZID == true
I0212 05:13:06.456302 23378 auxprop.cpp:103] Skipping auxiliary property '*cmusaslsecretCRAM-MD5' since SASL_AUXPROP_AUTHZID == true
W0212 05:13:06.456310 23378 authenticator.hpp:331] Authentication failure: user not found
[ OK ] SASL.failed2 (3 ms)
[----------] 3 tests from SASL (12 ms total)
[----------] 2 tests from SlaveStateTest
[ RUN ] SlaveStateTest.CheckpointProtobuf
Using temporary directory '/tmp/SlaveStateTest_CheckpointProtobuf_fKQnFc'
[ OK ] SlaveStateTest.CheckpointProtobuf (1 ms)
[ RUN ] SlaveStateTest.CheckpointString
Using temporary directory '/tmp/SlaveStateTest_CheckpointString_rIpsPe'
[ OK ] SlaveStateTest.CheckpointString (0 ms)
[----------] 2 tests from SlaveStateTest (1 ms total)
[----------] 23 tests from SlaveRecoveryTest/0, where TypeParam = mesos::internal::slave::MesosContainerizer
[ RUN ] SlaveRecoveryTest/0.RecoverSlaveState
../../src/tests/mesos.cpp:336: Failure
cgroups::mount(hierarchy, subsystem): Failed to mount 'freezer' at '/tmp/mesos_test_cgroup/freezer': Operation not permitted
-------------------------------------------------------------
We cannot run any cgroups tests that require
a hierarchy with subsystem 'freezer'
because we failed to find an existing hierarchy
or create a new one (tried '/tmp/mesos_test_cgroup/freezer').
You can either remove all existing
hierarchies, or disable this test case
(i.e., --gtest_filter=-SlaveRecoveryTest/0.*).
-------------------------------------------------------------
F0212 05:13:06.459239 23279 mesos.cpp:362] CHECK_SOME(cgroups): '/tmp/mesos_test_cgroup/freezer' is not a valid hierarchy
*** Check failure stack trace: ***
@ 0x2b2f61676f1d google::LogMessage::Fail()
@ 0x2b2f6167901f google::LogMessage::SendToLog()
@ 0x2b2f61676b0c google::LogMessage::Flush()
@ 0x2b2f616798bd google::LogMessageFatal::~LogMessageFatal()
@ 0x4d8add _CheckSome::~_CheckSome()
@ 0x6fceb4 mesos::internal::tests::ContainerizerTest<>::TearDown()
@ 0x851fbd testing::internal::HandleExceptionsInMethodIfSupported<>()
@ 0x84a1f3 testing::Test::Run()
@ 0x84a326 testing::TestInfo::Run()
@ 0x84a467 testing::TestCase::Run()
@ 0x84a7be testing::internal::UnitTestImpl::RunAllTests()
@ 0x851b3d testing::internal::HandleExceptionsInMethodIfSupported<>()
@ 0x84989e testing::UnitTest::Run()
@ 0x4b2d2b main
@ 0x2b2f62a3d76d (unknown)
@ 0x4bbb81 (unknown)
make[3]: *** [check-local] Aborted (core dumped)
make[3]: Leaving directory `/x1/jenkins/jenkins-slave/workspace/Mesos-Trunk-Ubuntu-Build-Out-Of-Src-Set-JAVA_HOME/build/src'
make[2]: *** [check-am] Error 2
make[2]: Leaving directory `/x1/jenkins/jenkins-slave/workspace/Mesos-Trunk-Ubuntu-Build-Out-Of-Src-Set-JAVA_HOME/build/src'
make[1]: *** [check] Error 2
make[1]: Leaving directory `/x1/jenkins/jenkins-slave/workspace/Mesos-Trunk-Ubuntu-Build-Out-Of-Src-Set-JAVA_HOME/build/src'
make: *** [check-recursive] Error 1
Build step 'Execute shell' marked build as failure