You are viewing a plain text version of this content. The canonical link for it is here.
Posted to builds@beam.apache.org by Apache Jenkins Server <je...@builds.apache.org> on 2020/03/05 03:04:34 UTC

Build failed in Jenkins: beam_PostCommit_Python36 #1895

See <https://builds.apache.org/job/beam_PostCommit_Python36/1895/display/redirect?page=changes>

Changes:

[github] Update container image tags used by Dataflow runner for Beam master


------------------------------------------
[...truncated 112.58 KB...]
	... 23 more
Failed to execute org.gradle.cache.internal.AsyncCacheAccessDecoratedCache$2@3ffa636e.
org.gradle.api.UncheckedIOException: Could not add entry '<https://builds.apache.org/job/beam_PostCommit_Python36/ws/src/runners/flink/1.9/job-server/build'> to cache outputFiles.bin (<https://builds.apache.org/job/beam_PostCommit_Python36/ws/src/.gradle/buildOutputCleanup/outputFiles.bin).>
	at org.gradle.cache.internal.btree.BTreePersistentIndexedCache.put(BTreePersistentIndexedCache.java:160)
	at org.gradle.cache.internal.DefaultMultiProcessSafePersistentIndexedCache$2.run(DefaultMultiProcessSafePersistentIndexedCache.java:72)
	at org.gradle.cache.internal.DefaultFileLockManager$DefaultFileLock.doWriteAction(DefaultFileLockManager.java:207)
	at org.gradle.cache.internal.DefaultFileLockManager$DefaultFileLock.writeFile(DefaultFileLockManager.java:197)
	at org.gradle.cache.internal.DefaultCacheAccess$UnitOfWorkFileAccess.writeFile(DefaultCacheAccess.java:412)
	at org.gradle.cache.internal.DefaultMultiProcessSafePersistentIndexedCache.put(DefaultMultiProcessSafePersistentIndexedCache.java:70)
	at org.gradle.cache.internal.AsyncCacheAccessDecoratedCache$2.run(AsyncCacheAccessDecoratedCache.java:64)
	at org.gradle.internal.concurrent.ExecutorPolicy$CatchAndRecordFailures.onExecute(ExecutorPolicy.java:63)
	at org.gradle.cache.internal.CacheAccessWorker$2.run(CacheAccessWorker.java:184)
	at org.gradle.internal.Factories$1.create(Factories.java:25)
	at org.gradle.cache.internal.DefaultCacheAccess.useCache(DefaultCacheAccess.java:223)
	at org.gradle.cache.internal.DefaultCacheAccess.useCache(DefaultCacheAccess.java:204)
	at org.gradle.cache.internal.CacheAccessWorker.flushOperations(CacheAccessWorker.java:174)
	at org.gradle.cache.internal.CacheAccessWorker.run(CacheAccessWorker.java:144)
	at org.gradle.internal.concurrent.ExecutorPolicy$CatchAndRecordFailures.onExecute(ExecutorPolicy.java:63)
	at org.gradle.internal.concurrent.ManagedExecutorImpl$1.run(ManagedExecutorImpl.java:46)
	at java.util.concurrent.ThreadPoolExecutor.runWorker(ThreadPoolExecutor.java:1149)
	at java.util.concurrent.ThreadPoolExecutor$Worker.run(ThreadPoolExecutor.java:624)
	at org.gradle.internal.concurrent.ThreadFactoryImpl$ManagedThreadRunnable.run(ThreadFactoryImpl.java:55)
	at java.lang.Thread.run(Thread.java:748)
Caused by: org.gradle.api.UncheckedIOException: java.io.IOException: No space left on device
	at org.gradle.cache.internal.btree.FileBackedBlockStore.write(FileBackedBlockStore.java:118)
	at org.gradle.cache.internal.btree.CachingBlockStore.flush(CachingBlockStore.java:60)
	at org.gradle.cache.internal.btree.FreeListBlockStore.flush(FreeListBlockStore.java:92)
	at org.gradle.cache.internal.btree.StateCheckBlockStore.flush(StateCheckBlockStore.java:76)
	at org.gradle.cache.internal.btree.BTreePersistentIndexedCache.put(BTreePersistentIndexedCache.java:158)
	... 19 more
Caused by: java.io.IOException: No space left on device
	at java.io.RandomAccessFile.writeBytes(Native Method)
	at java.io.RandomAccessFile.write(RandomAccessFile.java:525)
	at org.gradle.internal.io.RandomAccessFileOutputStream.write(RandomAccessFileOutputStream.java:46)
	at java.io.BufferedOutputStream.flushBuffer(BufferedOutputStream.java:82)
	at java.io.BufferedOutputStream.flush(BufferedOutputStream.java:140)
	at java.io.FilterOutputStream.flush(FilterOutputStream.java:140)
	at org.gradle.cache.internal.btree.ByteOutput.done(ByteOutput.java:62)
	at org.gradle.cache.internal.btree.FileBackedBlockStore$BlockImpl.write(FileBackedBlockStore.java:200)
	at org.gradle.cache.internal.btree.FileBackedBlockStore.write(FileBackedBlockStore.java:114)
	... 23 more
Failed to execute org.gradle.cache.internal.AsyncCacheAccessDecoratedCache$2@4d92b06c.
org.gradle.api.UncheckedIOException: Could not add entry '<https://builds.apache.org/job/beam_PostCommit_Python36/ws/src/runners/flink/1.9/job-server'> to cache outputFiles.bin (<https://builds.apache.org/job/beam_PostCommit_Python36/ws/src/.gradle/buildOutputCleanup/outputFiles.bin).>
	at org.gradle.cache.internal.btree.BTreePersistentIndexedCache.put(BTreePersistentIndexedCache.java:160)
	at org.gradle.cache.internal.DefaultMultiProcessSafePersistentIndexedCache$2.run(DefaultMultiProcessSafePersistentIndexedCache.java:72)
	at org.gradle.cache.internal.DefaultFileLockManager$DefaultFileLock.doWriteAction(DefaultFileLockManager.java:207)
	at org.gradle.cache.internal.DefaultFileLockManager$DefaultFileLock.writeFile(DefaultFileLockManager.java:197)
	at org.gradle.cache.internal.DefaultCacheAccess$UnitOfWorkFileAccess.writeFile(DefaultCacheAccess.java:412)
	at org.gradle.cache.internal.DefaultMultiProcessSafePersistentIndexedCache.put(DefaultMultiProcessSafePersistentIndexedCache.java:70)
	at org.gradle.cache.internal.AsyncCacheAccessDecoratedCache$2.run(AsyncCacheAccessDecoratedCache.java:64)
	at org.gradle.internal.concurrent.ExecutorPolicy$CatchAndRecordFailures.onExecute(ExecutorPolicy.java:63)
	at org.gradle.cache.internal.CacheAccessWorker$2.run(CacheAccessWorker.java:184)
	at org.gradle.internal.Factories$1.create(Factories.java:25)
	at org.gradle.cache.internal.DefaultCacheAccess.useCache(DefaultCacheAccess.java:223)
	at org.gradle.cache.internal.DefaultCacheAccess.useCache(DefaultCacheAccess.java:204)
	at org.gradle.cache.internal.CacheAccessWorker.flushOperations(CacheAccessWorker.java:174)
	at org.gradle.cache.internal.CacheAccessWorker.run(CacheAccessWorker.java:144)
	at org.gradle.internal.concurrent.ExecutorPolicy$CatchAndRecordFailures.onExecute(ExecutorPolicy.java:63)
	at org.gradle.internal.concurrent.ManagedExecutorImpl$1.run(ManagedExecutorImpl.java:46)
	at java.util.concurrent.ThreadPoolExecutor.runWorker(ThreadPoolExecutor.java:1149)
	at java.util.concurrent.ThreadPoolExecutor$Worker.run(ThreadPoolExecutor.java:624)
	at org.gradle.internal.concurrent.ThreadFactoryImpl$ManagedThreadRunnable.run(ThreadFactoryImpl.java:55)
	at java.lang.Thread.run(Thread.java:748)
Caused by: org.gradle.api.UncheckedIOException: java.io.IOException: No space left on device
	at org.gradle.cache.internal.btree.FileBackedBlockStore.write(FileBackedBlockStore.java:118)
	at org.gradle.cache.internal.btree.CachingBlockStore.flush(CachingBlockStore.java:60)
	at org.gradle.cache.internal.btree.FreeListBlockStore.flush(FreeListBlockStore.java:92)
	at org.gradle.cache.internal.btree.StateCheckBlockStore.flush(StateCheckBlockStore.java:76)
	at org.gradle.cache.internal.btree.BTreePersistentIndexedCache.put(BTreePersistentIndexedCache.java:158)
	... 19 more
Caused by: java.io.IOException: No space left on device
	at java.io.RandomAccessFile.writeBytes(Native Method)
	at java.io.RandomAccessFile.write(RandomAccessFile.java:525)
	at org.gradle.internal.io.RandomAccessFileOutputStream.write(RandomAccessFileOutputStream.java:46)
	at java.io.BufferedOutputStream.flushBuffer(BufferedOutputStream.java:82)
	at java.io.BufferedOutputStream.flush(BufferedOutputStream.java:140)
	at java.io.FilterOutputStream.flush(FilterOutputStream.java:140)
	at org.gradle.cache.internal.btree.ByteOutput.done(ByteOutput.java:62)
	at org.gradle.cache.internal.btree.FileBackedBlockStore$BlockImpl.write(FileBackedBlockStore.java:200)
	at org.gradle.cache.internal.btree.FileBackedBlockStore.write(FileBackedBlockStore.java:114)
	... 23 more
Failed to execute org.gradle.cache.internal.AsyncCacheAccessDecoratedCache$2@783782d2.
org.gradle.api.UncheckedIOException: Could not add entry '<https://builds.apache.org/job/beam_PostCommit_Python36/ws/src/runners/flink/1.9/job-server/build/libs/beam-runners-flink-1.9-job-server-2.21.0-SNAPSHOT.jar'> to cache outputFiles.bin (<https://builds.apache.org/job/beam_PostCommit_Python36/ws/src/.gradle/buildOutputCleanup/outputFiles.bin).>
	at org.gradle.cache.internal.btree.BTreePersistentIndexedCache.put(BTreePersistentIndexedCache.java:160)
	at org.gradle.cache.internal.DefaultMultiProcessSafePersistentIndexedCache$2.run(DefaultMultiProcessSafePersistentIndexedCache.java:72)
	at org.gradle.cache.internal.DefaultFileLockManager$DefaultFileLock.doWriteAction(DefaultFileLockManager.java:207)
	at org.gradle.cache.internal.DefaultFileLockManager$DefaultFileLock.writeFile(DefaultFileLockManager.java:197)
	at org.gradle.cache.internal.DefaultCacheAccess$UnitOfWorkFileAccess.writeFile(DefaultCacheAccess.java:412)
	at org.gradle.cache.internal.DefaultMultiProcessSafePersistentIndexedCache.put(DefaultMultiProcessSafePersistentIndexedCache.java:70)
	at org.gradle.cache.internal.AsyncCacheAccessDecoratedCache$2.run(AsyncCacheAccessDecoratedCache.java:64)
	at org.gradle.internal.concurrent.ExecutorPolicy$CatchAndRecordFailures.onExecute(ExecutorPolicy.java:63)
	at org.gradle.cache.internal.CacheAccessWorker$2.run(CacheAccessWorker.java:184)
	at org.gradle.internal.Factories$1.create(Factories.java:25)
	at org.gradle.cache.internal.DefaultCacheAccess.useCache(DefaultCacheAccess.java:223)
	at org.gradle.cache.internal.DefaultCacheAccess.useCache(DefaultCacheAccess.java:204)
	at org.gradle.cache.internal.CacheAccessWorker.flushOperations(CacheAccessWorker.java:174)
	at org.gradle.cache.internal.CacheAccessWorker.run(CacheAccessWorker.java:144)
	at org.gradle.internal.concurrent.ExecutorPolicy$CatchAndRecordFailures.onExecute(ExecutorPolicy.java:63)
	at org.gradle.internal.concurrent.ManagedExecutorImpl$1.run(ManagedExecutorImpl.java:46)
	at java.util.concurrent.ThreadPoolExecutor.runWorker(ThreadPoolExecutor.java:1149)
	at java.util.concurrent.ThreadPoolExecutor$Worker.run(ThreadPoolExecutor.java:624)
	at org.gradle.internal.concurrent.ThreadFactoryImpl$ManagedThreadRunnable.run(ThreadFactoryImpl.java:55)
	at java.lang.Thread.run(Thread.java:748)
Caused by: org.gradle.cache.internal.btree.CorruptedCacheException: Corrupted DataBlock 24581 found in cache '<https://builds.apache.org/job/beam_PostCommit_Python36/ws/src/.gradle/buildOutputCleanup/outputFiles.bin'.>
	at org.gradle.cache.internal.btree.FileBackedBlockStore$BlockImpl.blockCorruptedException(FileBackedBlockStore.java:243)
	at org.gradle.cache.internal.btree.FileBackedBlockStore$BlockImpl.read(FileBackedBlockStore.java:213)
	at org.gradle.cache.internal.btree.FileBackedBlockStore.read(FileBackedBlockStore.java:102)
	at org.gradle.cache.internal.btree.CachingBlockStore.read(CachingBlockStore.java:92)
	at org.gradle.cache.internal.btree.FreeListBlockStore.read(FreeListBlockStore.java:78)
	at org.gradle.cache.internal.btree.StateCheckBlockStore.read(StateCheckBlockStore.java:61)
	at org.gradle.cache.internal.btree.BTreePersistentIndexedCache.put(BTreePersistentIndexedCache.java:145)
	... 19 more

FAILURE: Build completed with 4 failures.

1: Task failed with an exception.
-----------
* What went wrong:
Execution failed for task ':sdks:python:test-suites:portable:py36:setupVirtualenv'.
> Process 'command 'sh'' finished with non-zero exit value 1

* Try:
Run with --stacktrace option to get the stack trace. Run with --info or --debug option to get more log output. Run with --scan to get full insights.
==============================================================================

2: Task failed with an exception.
-----------
* What went wrong:
Execution failed for task ':sdks:python:test-suites:direct:py36:setupVirtualenv'.
> Process 'command 'sh'' finished with non-zero exit value 1

* Try:
Run with --stacktrace option to get the stack trace. Run with --info or --debug option to get more log output. Run with --scan to get full insights.
==============================================================================

3: Task failed with an exception.
-----------
* What went wrong:
Execution failed for task ':sdks:python:test-suites:dataflow:py36:setupVirtualenv'.
> Process 'command 'sh'' finished with non-zero exit value 1

* Try:
Run with --stacktrace option to get the stack trace. Run with --info or --debug option to get more log output. Run with --scan to get full insights.
==============================================================================

4: Task failed with an exception.
-----------
* What went wrong:
Execution failed for task ':sdks:python:setupVirtualenv'.
> Process 'command 'sh'' finished with non-zero exit value 1

* Try:
Run with --stacktrace option to get the stack trace. Run with --info or --debug option to get more log output. Run with --scan to get full insights.
==============================================================================

* Get more help at https://help.gradle.org

Deprecated Gradle features were used in this build, making it incompatible with Gradle 6.0.
Use '--warning-mode all' to show the individual deprecation warnings.
See https://docs.gradle.org/5.2.1/userguide/command_line_interface.html#sec:command_line_warnings

BUILD FAILED in 1m 5s
76 actionable tasks: 54 executed, 22 from cache

A build scan cannot be produced as an error occurred spooling the build data.
Please report this problem via https://gradle.com/scans/help/plugin and include the following via copy/paste:

----------
Gradle version: 5.2.1
Plugin version: 2.3

java.lang.IllegalStateException: java.io.IOException: No space left on device
	at com.gradle.scan.a.e.b.flush(SourceFile:233)
	at com.gradle.scan.a.e.b.close(SourceFile:244)
	at com.gradle.scan.a.e.c.close(SourceFile:66)
	at com.gradle.scan.plugin.internal.n.a(SourceFile:78)
	at com.gradle.scan.plugin.internal.e.c.c.b(SourceFile:125)
	at com.gradle.scan.plugin.internal.e.c.c.a(SourceFile:117)
	at com.gradle.scan.plugin.internal.o.a$a.a(SourceFile:30)
	at com.gradle.scan.plugin.internal.o.a$a.a(SourceFile:19)
	at com.gradle.scan.plugin.internal.o.a.c(SourceFile:60)
Caused by: java.io.IOException: No space left on device
	at com.gradle.scan.a.e.b.flush(SourceFile:231)
	... 8 more

----------

Could not stop Service ExecutionHistoryCacheAccess at ExecutionServices.createCacheAccess().
org.gradle.api.UncheckedIOException: Could not add entry ':runners:spark:job-server:shadowJar' to cache executionHistory.bin (<https://builds.apache.org/job/beam_PostCommit_Python36/ws/src/.gradle/5.2.1/executionHistory/executionHistory.bin).>
	at org.gradle.cache.internal.btree.BTreePersistentIndexedCache.put(BTreePersistentIndexedCache.java:160)
	at org.gradle.cache.internal.DefaultMultiProcessSafePersistentIndexedCache$2.run(DefaultMultiProcessSafePersistentIndexedCache.java:72)
	at org.gradle.cache.internal.DefaultFileLockManager$DefaultFileLock.doWriteAction(DefaultFileLockManager.java:207)
	at org.gradle.cache.internal.DefaultFileLockManager$DefaultFileLock.writeFile(DefaultFileLockManager.java:197)
	at org.gradle.cache.internal.DefaultCacheAccess$UnitOfWorkFileAccess.writeFile(DefaultCacheAccess.java:412)
	at org.gradle.cache.internal.DefaultMultiProcessSafePersistentIndexedCache.put(DefaultMultiProcessSafePersistentIndexedCache.java:70)
	at org.gradle.cache.internal.AsyncCacheAccessDecoratedCache$2.run(AsyncCacheAccessDecoratedCache.java:64)
	at org.gradle.internal.concurrent.ExecutorPolicy$CatchAndRecordFailures.onExecute(ExecutorPolicy.java:63)
	at org.gradle.cache.internal.CacheAccessWorker$2.run(CacheAccessWorker.java:179)
	at org.gradle.internal.Factories$1.create(Factories.java:25)
	at org.gradle.cache.internal.DefaultCacheAccess.useCache(DefaultCacheAccess.java:223)
	at org.gradle.cache.internal.DefaultCacheAccess.useCache(DefaultCacheAccess.java:204)
	at org.gradle.cache.internal.CacheAccessWorker.flushOperations(CacheAccessWorker.java:174)
	at org.gradle.cache.internal.CacheAccessWorker.run(CacheAccessWorker.java:144)
	at org.gradle.internal.concurrent.ExecutorPolicy$CatchAndRecordFailures.onExecute(ExecutorPolicy.java:63)
	at org.gradle.internal.concurrent.ManagedExecutorImpl$1.run(ManagedExecutorImpl.java:46)
	at java.util.concurrent.ThreadPoolExecutor.runWorker(ThreadPoolExecutor.java:1149)
	at java.util.concurrent.ThreadPoolExecutor$Worker.run(ThreadPoolExecutor.java:624)
	at org.gradle.internal.concurrent.ThreadFactoryImpl$ManagedThreadRunnable.run(ThreadFactoryImpl.java:55)
	at java.lang.Thread.run(Thread.java:748)
Caused by: org.gradle.api.UncheckedIOException: java.io.IOException: No space left on device
	at org.gradle.cache.internal.btree.FileBackedBlockStore.write(FileBackedBlockStore.java:118)
	at org.gradle.cache.internal.btree.CachingBlockStore.flush(CachingBlockStore.java:60)
	at org.gradle.cache.internal.btree.FreeListBlockStore.flush(FreeListBlockStore.java:92)
	at org.gradle.cache.internal.btree.StateCheckBlockStore.flush(StateCheckBlockStore.java:76)
	at org.gradle.cache.internal.btree.BTreePersistentIndexedCache.put(BTreePersistentIndexedCache.java:158)
	... 19 more
Caused by: java.io.IOException: No space left on device
	at java.io.RandomAccessFile.writeBytes(Native Method)
	at java.io.RandomAccessFile.write(RandomAccessFile.java:525)
	at org.gradle.internal.io.RandomAccessFileOutputStream.write(RandomAccessFileOutputStream.java:46)
	at java.io.BufferedOutputStream.flushBuffer(BufferedOutputStream.java:82)
	at java.io.BufferedOutputStream.write(BufferedOutputStream.java:126)
	at com.google.common.io.CountingOutputStream.write(CountingOutputStream.java:53)
	at java.io.DataOutputStream.write(DataOutputStream.java:107)
	at org.gradle.internal.io.StreamByteBuffer$StreamByteBufferChunk.writeTo(StreamByteBuffer.java:356)
	at org.gradle.internal.io.StreamByteBuffer.writeTo(StreamByteBuffer.java:104)
	at org.gradle.cache.internal.btree.BTreePersistentIndexedCache$DataBlock.write(BTreePersistentIndexedCache.java:700)
	at org.gradle.cache.internal.btree.FileBackedBlockStore$BlockImpl.write(FileBackedBlockStore.java:192)
	at org.gradle.cache.internal.btree.FileBackedBlockStore.write(FileBackedBlockStore.java:114)
	... 23 more

FAILURE: Build failed with an exception.

* What went wrong:
Could not add entry '<https://builds.apache.org/job/beam_PostCommit_Python36/ws/src/runners/google-cloud-dataflow-java/worker/build/libs'> to cache outputFiles.bin (<https://builds.apache.org/job/beam_PostCommit_Python36/ws/src/.gradle/buildOutputCleanup/outputFiles.bin).>
> java.io.IOException: No space left on device

* Try:
Run with --stacktrace option to get the stack trace. Run with --info or --debug option to get more log output. Run with --scan to get full insights.

* Get more help at https://help.gradle.org

Deprecated Gradle features were used in this build, making it incompatible with Gradle 6.0.
Use '--warning-mode all' to show the individual deprecation warnings.
See https://docs.gradle.org/5.2.1/userguide/command_line_interface.html#sec:command_line_warnings

BUILD FAILED in 1m 6s
Build step 'Invoke Gradle script' changed build result to FAILURE
Build step 'Invoke Gradle script' marked build as failure

---------------------------------------------------------------------
To unsubscribe, e-mail: builds-unsubscribe@beam.apache.org
For additional commands, e-mail: builds-help@beam.apache.org


Jenkins build is back to normal : beam_PostCommit_Python36 #1901

Posted by Apache Jenkins Server <je...@builds.apache.org>.
See <https://builds.apache.org/job/beam_PostCommit_Python36/1901/display/redirect>


---------------------------------------------------------------------
To unsubscribe, e-mail: builds-unsubscribe@beam.apache.org
For additional commands, e-mail: builds-help@beam.apache.org


Build failed in Jenkins: beam_PostCommit_Python36 #1900

Posted by Apache Jenkins Server <je...@builds.apache.org>.
See <https://builds.apache.org/job/beam_PostCommit_Python36/1900/display/redirect?page=changes>

Changes:

[github] Add integration test for AnnotateVideoWithContext transform (#10986)


------------------------------------------
[...truncated 5.10 MB...]
                },
                {
                  "@type": "kind:global_window"
                }
              ],
              "is_wrapper": true
            },
            "output_name": "None",
            "user_name": "m_out.out"
          }
        ],
        "parallel_input": {
          "@type": "OutputReference",
          "output_name": "out",
          "step_name": "s4"
        },
        "serialized_fn": "eNqFVOlz3DQU9+7mqhsgLeW+yr0BakMD5SotsKEHhm3HzUz9JaORJe2uElnyk+RuM8POwDDp8pX/gj+TZ2XTaQqF8dh+h97v3fq112e0pmwiSClolXhLtRsZW7mEGSviAVWKlkrctbSuhd0213QM0eZv0JlBt1/0oigiIw09xqVSCWm/MWFWUC/IqNHMS4MGS/0TemUoJ/6gFjEsF2sIMTBc7CAPK4ewmsNaP+tkEb5xdmdwkXd4l/f4El/20V5nr8tXfol+7y7o1cfp8dqdCE71h2jdzXrZUrZcLKEHo5mAuFhG0k8l0qc9rAdNmzY8VawgWd+jqhHwdLGOzA4djwW/1fi68fDMHDaKDkrvw5lDOFv8iWQ6MZVI94Tel9od/y84Re+JdGrsvsOyirSFJ7eN8wNTVdKT2wd+YvTWpdRZljq+79I6SNJHupDaRmthXcqppyNlpg8JIu4Ly6QTpBLeSuZILWuhpBZJfQDPhmJeVrQqOb0C57K/BhtRp/vwWccHntvc9PB8Di+caMlYeEK9tzG8GEDKRiqP+cBLxSqyqG618PIDeCWHV0+Yyqo21pPK8EZhR18rrqLBozO1yCY5TiL5/2zg9UN4I4fzIRaCjpgnBN58AG/l8Pbk3HA4g3eK062uHSMykdo7ePffhlDTSnDf1G1o7wWTm7faUbsRTN4PEqmxxwHJQT8034S2L0SbYTiMlWOp4YM5fFicfyzD9lyIIeEC14Z6Yx18NIcLOSTD4S6kc/g4h0/c0MPFHLaCC1wPXC07drVg8OkwlLm2hgnn4LPJ1j+yuzQJUJ/P4YscvmzKXfhqBl/vwuX/3N+7UnMzlXocwze4tVdmcLUfijoNClzdb59kf3Qivq5MSdURjovhO0T5vjjV7hEWZCwsQgyeBLE4Em+LEW2U31mwsI0gPxRn2ioy1lSNou090Y6QgGtZp9hoNQonRHCCOqHbolw/4aXxUqEDWQnnaVXH242lR5fNDQS/OYMfQ9cqyaxxkGWRK4uzbdTHFoSZqsRRs/ATegzVlo7wo0jh5z+a0sMw+RtbN623",
        "user_name": "m_out"
      }
    }
  ],
  "type": "JOB_TYPE_BATCH"
}
INFO:apache_beam.runners.dataflow.internal.apiclient:Create job: <Job
 createTime: '2020-03-05T12:32:25.443107Z'
 currentStateTime: '1970-01-01T00:00:00Z'
 id: '2020-03-05_04_32_24-11813593093904821578'
 location: 'us-central1'
 name: 'beamapp-jenkins-0305123207-683069'
 projectId: 'apache-beam-testing'
 stageStates: []
 startTime: '2020-03-05T12:32:25.443107Z'
 steps: []
 tempFiles: []
 type: TypeValueValuesEnum(JOB_TYPE_BATCH, 1)>
INFO:apache_beam.runners.dataflow.internal.apiclient:Created job with id: [2020-03-05_04_32_24-11813593093904821578]
INFO:apache_beam.runners.dataflow.internal.apiclient:To access the Dataflow monitoring console, please navigate to https://console.cloud.google.com/dataflow/jobs/us-central1/2020-03-05_04_32_24-11813593093904821578?project=apache-beam-testing
INFO:apache_beam.runners.dataflow.dataflow_runner:Job 2020-03-05_04_32_24-11813593093904821578 is in state JOB_STATE_RUNNING
INFO:apache_beam.runners.dataflow.dataflow_runner:2020-03-05T12:32:24.423Z: JOB_MESSAGE_DETAILED: Autoscaling was automatically enabled for job 2020-03-05_04_32_24-11813593093904821578.
INFO:apache_beam.runners.dataflow.dataflow_runner:2020-03-05T12:32:24.423Z: JOB_MESSAGE_DETAILED: Autoscaling is enabled for job 2020-03-05_04_32_24-11813593093904821578. The number of workers will be between 1 and 1000.
INFO:apache_beam.runners.dataflow.dataflow_runner:2020-03-05T12:32:27.663Z: JOB_MESSAGE_DETAILED: Checking permissions granted to controller Service Account.
INFO:apache_beam.runners.dataflow.dataflow_runner:2020-03-05T12:32:28.764Z: JOB_MESSAGE_BASIC: Worker configuration: n1-standard-1 in us-central1-c.
INFO:apache_beam.runners.dataflow.dataflow_runner:2020-03-05T12:32:29.400Z: JOB_MESSAGE_DETAILED: Expanding CoGroupByKey operations into optimizable parts.
INFO:apache_beam.runners.dataflow.dataflow_runner:2020-03-05T12:32:29.429Z: JOB_MESSAGE_DEBUG: Combiner lifting skipped for step GroupByKey: GroupByKey not followed by a combiner.
INFO:apache_beam.runners.dataflow.dataflow_runner:2020-03-05T12:32:29.475Z: JOB_MESSAGE_DETAILED: Expanding GroupByKey operations into optimizable parts.
INFO:apache_beam.runners.dataflow.dataflow_runner:2020-03-05T12:32:29.520Z: JOB_MESSAGE_DETAILED: Lifting ValueCombiningMappingFns into MergeBucketsMappingFns
INFO:apache_beam.runners.dataflow.dataflow_runner:2020-03-05T12:32:29.742Z: JOB_MESSAGE_DEBUG: Annotating graph with Autotuner information.
INFO:apache_beam.runners.dataflow.dataflow_runner:2020-03-05T12:32:29.791Z: JOB_MESSAGE_DETAILED: Fusing adjacent ParDo, Read, Write, and Flatten operations
INFO:apache_beam.runners.dataflow.dataflow_runner:2020-03-05T12:32:29.829Z: JOB_MESSAGE_DETAILED: Fusing consumer metrics into Create/Read
INFO:apache_beam.runners.dataflow.dataflow_runner:2020-03-05T12:32:29.861Z: JOB_MESSAGE_DETAILED: Fusing consumer map_to_common_key into metrics
INFO:apache_beam.runners.dataflow.dataflow_runner:2020-03-05T12:32:29.895Z: JOB_MESSAGE_DETAILED: Fusing consumer GroupByKey/Reify into map_to_common_key
INFO:apache_beam.runners.dataflow.dataflow_runner:2020-03-05T12:32:29.932Z: JOB_MESSAGE_DETAILED: Fusing consumer GroupByKey/Write into GroupByKey/Reify
INFO:apache_beam.runners.dataflow.dataflow_runner:2020-03-05T12:32:29.956Z: JOB_MESSAGE_DETAILED: Fusing consumer GroupByKey/GroupByWindow into GroupByKey/Read
INFO:apache_beam.runners.dataflow.dataflow_runner:2020-03-05T12:32:29.996Z: JOB_MESSAGE_DETAILED: Fusing consumer m_out into GroupByKey/GroupByWindow
INFO:apache_beam.runners.dataflow.dataflow_runner:2020-03-05T12:32:30.031Z: JOB_MESSAGE_DEBUG: Workflow config is missing a default resource spec.
INFO:apache_beam.runners.dataflow.dataflow_runner:2020-03-05T12:32:30.069Z: JOB_MESSAGE_DEBUG: Adding StepResource setup and teardown to workflow graph.
INFO:apache_beam.runners.dataflow.dataflow_runner:2020-03-05T12:32:30.105Z: JOB_MESSAGE_DEBUG: Adding workflow start and stop steps.
INFO:apache_beam.runners.dataflow.dataflow_runner:2020-03-05T12:32:30.142Z: JOB_MESSAGE_DEBUG: Assigning stage ids.
INFO:apache_beam.runners.dataflow.dataflow_runner:2020-03-05T12:32:30.320Z: JOB_MESSAGE_DEBUG: Executing wait step start13
INFO:apache_beam.runners.dataflow.dataflow_runner:2020-03-05T12:32:30.396Z: JOB_MESSAGE_BASIC: Executing operation GroupByKey/Create
INFO:apache_beam.runners.dataflow.dataflow_runner:2020-03-05T12:32:30.453Z: JOB_MESSAGE_DEBUG: Starting worker pool setup.
INFO:apache_beam.runners.dataflow.dataflow_runner:2020-03-05T12:32:30.487Z: JOB_MESSAGE_BASIC: Starting 1 workers in us-central1-c...
INFO:apache_beam.runners.dataflow.dataflow_runner:2020-03-05T12:32:30.533Z: JOB_MESSAGE_BASIC: Finished operation GroupByKey/Create
INFO:apache_beam.runners.dataflow.dataflow_runner:2020-03-05T12:32:30.609Z: JOB_MESSAGE_DEBUG: Value "GroupByKey/Session" materialized.
INFO:apache_beam.runners.dataflow.dataflow_runner:2020-03-05T12:32:30.675Z: JOB_MESSAGE_BASIC: Executing operation Create/Read+metrics+map_to_common_key+GroupByKey/Reify+GroupByKey/Write
INFO:apache_beam.runners.dataflow.dataflow_runner:2020-03-05T12:32:49.939Z: JOB_MESSAGE_WARNING: Your project already contains 100 Dataflow-created metric descriptors and Stackdriver will not create new Dataflow custom metrics for this job. Each unique user-defined metric name (independent of the DoFn in which it is defined) produces a new metric descriptor. To delete old / unused metric descriptors see https://developers.google.com/apis-explorer/#p/monitoring/v3/monitoring.projects.metricDescriptors.list and https://developers.google.com/apis-explorer/#p/monitoring/v3/monitoring.projects.metricDescriptors.delete
INFO:apache_beam.runners.dataflow.dataflow_runner:2020-03-05T12:32:54.887Z: JOB_MESSAGE_DETAILED: Autoscaling: Raised the number of workers to 1 based on the rate of progress in the currently running step(s).
INFO:apache_beam.runners.dataflow.dataflow_runner:2020-03-05T12:33:06.669Z: JOB_MESSAGE_DETAILED: Checking permissions granted to controller Service Account.
INFO:apache_beam.runners.dataflow.dataflow_runner:2020-03-05T12:33:10.293Z: JOB_MESSAGE_BASIC: Finished operation assert_that/Create/Read+assert_that/Group/pair_with_0+assert_that/Group/GroupByKey/Reify+assert_that/Group/GroupByKey/Write
INFO:apache_beam.runners.dataflow.dataflow_runner:2020-03-05T12:33:27.969Z: JOB_MESSAGE_BASIC: Finished operation Create/Read+ExternalTransform(simple)/Map(<lambda at external_it_test.py:43>)+assert_that/WindowInto(WindowIntoFn)+assert_that/ToVoidKey+assert_that/Group/pair_with_1+assert_that/Group/GroupByKey/Reify+assert_that/Group/GroupByKey/Write
INFO:apache_beam.runners.dataflow.dataflow_runner:2020-03-05T12:33:28.040Z: JOB_MESSAGE_BASIC: Executing operation assert_that/Group/GroupByKey/Close
INFO:apache_beam.runners.dataflow.dataflow_runner:2020-03-05T12:33:28.156Z: JOB_MESSAGE_BASIC: Finished operation assert_that/Group/GroupByKey/Close
INFO:apache_beam.runners.dataflow.dataflow_runner:2020-03-05T12:33:28.276Z: JOB_MESSAGE_BASIC: Executing operation assert_that/Group/GroupByKey/Read+assert_that/Group/GroupByKey/GroupByWindow+assert_that/Group/Map(_merge_tagged_vals_under_key)+assert_that/Unkey+assert_that/Match
INFO:apache_beam.runners.dataflow.dataflow_runner:2020-03-05T12:33:37.602Z: JOB_MESSAGE_BASIC: Finished operation assert_that/Group/GroupByKey/Read+assert_that/Group/GroupByKey/GroupByWindow+assert_that/Group/Map(_merge_tagged_vals_under_key)+assert_that/Unkey+assert_that/Match
INFO:apache_beam.runners.dataflow.dataflow_runner:2020-03-05T12:33:37.675Z: JOB_MESSAGE_DEBUG: Executing success step success19
INFO:apache_beam.runners.dataflow.dataflow_runner:2020-03-05T12:33:37.791Z: JOB_MESSAGE_DETAILED: Cleaning up.
INFO:apache_beam.runners.dataflow.dataflow_runner:2020-03-05T12:33:37.840Z: JOB_MESSAGE_DEBUG: Starting worker pool teardown.
INFO:apache_beam.runners.dataflow.dataflow_runner:2020-03-05T12:33:37.875Z: JOB_MESSAGE_BASIC: Stopping worker pool...
INFO:apache_beam.runners.dataflow.dataflow_runner:2020-03-05T12:34:38.291Z: JOB_MESSAGE_DETAILED: Autoscaling: Resized worker pool from 1 to 0.
INFO:apache_beam.runners.dataflow.dataflow_runner:2020-03-05T12:34:38.339Z: JOB_MESSAGE_BASIC: Worker pool stopped.
INFO:apache_beam.runners.dataflow.dataflow_runner:2020-03-05T12:34:38.392Z: JOB_MESSAGE_DEBUG: Tearing down pending resources...
INFO:apache_beam.runners.dataflow.dataflow_runner:Job 2020-03-05_04_26_59-12054232963795899017 is in state JOB_STATE_DONE
INFO:apache_beam.runners.dataflow.dataflow_runner:2020-03-05T12:34:56.896Z: JOB_MESSAGE_DETAILED: Workers have started successfully.
INFO:apache_beam.runners.dataflow.dataflow_runner:2020-03-05T12:34:56.935Z: JOB_MESSAGE_DETAILED: Workers have started successfully.
INFO:apache_beam.runners.dataflow.dataflow_runner:2020-03-05T12:38:30.263Z: JOB_MESSAGE_DETAILED: Checking permissions granted to controller Service Account.
INFO:apache_beam.runners.dataflow.dataflow_runner:2020-03-05T12:39:13.490Z: JOB_MESSAGE_BASIC: Finished operation Create/Read+metrics+map_to_common_key+GroupByKey/Reify+GroupByKey/Write
INFO:apache_beam.runners.dataflow.dataflow_runner:2020-03-05T12:39:13.607Z: JOB_MESSAGE_BASIC: Executing operation GroupByKey/Close
INFO:apache_beam.runners.dataflow.dataflow_runner:2020-03-05T12:39:13.657Z: JOB_MESSAGE_BASIC: Finished operation GroupByKey/Close
INFO:apache_beam.runners.dataflow.dataflow_runner:2020-03-05T12:39:13.730Z: JOB_MESSAGE_BASIC: Executing operation GroupByKey/Read+GroupByKey/GroupByWindow+m_out
INFO:apache_beam.runners.dataflow.dataflow_runner:2020-03-05T12:39:23.084Z: JOB_MESSAGE_BASIC: Finished operation GroupByKey/Read+GroupByKey/GroupByWindow+m_out
INFO:apache_beam.runners.dataflow.dataflow_runner:2020-03-05T12:39:23.171Z: JOB_MESSAGE_DEBUG: Executing success step success11
INFO:apache_beam.runners.dataflow.dataflow_runner:2020-03-05T12:39:24.246Z: JOB_MESSAGE_DETAILED: Cleaning up.
INFO:apache_beam.runners.dataflow.dataflow_runner:2020-03-05T12:39:24.293Z: JOB_MESSAGE_DEBUG: Starting worker pool teardown.
INFO:apache_beam.runners.dataflow.dataflow_runner:2020-03-05T12:39:24.327Z: JOB_MESSAGE_BASIC: Stopping worker pool...
INFO:apache_beam.runners.dataflow.dataflow_runner:2020-03-05T12:40:56.812Z: JOB_MESSAGE_DETAILED: Autoscaling: Resized worker pool from 1 to 0.
INFO:apache_beam.runners.dataflow.dataflow_runner:2020-03-05T12:40:56.850Z: JOB_MESSAGE_BASIC: Worker pool stopped.
INFO:apache_beam.runners.dataflow.dataflow_runner:2020-03-05T12:40:56.875Z: JOB_MESSAGE_DEBUG: Tearing down pending resources...
INFO:apache_beam.runners.dataflow.dataflow_runner:Job 2020-03-05_04_32_24-11813593093904821578 is in state JOB_STATE_DONE
Worker logs: https://console.cloud.google.com/dataflow/jobs/us-central1/2020-03-05_03_33_21-7561077054183575216?project=apache-beam-testing
Worker logs: https://console.cloud.google.com/dataflow/jobs/us-central1/2020-03-05_03_47_42-10368615396348869710?project=apache-beam-testing
Worker logs: https://console.cloud.google.com/dataflow/jobs/us-central1/2020-03-05_03_59_14-15541547828591728823?project=apache-beam-testing
Worker logs: https://console.cloud.google.com/dataflow/jobs/us-central1/2020-03-05_04_09_15-3086906939700481767?project=apache-beam-testing
Worker logs: https://console.cloud.google.com/dataflow/jobs/us-central1/2020-03-05_04_17_34-18128943561881229855?project=apache-beam-testing
Worker logs: https://console.cloud.google.com/dataflow/jobs/us-central1/2020-03-05_04_26_51-887647764144980043?project=apache-beam-testing
Worker logs: https://console.cloud.google.com/dataflow/jobs/us-central1/2020-03-05_03_33_18-17731979391059022401?project=apache-beam-testing
Worker logs: https://console.cloud.google.com/dataflow/jobs/us-central1/2020-03-05_03_56_50-8683111246880448762?project=apache-beam-testing
Worker logs: https://console.cloud.google.com/dataflow/jobs/us-central1/2020-03-05_04_07_12-7943093443794663537?project=apache-beam-testing
Worker logs: https://console.cloud.google.com/dataflow/jobs/us-central1/2020-03-05_04_15_33-15539975463295194876?project=apache-beam-testing
Worker logs: https://console.cloud.google.com/dataflow/jobs/us-central1/2020-03-05_04_23_47-6246214079736737775?project=apache-beam-testing
Worker logs: https://console.cloud.google.com/dataflow/jobs/us-central1/2020-03-05_03_33_21-6272731749545524244?project=apache-beam-testing
Worker logs: https://console.cloud.google.com/dataflow/jobs/us-central1/2020-03-05_03_45_28-8515200324259717438?project=apache-beam-testing
Worker logs: https://console.cloud.google.com/dataflow/jobs/us-central1/2020-03-05_03_54_28-14449235283915607067?project=apache-beam-testing
Worker logs: https://console.cloud.google.com/dataflow/jobs/us-central1/2020-03-05_04_03_37-15975328582871058707?project=apache-beam-testing
Worker logs: https://console.cloud.google.com/dataflow/jobs/us-central1/2020-03-05_04_11_27-11124006608933720525?project=apache-beam-testing
Worker logs: https://console.cloud.google.com/dataflow/jobs/us-central1/2020-03-05_04_20_14-8381257108275730068?project=apache-beam-testing
Worker logs: https://console.cloud.google.com/dataflow/jobs/us-central1/2020-03-05_03_33_18-13621033300783782261?project=apache-beam-testing
Worker logs: https://console.cloud.google.com/dataflow/jobs/us-central1/2020-03-05_03_52_30-1414166262949791184?project=apache-beam-testing
Worker logs: https://console.cloud.google.com/dataflow/jobs/us-central1/2020-03-05_04_02_04-12878100402397508549?project=apache-beam-testing
Worker logs: https://console.cloud.google.com/dataflow/jobs/us-central1/2020-03-05_04_10_02-10351452313600620446?project=apache-beam-testing
Worker logs: https://console.cloud.google.com/dataflow/jobs/us-central1/2020-03-05_04_20_03-12024208424553968788?project=apache-beam-testing
Worker logs: https://console.cloud.google.com/dataflow/jobs/us-central1/2020-03-05_03_33_17-4728945337406875607?project=apache-beam-testing
Worker logs: https://console.cloud.google.com/dataflow/jobs/us-central1/2020-03-05_03_42_33-12765540983015407957?project=apache-beam-testing
Worker logs: https://console.cloud.google.com/dataflow/jobs/us-central1/2020-03-05_03_51_28-407946772569678735?project=apache-beam-testing
Worker logs: https://console.cloud.google.com/dataflow/jobs/us-central1/2020-03-05_04_00_40-1855791422628591395?project=apache-beam-testing
Worker logs: https://console.cloud.google.com/dataflow/jobs/us-central1/2020-03-05_04_09_37-11115906993434573081?project=apache-beam-testing
Worker logs: https://console.cloud.google.com/dataflow/jobs/us-central1/2020-03-05_04_18_22-13650223405765337057?project=apache-beam-testing
Worker logs: https://console.cloud.google.com/dataflow/jobs/us-central1/2020-03-05_04_26_59-12054232963795899017?project=apache-beam-testing
Worker logs: https://console.cloud.google.com/dataflow/jobs/us-central1/2020-03-05_03_33_18-8056821903393423332?project=apache-beam-testing
Worker logs: https://console.cloud.google.com/dataflow/jobs/us-central1/2020-03-05_03_42_19-6358558540914058522?project=apache-beam-testing
Worker logs: https://console.cloud.google.com/dataflow/jobs/us-central1/2020-03-05_03_52_19-12704120489151936611?project=apache-beam-testing
Worker logs: https://console.cloud.google.com/dataflow/jobs/us-central1/2020-03-05_04_00_19-10727584468240458933?project=apache-beam-testing
Worker logs: https://console.cloud.google.com/dataflow/jobs/us-central1/2020-03-05_04_08_52-14071768217106758294?project=apache-beam-testing
Worker logs: https://console.cloud.google.com/dataflow/jobs/us-central1/2020-03-05_04_16_21-3071357272018955306?project=apache-beam-testing
Worker logs: https://console.cloud.google.com/dataflow/jobs/us-central1/2020-03-05_04_23_54-18191833782568620275?project=apache-beam-testing
Worker logs: https://console.cloud.google.com/dataflow/jobs/us-central1/2020-03-05_04_32_24-11813593093904821578?project=apache-beam-testing
Worker logs: https://console.cloud.google.com/dataflow/jobs/us-central1/2020-03-05_03_33_17-2508347996184692039?project=apache-beam-testing
Worker logs: https://console.cloud.google.com/dataflow/jobs/us-central1/2020-03-05_03_43_05-17117225607697803875?project=apache-beam-testing
Worker logs: https://console.cloud.google.com/dataflow/jobs/us-central1/2020-03-05_03_54_55-11786929974250452729?project=apache-beam-testing
Worker logs: https://console.cloud.google.com/dataflow/jobs/us-central1/2020-03-05_04_03_45-9892965670373232974?project=apache-beam-testing
Worker logs: https://console.cloud.google.com/dataflow/jobs/us-central1/2020-03-05_04_20_52-1359362713082144933?project=apache-beam-testing
Worker logs: https://console.cloud.google.com/dataflow/jobs/us-central1/2020-03-05_03_33_19-2229421309057967357?project=apache-beam-testing
Worker logs: https://console.cloud.google.com/dataflow/jobs/us-central1/2020-03-05_03_42_10-4521615683659152039?project=apache-beam-testing
Worker logs: https://console.cloud.google.com/dataflow/jobs/us-central1/2020-03-05_03_51_50-1162857529004665081?project=apache-beam-testing
Worker logs: https://console.cloud.google.com/dataflow/jobs/us-central1/2020-03-05_04_01_02-11175374726099573355?project=apache-beam-testing
Worker logs: https://console.cloud.google.com/dataflow/jobs/us-central1/2020-03-05_04_10_19-11212380382737541992?project=apache-beam-testing
Worker logs: https://console.cloud.google.com/dataflow/jobs/us-central1/2020-03-05_04_18_46-11433518205473468403?project=apache-beam-testing
test_datastore_wordcount_it (apache_beam.examples.cookbook.datastore_wordcount_it_test.DatastoreWordCountIT) ... SKIP: This test still needs to be fixed on Python 3TODO: BEAM-4543
test_streaming_wordcount_it (apache_beam.examples.streaming_wordcount_it_test.StreamingWordCountIT) ... ok
test_bigquery_tornadoes_it (apache_beam.examples.cookbook.bigquery_tornadoes_it_test.BigqueryTornadoesIT) ... ok
test_autocomplete_it (apache_beam.examples.complete.autocomplete_test.AutocompleteTest) ... ok
test_leader_board_it (apache_beam.examples.complete.game.leader_board_it_test.LeaderBoardIT) ... ok
test_game_stats_it (apache_beam.examples.complete.game.game_stats_it_test.GameStatsIT) ... ok
test_wordcount_fnapi_it (apache_beam.examples.wordcount_it_test.WordCountIT) ... ok
test_wordcount_it (apache_beam.examples.wordcount_it_test.WordCountIT) ... ok
test_user_score_it (apache_beam.examples.complete.game.user_score_it_test.UserScoreIT) ... ok
test_avro_it (apache_beam.examples.fastavro_it_test.FastavroIT) ... ok
test_hourly_team_score_it (apache_beam.examples.complete.game.hourly_team_score_it_test.HourlyTeamScoreIT) ... ok
test_multiple_destinations_transform (apache_beam.io.gcp.bigquery_test.BigQueryStreamingInsertTransformIntegrationTests) ... ok
test_value_provider_transform (apache_beam.io.gcp.bigquery_test.BigQueryStreamingInsertTransformIntegrationTests) ... ok
test_bqfl_streaming (apache_beam.io.gcp.bigquery_file_loads_test.BigQueryFileLoadsIT) ... SKIP: TestStream is not supported on TestDataflowRunner
test_multiple_destinations_transform (apache_beam.io.gcp.bigquery_file_loads_test.BigQueryFileLoadsIT) ... ok
test_one_job_fails_all_jobs_fail (apache_beam.io.gcp.bigquery_file_loads_test.BigQueryFileLoadsIT) ... ok
test_datastore_write_limit (apache_beam.io.gcp.datastore_write_it_test.DatastoreWriteIT) ... SKIP: This test still needs to be fixed on Python 3TODO: BEAM-4543
test_iobase_source (apache_beam.io.gcp.bigquery_read_it_test.ReadNewTypesTests) ... ok
test_native_source (apache_beam.io.gcp.bigquery_read_it_test.ReadNewTypesTests) ... ok
test_copy (apache_beam.io.gcp.gcsio_integration_test.GcsIOIntegrationTest) ... ok
test_copy_batch (apache_beam.io.gcp.gcsio_integration_test.GcsIOIntegrationTest) ... ok
test_copy_batch_kms (apache_beam.io.gcp.gcsio_integration_test.GcsIOIntegrationTest) ... ok
test_copy_batch_rewrite_token (apache_beam.io.gcp.gcsio_integration_test.GcsIOIntegrationTest) ... ok
test_copy_kms (apache_beam.io.gcp.gcsio_integration_test.GcsIOIntegrationTest) ... ok
test_copy_rewrite_token (apache_beam.io.gcp.gcsio_integration_test.GcsIOIntegrationTest) ... ok
test_iobase_source (apache_beam.io.gcp.bigquery_read_it_test.ReadTests) ... ok
test_native_source (apache_beam.io.gcp.bigquery_read_it_test.ReadTests) ... ok
test_bigquery_read_1M_python (apache_beam.io.gcp.bigquery_io_read_it_test.BigqueryIOReadIT) ... ok
test_bigquery_read_custom_1M_python (apache_beam.io.gcp.bigquery_io_read_it_test.BigqueryIOReadIT) ... ok
test_transform_on_gcs (apache_beam.io.fileio_test.MatchIntegrationTest) ... ok
test_parquetio_it (apache_beam.io.parquetio_it_test.TestParquetIT) ... ok
test_file_loads (apache_beam.io.gcp.bigquery_test.PubSubBigQueryIT) ... SKIP: https://issuetracker.google.com/issues/118375066
test_streaming_inserts (apache_beam.io.gcp.bigquery_test.PubSubBigQueryIT) ... ok
test_streaming_data_only (apache_beam.io.gcp.pubsub_integration_test.PubSubIntegrationTest) ... ok
test_streaming_with_attributes (apache_beam.io.gcp.pubsub_integration_test.PubSubIntegrationTest) ... ok
test_analyzing_syntax (apache_beam.ml.gcp.naturallanguageml_test_it.NaturalLanguageMlTestIT) ... ok
test_datastore_write_limit (apache_beam.io.gcp.datastore.v1new.datastore_write_it_test.DatastoreWriteIT) ... ok
test_deidentification (apache_beam.ml.gcp.cloud_dlp_it_test.CloudDLPIT) ... ok
test_inspection (apache_beam.ml.gcp.cloud_dlp_it_test.CloudDLPIT) ... ok
test_basic_execution (apache_beam.testing.test_stream_it_test.TestStreamIntegrationTests) ... SKIP: The "TestDataflowRunner", does not support the TestStream transform. Supported runners: ['DirectRunner', 'SwitchingDirectRunner']
Tests that the TestStream supports emitting to multiple PCollections. ... SKIP: The "TestDataflowRunner", does not support the TestStream transform. Supported runners: ['DirectRunner', 'SwitchingDirectRunner']
Tests that the TestStream can independently control output watermarks. ... SKIP: The "TestDataflowRunner", does not support the TestStream transform. Supported runners: ['DirectRunner', 'SwitchingDirectRunner']
test_big_query_legacy_sql (apache_beam.io.gcp.big_query_query_to_table_it_test.BigQueryQueryToTableIT) ... ok
test_big_query_new_types (apache_beam.io.gcp.big_query_query_to_table_it_test.BigQueryQueryToTableIT) ... ok
test_big_query_new_types_native (apache_beam.io.gcp.big_query_query_to_table_it_test.BigQueryQueryToTableIT) ... ok
test_big_query_standard_sql (apache_beam.io.gcp.big_query_query_to_table_it_test.BigQueryQueryToTableIT) ... ok
test_big_query_standard_sql_kms_key_native (apache_beam.io.gcp.big_query_query_to_table_it_test.BigQueryQueryToTableIT) ... ok
test_text_detection_with_language_hint (apache_beam.ml.gcp.visionml_test_it.VisionMlTestIT) ... ok
test_label_detection_with_video_context (apache_beam.ml.gcp.videointelligenceml_test_it.VideoIntelligenceMlTestIT) ... ok
test_big_query_write (apache_beam.io.gcp.bigquery_write_it_test.BigQueryWriteIntegrationTests) ... ok
test_big_query_write_new_types (apache_beam.io.gcp.bigquery_write_it_test.BigQueryWriteIntegrationTests) ... ok
test_big_query_write_schema_autodetect (apache_beam.io.gcp.bigquery_write_it_test.BigQueryWriteIntegrationTests) ... SKIP: DataflowRunner does not support schema autodetection
test_big_query_write_without_schema (apache_beam.io.gcp.bigquery_write_it_test.BigQueryWriteIntegrationTests) ... ok
Runs streaming Dataflow job and verifies that user metrics are reported ... ok
test_job_python_from_python_it (apache_beam.transforms.external_it_test.ExternalTransformIT) ... ok
test_metrics_fnapi_it (apache_beam.runners.dataflow.dataflow_exercise_metrics_pipeline_test.ExerciseMetricsPipelineTest) ... ok
test_metrics_it (apache_beam.runners.dataflow.dataflow_exercise_metrics_pipeline_test.ExerciseMetricsPipelineTest) ... ok

----------------------------------------------------------------------
XML: nosetests-postCommitIT-df-py36.xml
----------------------------------------------------------------------
XML: <https://builds.apache.org/job/beam_PostCommit_Python36/ws/src/sdks/python/nosetests.xml>
----------------------------------------------------------------------
Ran 57 tests in 4091.650s

OK (SKIP=8)

FAILURE: Build completed with 2 failures.

1: Task failed with an exception.
-----------
* What went wrong:
Execution failed for task ':sdks:python:test-suites:portable:py36:installGcpTest'.
> Process 'command 'sh'' finished with non-zero exit value 1

* Try:
Run with --stacktrace option to get the stack trace. Run with --info or --debug option to get more log output. Run with --scan to get full insights.
==============================================================================

2: Task failed with an exception.
-----------
* What went wrong:
Execution failed for task ':sdks:python:test-suites:direct:py36:installGcpTest'.
> Process 'command 'sh'' finished with non-zero exit value 1

* Try:
Run with --stacktrace option to get the stack trace. Run with --info or --debug option to get more log output. Run with --scan to get full insights.
==============================================================================

* Get more help at https://help.gradle.org

Deprecated Gradle features were used in this build, making it incompatible with Gradle 6.0.
Use '--warning-mode all' to show the individual deprecation warnings.
See https://docs.gradle.org/5.2.1/userguide/command_line_interface.html#sec:command_line_warnings

BUILD FAILED in 1h 10m 12s
81 actionable tasks: 59 executed, 22 from cache

Publishing build scan...
https://gradle.com/s/q4ao3ukuiaefc

Build step 'Invoke Gradle script' changed build result to FAILURE
Build step 'Invoke Gradle script' marked build as failure

---------------------------------------------------------------------
To unsubscribe, e-mail: builds-unsubscribe@beam.apache.org
For additional commands, e-mail: builds-help@beam.apache.org


Build failed in Jenkins: beam_PostCommit_Python36 #1899

Posted by Apache Jenkins Server <je...@builds.apache.org>.
See <https://builds.apache.org/job/beam_PostCommit_Python36/1899/display/redirect?page=changes>

Changes:

[github] Update lostluck's info on the Go SDK roadmap

[github] Switch contact email to apache.org.


------------------------------------------
[...truncated 70.08 KB...]
	at org.gradle.cache.internal.DefaultCacheAccess$UnitOfWorkFileAccess.writeFile(DefaultCacheAccess.java:412)
	at org.gradle.cache.internal.DefaultMultiProcessSafePersistentIndexedCache.put(DefaultMultiProcessSafePersistentIndexedCache.java:70)
	at org.gradle.cache.internal.AsyncCacheAccessDecoratedCache$2.run(AsyncCacheAccessDecoratedCache.java:64)
	at org.gradle.internal.concurrent.ExecutorPolicy$CatchAndRecordFailures.onExecute(ExecutorPolicy.java:63)
	at org.gradle.cache.internal.CacheAccessWorker$2.run(CacheAccessWorker.java:184)
	at org.gradle.internal.Factories$1.create(Factories.java:25)
	at org.gradle.cache.internal.DefaultCacheAccess.useCache(DefaultCacheAccess.java:223)
	at org.gradle.cache.internal.DefaultCacheAccess.useCache(DefaultCacheAccess.java:204)
	at org.gradle.cache.internal.CacheAccessWorker.flushOperations(CacheAccessWorker.java:174)
	at org.gradle.cache.internal.CacheAccessWorker.run(CacheAccessWorker.java:144)
	at org.gradle.internal.concurrent.ExecutorPolicy$CatchAndRecordFailures.onExecute(ExecutorPolicy.java:63)
	at org.gradle.internal.concurrent.ManagedExecutorImpl$1.run(ManagedExecutorImpl.java:46)
	at java.util.concurrent.ThreadPoolExecutor.runWorker(ThreadPoolExecutor.java:1149)
	at java.util.concurrent.ThreadPoolExecutor$Worker.run(ThreadPoolExecutor.java:624)
	at org.gradle.internal.concurrent.ThreadFactoryImpl$ManagedThreadRunnable.run(ThreadFactoryImpl.java:55)
	at java.lang.Thread.run(Thread.java:748)
Caused by: org.gradle.api.UncheckedIOException: java.io.IOException: No space left on device
	at org.gradle.cache.internal.btree.FileBackedBlockStore.write(FileBackedBlockStore.java:118)
	at org.gradle.cache.internal.btree.CachingBlockStore.flush(CachingBlockStore.java:60)
	at org.gradle.cache.internal.btree.FreeListBlockStore.flush(FreeListBlockStore.java:92)
	at org.gradle.cache.internal.btree.StateCheckBlockStore.flush(StateCheckBlockStore.java:76)
	at org.gradle.cache.internal.btree.BTreePersistentIndexedCache.put(BTreePersistentIndexedCache.java:158)
	... 19 more
Caused by: java.io.IOException: No space left on device
	at java.io.RandomAccessFile.writeBytes(Native Method)
	at java.io.RandomAccessFile.write(RandomAccessFile.java:525)
	at org.gradle.internal.io.RandomAccessFileOutputStream.write(RandomAccessFileOutputStream.java:46)
	at java.io.BufferedOutputStream.flushBuffer(BufferedOutputStream.java:82)
	at java.io.BufferedOutputStream.flush(BufferedOutputStream.java:140)
	at java.io.FilterOutputStream.flush(FilterOutputStream.java:140)
	at org.gradle.cache.internal.btree.ByteOutput.done(ByteOutput.java:62)
	at org.gradle.cache.internal.btree.FileBackedBlockStore$BlockImpl.write(FileBackedBlockStore.java:200)
	at org.gradle.cache.internal.btree.FileBackedBlockStore.write(FileBackedBlockStore.java:114)
	... 23 more
Failed to execute org.gradle.cache.internal.AsyncCacheAccessDecoratedCache$2@1e4d83cd.
org.gradle.api.UncheckedIOException: Could not add entry '<https://builds.apache.org/job/beam_PostCommit_Python36/ws/src/build/gradleenv/2022703440/lib/python3.6/encodings/cp1140.py'> to cache fileHashes.bin (<https://builds.apache.org/job/beam_PostCommit_Python36/ws/src/.gradle/5.2.1/fileHashes/fileHashes.bin).>
	at org.gradle.cache.internal.btree.BTreePersistentIndexedCache.put(BTreePersistentIndexedCache.java:160)
	at org.gradle.cache.internal.DefaultMultiProcessSafePersistentIndexedCache$2.run(DefaultMultiProcessSafePersistentIndexedCache.java:72)
	at org.gradle.cache.internal.DefaultFileLockManager$DefaultFileLock.doWriteAction(DefaultFileLockManager.java:207)
	at org.gradle.cache.internal.DefaultFileLockManager$DefaultFileLock.writeFile(DefaultFileLockManager.java:197)
	at org.gradle.cache.internal.DefaultCacheAccess$UnitOfWorkFileAccess.writeFile(DefaultCacheAccess.java:412)
	at org.gradle.cache.internal.DefaultMultiProcessSafePersistentIndexedCache.put(DefaultMultiProcessSafePersistentIndexedCache.java:70)
	at org.gradle.cache.internal.AsyncCacheAccessDecoratedCache$2.run(AsyncCacheAccessDecoratedCache.java:64)
	at org.gradle.internal.concurrent.ExecutorPolicy$CatchAndRecordFailures.onExecute(ExecutorPolicy.java:63)
	at org.gradle.cache.internal.CacheAccessWorker$2.run(CacheAccessWorker.java:184)
	at org.gradle.internal.Factories$1.create(Factories.java:25)
	at org.gradle.cache.internal.DefaultCacheAccess.useCache(DefaultCacheAccess.java:223)
	at org.gradle.cache.internal.DefaultCacheAccess.useCache(DefaultCacheAccess.java:204)
	at org.gradle.cache.internal.CacheAccessWorker.flushOperations(CacheAccessWorker.java:174)
	at org.gradle.cache.internal.CacheAccessWorker.run(CacheAccessWorker.java:144)
	at org.gradle.internal.concurrent.ExecutorPolicy$CatchAndRecordFailures.onExecute(ExecutorPolicy.java:63)
	at org.gradle.internal.concurrent.ManagedExecutorImpl$1.run(ManagedExecutorImpl.java:46)
	at java.util.concurrent.ThreadPoolExecutor.runWorker(ThreadPoolExecutor.java:1149)
	at java.util.concurrent.ThreadPoolExecutor$Worker.run(ThreadPoolExecutor.java:624)
	at org.gradle.internal.concurrent.ThreadFactoryImpl$ManagedThreadRunnable.run(ThreadFactoryImpl.java:55)
	at java.lang.Thread.run(Thread.java:748)
Caused by: org.gradle.api.UncheckedIOException: java.io.IOException: No space left on device
	at org.gradle.cache.internal.btree.FileBackedBlockStore.write(FileBackedBlockStore.java:118)
	at org.gradle.cache.internal.btree.CachingBlockStore.flush(CachingBlockStore.java:60)
	at org.gradle.cache.internal.btree.FreeListBlockStore.flush(FreeListBlockStore.java:92)
	at org.gradle.cache.internal.btree.StateCheckBlockStore.flush(StateCheckBlockStore.java:76)
	at org.gradle.cache.internal.btree.BTreePersistentIndexedCache.put(BTreePersistentIndexedCache.java:158)
	... 19 more
Caused by: java.io.IOException: No space left on device
	at java.io.RandomAccessFile.writeBytes(Native Method)
	at java.io.RandomAccessFile.write(RandomAccessFile.java:525)
	at org.gradle.internal.io.RandomAccessFileOutputStream.write(RandomAccessFileOutputStream.java:46)
	at java.io.BufferedOutputStream.flushBuffer(BufferedOutputStream.java:82)
	at java.io.BufferedOutputStream.flush(BufferedOutputStream.java:140)
	at java.io.FilterOutputStream.flush(FilterOutputStream.java:140)
	at org.gradle.cache.internal.btree.ByteOutput.done(ByteOutput.java:62)
	at org.gradle.cache.internal.btree.FileBackedBlockStore$BlockImpl.write(FileBackedBlockStore.java:200)
	at org.gradle.cache.internal.btree.FileBackedBlockStore.write(FileBackedBlockStore.java:114)
	... 23 more

> Task :sdks:python:setupVirtualenv
New python executable in <https://builds.apache.org/job/beam_PostCommit_Python36/ws/src/build/gradleenv/1922375555/bin/python2.7>
Also creating executable in <https://builds.apache.org/job/beam_PostCommit_Python36/ws/src/build/gradleenv/1922375555/bin/python>
Installing setuptools, pip, wheel...

  Complete output from command /home/jenkins/jenkin...375555/bin/python2.7 - setuptools pip wheel:
  DEPRECATION: Python 2.7 will reach the end of its life on January 1st, 2020. Please upgrade your Python as Python 2.7 won't be maintained after that date. A future version of pip will drop support for Python 2.7.
Looking in links: /usr/local/lib/python3.5/dist-packages/virtualenv_support
Collecting setuptools
  Using cached https://files.pythonhosted.org/packages/f9/d3/955738b20d3832dfa3cd3d9b07e29a8162edb480bf988332f5e6e48ca444/setuptools-44.0.0-py2.py3-none-any.whl
Collecting pip
  Using cached https://files.pythonhosted.org/packages/54/0c/d01aa759fdc501a58f431eb594a17495f15b88da142ce14b5845662c13f3/pip-20.0.2-py2.py3-none-any.whl
Collecting wheel
  Using cached https://files.pythonhosted.org/packages/8c/23/848298cccf8e40f5bbb59009b32848a4c38f4e7f3364297ab3c3e2e2cd14/wheel-0.34.2-py2.py3-none-any.whl
Installing collected packages: setuptools, pip, wheel
Traceback (most recent call last):
Could not install packages due to an EnvironmentError: [Errno 28] No space left on device: '<https://builds.apache.org/job/beam_PostCommit_Python36/ws/src/build/gradleenv/1922375555/lib/python2.7/site-packages/pip-20.0.2.dist-info'>

  File "/usr/local/lib/python3.5/dist-packages/virtualenv.py", line 2567, in <module>
----------------------------------------
    main()
...Installing setuptools, pip, wheel...done.
  File "/usr/local/lib/python3.5/dist-packages/virtualenv.py", line 793, in main
    symlink=options.symlink,
  File "/usr/local/lib/python3.5/dist-packages/virtualenv.py", line 1088, in create_environment
    install_wheel(to_install, py_executable, search_dirs, download=download)
  File "/usr/local/lib/python3.5/dist-packages/virtualenv.py", line 935, in install_wheel
    _install_wheel_with_search_dir(download, project_names, py_executable, search_dirs)
  File "/usr/local/lib/python3.5/dist-packages/virtualenv.py", line 1025, in _install_wheel_with_search_dir
    call_subprocess(cmd, show_stdout=False, extra_env=env, stdin=script)
  File "/usr/local/lib/python3.5/dist-packages/virtualenv.py", line 886, in call_subprocess
    raise OSError("Command {} failed with error code {}".format(cmd_desc, proc.returncode))
OSError: Command /home/jenkins/jenkin...375555/bin/python2.7 - setuptools pip wheel failed with error code 1
Running virtualenv with interpreter /usr/bin/python2.7

> Task :sdks:python:test-suites:dataflow:py36:setupVirtualenv FAILED
Traceback (most recent call last):
  File "/usr/local/lib/python3.5/dist-packages/virtualenv.py", line 2567, in <module>
Running virtualenv with interpreter /usr/bin/python3.6
    main()
  File "/usr/local/lib/python3.5/dist-packages/virtualenv.py", line 793, in main
    symlink=options.symlink,
  File "/usr/local/lib/python3.5/dist-packages/virtualenv.py", line 1071, in create_environment
    install_python(home_dir, lib_dir, inc_dir, bin_dir, site_packages=site_packages, clear=clear, symlink=symlink)
  File "/usr/local/lib/python3.5/dist-packages/virtualenv.py", line 1457, in install_python
    shutil.copyfile(executable, py_executable)
  File "/usr/lib/python3.6/shutil.py", line 122, in copyfile
    copyfileobj(fsrc, fdst)
  File "/usr/lib/python3.6/shutil.py", line 82, in copyfileobj
    fdst.write(buf)
OSError: [Errno 28] No space left on device

> Task :sdks:python:test-suites:portable:py36:setupVirtualenv FAILED
Using base prefix '/usr'
New python executable in <https://builds.apache.org/job/beam_PostCommit_Python36/ws/src/build/gradleenv/2022703440/bin/python3.6>
Traceback (most recent call last):
Running virtualenv with interpreter /usr/bin/python3.6
  File "/usr/lib/python3.6/shutil.py", line 122, in copyfile
    copyfileobj(fsrc, fdst)
  File "/usr/lib/python3.6/shutil.py", line 82, in copyfileobj
    fdst.write(buf)
OSError: [Errno 28] No space left on device

During handling of the above exception, another exception occurred:

Traceback (most recent call last):
  File "/usr/local/lib/python3.5/dist-packages/virtualenv.py", line 2567, in <module>
    main()
  File "/usr/local/lib/python3.5/dist-packages/virtualenv.py", line 793, in main
    symlink=options.symlink,
  File "/usr/local/lib/python3.5/dist-packages/virtualenv.py", line 1071, in create_environment
    install_python(home_dir, lib_dir, inc_dir, bin_dir, site_packages=site_packages, clear=clear, symlink=symlink)
  File "/usr/local/lib/python3.5/dist-packages/virtualenv.py", line 1457, in install_python
    shutil.copyfile(executable, py_executable)
  File "/usr/lib/python3.6/shutil.py", line 122, in copyfile
    copyfileobj(fsrc, fdst)
OSError: [Errno 28] No space left on device

> Task :sdks:python:test-suites:direct:py36:setupVirtualenv FAILED
> Task :sdks:python:setupVirtualenv FAILED

FAILURE: Build completed with 6 failures.

1: Task failed with an exception.
-----------
* What went wrong:
Execution failed for task ':runners:google-cloud-dataflow-java:worker:windmill:extractIncludeProto'.
> Could not expand ZIP '/home/jenkins/.gradle/caches/modules-2/files-2.1/org.apache.beam/beam-vendor-grpc-1_26_0/0.2/e745ad902acc7c0a76201aa26e38ec0059de3987/beam-vendor-grpc-1_26_0-0.2.jar'.

* Try:
Run with --stacktrace option to get the stack trace. Run with --info or --debug option to get more log output. Run with --scan to get full insights.
==============================================================================

2: Task failed with an exception.
-----------
* What went wrong:
Execution failed for task ':model:pipeline:extractIncludeProto'.
> Could not expand ZIP '/home/jenkins/.gradle/caches/modules-2/files-2.1/org.apache.beam/beam-vendor-grpc-1_26_0/0.2/e745ad902acc7c0a76201aa26e38ec0059de3987/beam-vendor-grpc-1_26_0-0.2.jar'.

* Try:
Run with --stacktrace option to get the stack trace. Run with --info or --debug option to get more log output. Run with --scan to get full insights.
==============================================================================

3: Task failed with an exception.
-----------
* What went wrong:
Execution failed for task ':sdks:python:test-suites:dataflow:py36:setupVirtualenv'.
> Process 'command 'virtualenv'' finished with non-zero exit value 1

* Try:
Run with --stacktrace option to get the stack trace. Run with --info or --debug option to get more log output. Run with --scan to get full insights.
==============================================================================

4: Task failed with an exception.
-----------
* What went wrong:
Execution failed for task ':sdks:python:test-suites:direct:py36:setupVirtualenv'.
> Process 'command 'virtualenv'' finished with non-zero exit value 1

* Try:
Run with --stacktrace option to get the stack trace. Run with --info or --debug option to get more log output. Run with --scan to get full insights.
==============================================================================

5: Task failed with an exception.
-----------
* What went wrong:
Execution failed for task ':sdks:python:test-suites:portable:py36:setupVirtualenv'.
> Process 'command 'virtualenv'' finished with non-zero exit value 1

* Try:
Run with --stacktrace option to get the stack trace. Run with --info or --debug option to get more log output. Run with --scan to get full insights.
==============================================================================

6: Task failed with an exception.
-----------
* What went wrong:
Execution failed for task ':sdks:python:setupVirtualenv'.
> Process 'command 'virtualenv'' finished with non-zero exit value 1

* Try:
Run with --stacktrace option to get the stack trace. Run with --info or --debug option to get more log output. Run with --scan to get full insights.
==============================================================================

* Get more help at https://help.gradle.org

Deprecated Gradle features were used in this build, making it incompatible with Gradle 6.0.
Use '--warning-mode all' to show the individual deprecation warnings.
See https://docs.gradle.org/5.2.1/userguide/command_line_interface.html#sec:command_line_warnings

BUILD FAILED in 30s
25 actionable tasks: 23 executed, 2 from cache

Publishing build scan...
https://gradle.com/s/pexd5vbsnakv4


FAILURE: Build failed with an exception.

* What went wrong:
Could not add entry '<https://builds.apache.org/job/beam_PostCommit_Python36/ws/src/runners/google-cloud-dataflow-java/worker/windmill/build/extracted-include-protos/main/google/api/experimental/experimental.proto'> to cache fileHashes.bin (<https://builds.apache.org/job/beam_PostCommit_Python36/ws/src/.gradle/5.2.1/fileHashes/fileHashes.bin).>
> java.io.IOException: No space left on device

* Try:
Run with --stacktrace option to get the stack trace. Run with --info or --debug option to get more log output. Run with --scan to get full insights.

* Get more help at https://help.gradle.org

Deprecated Gradle features were used in this build, making it incompatible with Gradle 6.0.
Use '--warning-mode all' to show the individual deprecation warnings.
See https://docs.gradle.org/5.2.1/userguide/command_line_interface.html#sec:command_line_warnings

BUILD FAILED in 33s
Build step 'Invoke Gradle script' changed build result to FAILURE
Build step 'Invoke Gradle script' marked build as failure

---------------------------------------------------------------------
To unsubscribe, e-mail: builds-unsubscribe@beam.apache.org
For additional commands, e-mail: builds-help@beam.apache.org


Build failed in Jenkins: beam_PostCommit_Python36 #1898

Posted by Apache Jenkins Server <je...@builds.apache.org>.
See <https://builds.apache.org/job/beam_PostCommit_Python36/1898/display/redirect?page=changes>

Changes:

[github] [BEAM-8328] Disable community metrics integration test in 'test' task


------------------------------------------
[...truncated 9.57 MB...]
Worker logs: https://console.cloud.google.com/dataflow/jobs/us-central1/2020-03-05_01_17_28-242327722043638478?project=apache-beam-testing
Worker logs: https://console.cloud.google.com/dataflow/jobs/us-central1/2020-03-05_01_26_08-3490841082008454938?project=apache-beam-testing
Worker logs: https://console.cloud.google.com/dataflow/jobs/us-central1/2020-03-05_01_35_33-474477393305740122?project=apache-beam-testing
Worker logs: https://console.cloud.google.com/dataflow/jobs/us-central1/2020-03-05_01_45_02-2483804206454398833?project=apache-beam-testing
Worker logs: https://console.cloud.google.com/dataflow/jobs/us-central1/2020-03-05_00_59_39-1236728347791234058?project=apache-beam-testing
Worker logs: https://console.cloud.google.com/dataflow/jobs/us-central1/2020-03-05_01_08_34-12071826127576915735?project=apache-beam-testing
Worker logs: https://console.cloud.google.com/dataflow/jobs/us-central1/2020-03-05_01_16_22-1059749203215333401?project=apache-beam-testing
  File "<https://builds.apache.org/job/beam_PostCommit_Python36/ws/src/build/Worker> logs: https://console.cloud.google.com/dataflow/jobs/us-central1/2020-03-05_01_25_07-17943199532266657207?project=apache-beam-testing
Worker logs: https://console.cloud.google.com/dataflow/jobs/us-central1/2020-03-05_01_34_26-14760974620425846048?project=apache-beam-testing
Worker logs: https://console.cloud.google.com/dataflow/jobs/us-central1/2020-03-05_01_42_40-3174936184253382916?project=apache-beam-testing
Worker logs: https://console.cloud.google.com/dataflow/jobs/us-central1/2020-03-05_00_59_42-13189064340475302462?project=apache-beam-testing
Worker logs: https://console.cloud.google.com/dataflow/jobs/us-central1/2020-03-05_01_08_21-18159188427251220688?project=apache-beam-testing
Worker logs: https://consolegradleenv/-1734967053/lib/python3.6/site-packages/nose/plugins/multiprocess.py", line 700, in __runner
    for test_addr, arg in iter(get, 'STOP'):
  File "<https://builds.apache.org/job/beam_PostCommit_Python36/ws/src/build/gradleenv/-1734967053/lib/python3.6/site-packages/nose/plugins/multiprocess.py",> line 675, in get
    return testQueue.get(timeout=config.multiprocess_timeout)
.cloud.google.com/dataflow/jobs/us-central1/2020-03-05_01_18_06-11204307907503781037?project=apache-beam-testing
Worker logs: https://console.cloud.google.com/dataflow/jobs/us-central1/2020-03-05_01_26_50-1786198673348653047?project=apache-beam-testing
Worker logs: https://console.cloud.google.com/dataflow/jobs/us-central1/2020-03-05_01_35_05-4448656141424673101?project=apache-beam-testing
Worker logs: https://console.cloud.google.com/dataflow/jobs/us-central1/2020-03-05_01_43_40-13390622051252241307?project=apache-beam-testing
Worker logs: https://console.cloud.google.com/dataflow/jobs/us-central1/2020-03-05_00_59_43-15028564075338525316?project=apache-beam-testing
Worker logs: https://console.cloud.google.com/dataflow/jobs/us-central1/2020-03-05_01_14_09-13079970198185701375?project=apache-beam-testing
Worker logs: https://console.cloud.google.com/dataflow/jobs/us-central1/2020-03-05_01_24_49-9321837525719530913?project=apache-beam-testing
Worker logs: https://console.cloud.google.com/dataflow/jobs/us-central1/2020-03-05_01_34_59-16306331040043853062?project=apache-beam-testing
Worker logs: https://console.cloud.google.com/dataflow/jobs/us-central1/2020-03-05_01_42_27-9666322117608019033?project=apache-beam-testing
Worker logs: https://console.cloud.google.com/dataflow/jobs/us-central1/2020-03-05_00_59_40-13124542434876052938?project=apache-beam-testing
Worker logs: https://console.cloud.google.com/dataflow/jobs/us-central1/2020-03-05_01_09_51-18225648908652641572?project=apache-beam-testing
  File "<string>", line 2, in get
Worker logs: https://console.cloud.google.com/dataflow/jobs/us-central1/2020-03-05_01_22_09-4486959479927899509?project=apache-beam-testing
  File "/usr/lib/python3.6/multiprocessing/managers.py", line 757, in _callmethod
    kind, result = conn.recv()
Worker logs: https://console.cloud.google.com/dataflow/jobs/us-central1/2020-03-05_01_30_43-14278652262186077740?project=apache-beam-testing
  File "/usr/lib/python3.6/multiprocessing/connection.py", line 250, in recv
    buf = self._recv_bytes()
  File "/usr/lib/python3.6/multiprocessing/connection.py", line 407, in _recv_bytes
    buf = self._recv(4)
  File "/usr/lib/python3.6/multiprocessing/connection.py", line 383, in _recv
    raise EOFError
EOFError
Process Process-5:
Traceback (most recent call last):
  File "/usr/lib/python3.6/multiprocessing/process.py", line 258, in _bootstrap
    self.run()
  File "/usr/lib/python3.6/multiprocessing/process.py", line 93, in run
    self._target(*self._args, **self._kwargs)
  File "<https://builds.apache.org/job/beam_PostCommit_Python36/ws/src/build/gradleenv/-1734967053/lib/python3.6/site-packages/nose/plugins/multiprocess.py",> line 652, in runner
    keyboardCaught, shouldStop, loaderClass, resultClass, config)
  File "<https://builds.apache.org/job/beam_PostCommit_Python36/ws/src/build/gradleenv/-1734967053/lib/python3.6/site-packages/nose/plugins/multiprocess.py",> line 700, in __runner
    for test_addr, arg in iter(get, 'STOP'):
  File "<https://builds.apache.org/job/beam_PostCommit_Python36/ws/src/build/gradleenv/-1734967053/lib/python3.6/site-packages/nose/plugins/multiprocess.py",> line 675, in get
    return testQueue.get(timeout=config.multiprocess_timeout)
  File "<string>", line 2, in get
  File "/usr/lib/python3.6/multiprocessing/managers.py", line 757, in _callmethod
    kind, result = conn.recv()
  File "/usr/lib/python3.6/multiprocessing/connection.py", line 250, in recv
    buf = self._recv_bytes()
  File "/usr/lib/python3.6/multiprocessing/connection.py", line 407, in _recv_bytes
    buf = self._recv(4)
  File "/usr/lib/python3.6/multiprocessing/connection.py", line 383, in _recv
    raise EOFError
EOFError
Process Process-8:
Traceback (most recent call last):
  File "/usr/lib/python3.6/multiprocessing/process.py", line 258, in _bootstrap
    self.run()
  File "/usr/lib/python3.6/multiprocessing/process.py", line 93, in run
    self._target(*self._args, **self._kwargs)
  File "<https://builds.apache.org/job/beam_PostCommit_Python36/ws/src/build/gradleenv/-1734967053/lib/python3.6/site-packages/nose/plugins/multiprocess.py",> line 652, in runner
    keyboardCaught, shouldStop, loaderClass, resultClass, config)
  File "<https://builds.apache.org/job/beam_PostCommit_Python36/ws/src/build/gradleenv/-1734967053/lib/python3.6/site-packages/nose/plugins/multiprocess.py",> line 700, in __runner
    for test_addr, arg in iter(get, 'STOP'):
  File "<https://builds.apache.org/job/beam_PostCommit_Python36/ws/src/build/gradleenv/-1734967053/lib/python3.6/site-packages/nose/plugins/multiprocess.py",> line 675, in get
    return testQueue.get(timeout=config.multiprocess_timeout)
  File "<string>", line 2, in get
  File "/usr/lib/python3.6/multiprocessing/managers.py", line 757, in _callmethod
    kind, result = conn.recv()
  File "/usr/lib/python3.6/multiprocessing/connection.py", line 250, in recv
    buf = self._recv_bytes()
  File "/usr/lib/python3.6/multiprocessing/connection.py", line 407, in _recv_bytes
    buf = self._recv(4)
  File "/usr/lib/python3.6/multiprocessing/connection.py", line 383, in _recv
    raise EOFError
EOFError
Process Process-7:
Traceback (most recent call last):
  File "/usr/lib/python3.6/multiprocessing/process.py", line 258, in _bootstrap
    self.run()
  File "/usr/lib/python3.6/multiprocessing/process.py", line 93, in run
    self._target(*self._args, **self._kwargs)
  File "<https://builds.apache.org/job/beam_PostCommit_Python36/ws/src/build/gradleenv/-1734967053/lib/python3.6/site-packages/nose/plugins/multiprocess.py",> line 652, in runner
    keyboardCaught, shouldStop, loaderClass, resultClass, config)
  File "<https://builds.apache.org/job/beam_PostCommit_Python36/ws/src/build/gradleenv/-1734967053/lib/python3.6/site-packages/nose/plugins/multiprocess.py",> line 700, in __runner
    for test_addr, arg in iter(get, 'STOP'):
  File "<https://builds.apache.org/job/beam_PostCommit_Python36/ws/src/build/gradleenv/-1734967053/lib/python3.6/site-packages/nose/plugins/multiprocess.py",> line 675, in get
    return testQueue.get(timeout=config.multiprocess_timeout)
  File "<string>", line 2, in get
  File "/usr/lib/python3.6/multiprocessing/managers.py", line 757, in _callmethod
    kind, result = conn.recv()
  File "/usr/lib/python3.6/multiprocessing/connection.py", line 250, in recv
    buf = self._recv_bytes()
  File "/usr/lib/python3.6/multiprocessing/connection.py", line 407, in _recv_bytes
    buf = self._recv(4)
  File "/usr/lib/python3.6/multiprocessing/connection.py", line 383, in _recv
    raise EOFError
EOFError
Process Process-10:
Traceback (most recent call last):
  File "/usr/lib/python3.6/multiprocessing/process.py", line 258, in _bootstrap
    self.run()
  File "/usr/lib/python3.6/multiprocessing/process.py", line 93, in run
    self._target(*self._args, **self._kwargs)
  File "<https://builds.apache.org/job/beam_PostCommit_Python36/ws/src/build/gradleenv/-1734967053/lib/python3.6/site-packages/nose/plugins/multiprocess.py",> line 652, in runner
    keyboardCaught, shouldStop, loaderClass, resultClass, config)
  File "<https://builds.apache.org/job/beam_PostCommit_Python36/ws/src/build/gradleenv/-1734967053/lib/python3.6/site-packages/nose/plugins/multiprocess.py",> line 700, in __runner
    for test_addr, arg in iter(get, 'STOP'):
  File "<https://builds.apache.org/job/beam_PostCommit_Python36/ws/src/build/gradleenv/-1734967053/lib/python3.6/site-packages/nose/plugins/multiprocess.py",> line 675, in get
    return testQueue.get(timeout=config.multiprocess_timeout)
  File "<string>", line 2, in get
  File "/usr/lib/python3.6/multiprocessing/managers.py", line 757, in _callmethod
    kind, result = conn.recv()
  File "/usr/lib/python3.6/multiprocessing/connection.py", line 250, in recv
    buf = self._recv_bytes()
  File "/usr/lib/python3.6/multiprocessing/connection.py", line 407, in _recv_bytes
    buf = self._recv(4)
  File "/usr/lib/python3.6/multiprocessing/connection.py", line 383, in _recv
    raise EOFError
EOFError
Process Process-3:
Traceback (most recent call last):
  File "/usr/lib/python3.6/multiprocessing/process.py", line 258, in _bootstrap
    self.run()
  File "/usr/lib/python3.6/multiprocessing/process.py", line 93, in run
    self._target(*self._args, **self._kwargs)
  File "<https://builds.apache.org/job/beam_PostCommit_Python36/ws/src/build/gradleenv/-1734967053/lib/python3.6/site-packages/nose/plugins/multiprocess.py",> line 652, in runner
    keyboardCaught, shouldStop, loaderClass, resultClass, config)
  File "<https://builds.apache.org/job/beam_PostCommit_Python36/ws/src/build/gradleenv/-1734967053/lib/python3.6/site-packages/nose/plugins/multiprocess.py",> line 700, in __runner
    for test_addr, arg in iter(get, 'STOP'):
  File "<https://builds.apache.org/job/beam_PostCommit_Python36/ws/src/build/gradleenv/-1734967053/lib/python3.6/site-packages/nose/plugins/multiprocess.py",> line 675, in get
    return testQueue.get(timeout=config.multiprocess_timeout)
  File "<string>", line 2, in get
  File "/usr/lib/python3.6/multiprocessing/managers.py", line 757, in _callmethod
    kind, result = conn.recv()
  File "/usr/lib/python3.6/multiprocessing/connection.py", line 250, in recv
    buf = self._recv_bytes()
  File "/usr/lib/python3.6/multiprocessing/connection.py", line 407, in _recv_bytes
    buf = self._recv(4)
  File "/usr/lib/python3.6/multiprocessing/connection.py", line 383, in _recv
    raise EOFError
EOFError
Process Process-9:
Traceback (most recent call last):
  File "/usr/lib/python3.6/multiprocessing/process.py", line 258, in _bootstrap
    self.run()
  File "/usr/lib/python3.6/multiprocessing/process.py", line 93, in run
    self._target(*self._args, **self._kwargs)
  File "<https://builds.apache.org/job/beam_PostCommit_Python36/ws/src/build/gradleenv/-1734967053/lib/python3.6/site-packages/nose/plugins/multiprocess.py",> line 652, in runner
    keyboardCaught, shouldStop, loaderClass, resultClass, config)
  File "<https://builds.apache.org/job/beam_PostCommit_Python36/ws/src/build/gradleenv/-1734967053/lib/python3.6/site-packages/nose/plugins/multiprocess.py",> line 700, in __runner
    for test_addr, arg in iter(get, 'STOP'):
  File "<https://builds.apache.org/job/beam_PostCommit_Python36/ws/src/build/gradleenv/-1734967053/lib/python3.6/site-packages/nose/plugins/multiprocess.py",> line 675, in get
    return testQueue.get(timeout=config.multiprocess_timeout)
  File "<string>", line 2, in get
  File "/usr/lib/python3.6/multiprocessing/managers.py", line 757, in _callmethod
    kind, result = conn.recv()
  File "/usr/lib/python3.6/multiprocessing/connection.py", line 250, in recv
    buf = self._recv_bytes()
  File "/usr/lib/python3.6/multiprocessing/connection.py", line 407, in _recv_bytes
    buf = self._recv(4)
  File "/usr/lib/python3.6/multiprocessing/connection.py", line 383, in _recv
    raise EOFError
EOFError
error: [Errno 28] No space left on device

> Task :sdks:python:test-suites:dataflow:py36:postCommitIT FAILED

FAILURE: Build failed with an exception.

* Where:
Build file '<https://builds.apache.org/job/beam_PostCommit_Python36/ws/src/sdks/python/test-suites/dataflow/py36/build.gradle'> line: 56

* What went wrong:
Execution failed for task ':sdks:python:test-suites:dataflow:py36:postCommitIT'.
> Process 'command 'sh'' finished with non-zero exit value 1

* Try:
Run with --stacktrace option to get the stack trace. Run with --info or --debug option to get more log output. Run with --scan to get full insights.

* Get more help at https://help.gradle.org

Deprecated Gradle features were used in this build, making it incompatible with Gradle 6.0.
Use '--warning-mode all' to show the individual deprecation warnings.
See https://docs.gradle.org/5.2.1/userguide/command_line_interface.html#sec:command_line_warnings

BUILD FAILED in 58m 32s
86 actionable tasks: 64 executed, 22 from cache

A build scan cannot be produced as an error occurred spooling the build data.
Please report this problem via https://gradle.com/scans/help/plugin and include the following via copy/paste:

----------
Gradle version: 5.2.1
Plugin version: 2.3

java.lang.IllegalStateException: java.io.IOException: No space left on device
	at com.gradle.scan.a.e.b.flush(SourceFile:233)
	at com.gradle.scan.a.e.b.close(SourceFile:244)
	at com.gradle.scan.a.e.c.close(SourceFile:66)
	at com.gradle.scan.plugin.internal.n.a(SourceFile:78)
	at com.gradle.scan.plugin.internal.e.c.c.b(SourceFile:125)
	at com.gradle.scan.plugin.internal.e.c.c.a(SourceFile:117)
	at com.gradle.scan.plugin.internal.o.a$a.a(SourceFile:30)
	at com.gradle.scan.plugin.internal.o.a$a.a(SourceFile:19)
	at com.gradle.scan.plugin.internal.o.a.c(SourceFile:60)
Caused by: java.io.IOException: No space left on device
	at com.gradle.scan.a.e.b.flush(SourceFile:231)
	... 8 more

----------


FAILURE: Build failed with an exception.

* What went wrong:
Failed to notify root build lifecycle listener.
> Could not update /home/jenkins/.gradle/caches/5.2.1/file-changes/last-build.bin
> Could not update <https://builds.apache.org/job/beam_PostCommit_Python36/ws/src/.gradle/5.2.1/fileChanges/last-build.bin>

* Try:
Run with --stacktrace option to get the stack trace. Run with --info or --debug option to get more log output. Run with --scan to get full insights.

* Get more help at https://help.gradle.org

Deprecated Gradle features were used in this build, making it incompatible with Gradle 6.0.
Use '--warning-mode all' to show the individual deprecation warnings.
See https://docs.gradle.org/5.2.1/userguide/command_line_interface.html#sec:command_line_warnings

BUILD FAILED in 58m 32s

FAILURE: Build failed with an exception.

* What went wrong:
Could not write cache value to '/home/jenkins/.gradle/daemon/5.2.1/registry.bin'.

* Try:
Run with --stacktrace option to get the stack trace. Run with --info or --debug option to get more log output. Run with --scan to get full insights.

* Get more help at https://help.gradle.org
Build step 'Invoke Gradle script' changed build result to FAILURE
Build step 'Invoke Gradle script' marked build as failure

---------------------------------------------------------------------
To unsubscribe, e-mail: builds-unsubscribe@beam.apache.org
For additional commands, e-mail: builds-help@beam.apache.org


Build failed in Jenkins: beam_PostCommit_Python36 #1897

Posted by Apache Jenkins Server <je...@builds.apache.org>.
See <https://builds.apache.org/job/beam_PostCommit_Python36/1897/display/redirect>

Changes:


------------------------------------------
[...truncated 9.80 MB...]
                  "@type": "kind:global_window"
                }
              ],
              "is_wrapper": true
            },
            "output_name": "None",
            "user_name": "m_out.out"
          }
        ],
        "parallel_input": {
          "@type": "OutputReference",
          "output_name": "out",
          "step_name": "s4"
        },
        "serialized_fn": "eNqFVOlz3DQU9+7mqhsgLeW+yr0BakMD5SotsKEHhm3HzUz9JaORJe2uElnyk+RuM8POwDDp8pX/gj+TZ2XTaQqF8dh+h97v3fq112e0pmwiSClolXhLtRsZW7mEGSviAVWKlkrctbSuhd0213QM0eZv0JlBt1/0oigiIw09xqVSCWm/MWFWUC/IqNHMS4MGS/0TemUoJ/6gFjEsF2sIMTBc7CAPK4ewmsNaP+tkEb5xdmdwkXd4l/f4El/20V5nr8tXfol+7y7o1cfp8dqdCE71h2jdzXrZUrZcLKEHo5mAuFhG0k8l0qc9rAdNmzY8VawgWd+jqhHwdLGOzA4djwW/1fi68fDMHDaKDkrvw5lDOFv8iWQ6MZVI94Tel9od/y84Re+JdGrsvsOyirSFJ7eN8wNTVdKT2wd+YvTWpdRZljq+79I6SNJHupDaRmthXcqppyNlpg8JIu4Ly6QTpBLeSuZILWuhpBZJfQDPhmJeVrQqOb0C57K/BhtRp/vwWccHntvc9PB8Di+caMlYeEK9tzG8GEDKRiqP+cBLxSqyqG618PIDeCWHV0+Yyqo21pPK8EZhR18rrqLBozO1yCY5TiL5/2zg9UN4I4fzIRaCjpgnBN58AG/l8Pbk3HA4g3eK062uHSMykdo7ePffhlDTSnDf1G1o7wWTm7faUbsRTN4PEqmxxwHJQT8034S2L0SbYTiMlWOp4YM5fFicfyzD9lyIIeEC14Z6Yx18NIcLOSTD4S6kc/g4h0/c0MPFHLaCC1wPXC07drVg8OkwlLm2hgnn4LPJ1j+yuzQJUJ/P4YscvmzKXfhqBl/vwuX/3N+7UnMzlXocwze4tVdmcLUfijoNClzdb59kf3Qivq5MSdURjovhO0T5vjjV7hEWZCwsQgyeBLE4Em+LEW2U31mwsI0gPxRn2ioy1lSNou090Y6QgGtZp9hoNQonRHCCOqHbolw/4aXxUqEDWQnnaVXH242lR5fNDQS/OYMfQ9cqyaxxkGWRK4uzbdTHFoSZqsRRs/ATegzVlo7wo0jh5z+a0sMw+RtbN623",
        "user_name": "m_out"
      }
    }
  ],
  "type": "JOB_TYPE_BATCH"
}
INFO:apache_beam.runners.dataflow.internal.apiclient:Create job: <Job
 createTime: '2020-03-05T07:08:16.100873Z'
 currentStateTime: '1970-01-01T00:00:00Z'
 id: '2020-03-04_23_08_14-643742168247982617'
 location: 'us-central1'
 name: 'beamapp-jenkins-0305070757-172919'
 projectId: 'apache-beam-testing'
 stageStates: []
 startTime: '2020-03-05T07:08:16.100873Z'
 steps: []
 tempFiles: []
 type: TypeValueValuesEnum(JOB_TYPE_BATCH, 1)>
INFO:apache_beam.runners.dataflow.internal.apiclient:Created job with id: [2020-03-04_23_08_14-643742168247982617]
INFO:apache_beam.runners.dataflow.internal.apiclient:To access the Dataflow monitoring console, please navigate to https://console.cloud.google.com/dataflow/jobs/us-central1/2020-03-04_23_08_14-643742168247982617?project=apache-beam-testing
INFO:apache_beam.io.gcp.tests.bigquery_matcher:Attempting to perform query SELECT bytes, date, time FROM python_write_to_table_15833916041464.python_no_schema_table to BQ
DEBUG:google.auth.transport._http_client:Making request: GET http://169.254.169.254
DEBUG:google.auth.transport._http_client:Making request: GET http://metadata.google.internal/computeMetadata/v1/project/project-id
DEBUG:urllib3.util.retry:Converted retries value: 3 -> Retry(total=3, connect=None, read=None, redirect=None, status=None)
DEBUG:google.auth.transport.requests:Making request: GET http://metadata.google.internal/computeMetadata/v1/instance/service-accounts/default/?recursive=true
DEBUG:urllib3.connectionpool:Starting new HTTP connection (1): metadata.google.internal:80
DEBUG:urllib3.connectionpool:http://metadata.google.internal:80 "GET /computeMetadata/v1/instance/service-accounts/default/?recursive=true HTTP/1.1" 200 144
DEBUG:google.auth.transport.requests:Making request: GET http://metadata.google.internal/computeMetadata/v1/instance/service-accounts/844138762903-compute@developer.gserviceaccount.com/token
DEBUG:urllib3.connectionpool:http://metadata.google.internal:80 "GET /computeMetadata/v1/instance/service-accounts/844138762903-compute@developer.gserviceaccount.com/token HTTP/1.1" 200 192
DEBUG:urllib3.connectionpool:Starting new HTTPS connection (1): bigquery.googleapis.com:443
DEBUG:urllib3.connectionpool:https://bigquery.googleapis.com:443 "POST /bigquery/v2/projects/apache-beam-testing/jobs HTTP/1.1" 200 None
DEBUG:urllib3.connectionpool:https://bigquery.googleapis.com:443 "GET /bigquery/v2/projects/apache-beam-testing/queries/7d9f6ffd-778a-4ae3-a238-6c9c71c7e928?maxResults=0&location=US HTTP/1.1" 200 None
DEBUG:urllib3.connectionpool:https://bigquery.googleapis.com:443 "GET /bigquery/v2/projects/apache-beam-testing/datasets/_7357fab0f784d2a7327ddbe81cdd1f4ca7e429cd/tables/anon8c3c7d073f4832e372835541bf976ef8b274fe3f/data HTTP/1.1" 200 None
INFO:apache_beam.io.gcp.tests.bigquery_matcher:Result of query is: [(b'xyw', datetime.date(2011, 1, 1), datetime.time(23, 59, 59, 999999)), (b'\xab\xac\xad', datetime.date(2000, 1, 1), datetime.time(0, 0)), (b'abc', datetime.date(2000, 1, 1), datetime.time(0, 0)), (b'\xe4\xbd\xa0\xe5\xa5\xbd', datetime.date(3000, 12, 31), datetime.time(23, 59, 59))]
INFO:apache_beam.io.gcp.bigquery_write_it_test:Deleting dataset python_write_to_table_15833916041464 in project apache-beam-testing
INFO:apache_beam.runners.dataflow.dataflow_runner:Job 2020-03-04_23_08_14-643742168247982617 is in state JOB_STATE_RUNNING
INFO:apache_beam.runners.dataflow.dataflow_runner:2020-03-05T07:08:14.961Z: JOB_MESSAGE_DETAILED: Autoscaling is enabled for job 2020-03-04_23_08_14-643742168247982617. The number of workers will be between 1 and 1000.
INFO:apache_beam.runners.dataflow.dataflow_runner:2020-03-05T07:08:14.961Z: JOB_MESSAGE_DETAILED: Autoscaling was automatically enabled for job 2020-03-04_23_08_14-643742168247982617.
INFO:apache_beam.runners.dataflow.dataflow_runner:2020-03-05T07:08:18.315Z: JOB_MESSAGE_DETAILED: Checking permissions granted to controller Service Account.
INFO:apache_beam.runners.dataflow.dataflow_runner:2020-03-05T07:08:19.338Z: JOB_MESSAGE_BASIC: Worker configuration: n1-standard-1 in us-central1-f.
INFO:apache_beam.runners.dataflow.dataflow_runner:2020-03-05T07:08:20.068Z: JOB_MESSAGE_DETAILED: Expanding CoGroupByKey operations into optimizable parts.
INFO:apache_beam.runners.dataflow.dataflow_runner:2020-03-05T07:08:20.101Z: JOB_MESSAGE_DEBUG: Combiner lifting skipped for step GroupByKey: GroupByKey not followed by a combiner.
INFO:apache_beam.runners.dataflow.dataflow_runner:2020-03-05T07:08:20.135Z: JOB_MESSAGE_DETAILED: Expanding GroupByKey operations into optimizable parts.
INFO:apache_beam.runners.dataflow.dataflow_runner:2020-03-05T07:08:20.211Z: JOB_MESSAGE_DETAILED: Lifting ValueCombiningMappingFns into MergeBucketsMappingFns
INFO:apache_beam.runners.dataflow.dataflow_runner:2020-03-05T07:08:20.270Z: JOB_MESSAGE_DEBUG: Annotating graph with Autotuner information.
INFO:apache_beam.runners.dataflow.dataflow_runner:2020-03-05T07:08:20.329Z: JOB_MESSAGE_DETAILED: Fusing adjacent ParDo, Read, Write, and Flatten operations
INFO:apache_beam.runners.dataflow.dataflow_runner:2020-03-05T07:08:20.360Z: JOB_MESSAGE_DETAILED: Fusing consumer metrics into Create/Read
INFO:apache_beam.runners.dataflow.dataflow_runner:2020-03-05T07:08:20.391Z: JOB_MESSAGE_DETAILED: Fusing consumer map_to_common_key into metrics
INFO:apache_beam.runners.dataflow.dataflow_runner:2020-03-05T07:08:20.428Z: JOB_MESSAGE_DETAILED: Fusing consumer GroupByKey/Reify into map_to_common_key
INFO:apache_beam.runners.dataflow.dataflow_runner:2020-03-05T07:08:20.453Z: JOB_MESSAGE_DETAILED: Fusing consumer GroupByKey/Write into GroupByKey/Reify
INFO:apache_beam.runners.dataflow.dataflow_runner:2020-03-05T07:08:20.490Z: JOB_MESSAGE_DETAILED: Fusing consumer GroupByKey/GroupByWindow into GroupByKey/Read
INFO:apache_beam.runners.dataflow.dataflow_runner:2020-03-05T07:08:20.527Z: JOB_MESSAGE_DETAILED: Fusing consumer m_out into GroupByKey/GroupByWindow
INFO:apache_beam.runners.dataflow.dataflow_runner:2020-03-05T07:08:20.563Z: JOB_MESSAGE_DEBUG: Workflow config is missing a default resource spec.
INFO:apache_beam.runners.dataflow.dataflow_runner:2020-03-05T07:08:20.595Z: JOB_MESSAGE_DEBUG: Adding StepResource setup and teardown to workflow graph.
INFO:apache_beam.runners.dataflow.dataflow_runner:2020-03-05T07:08:20.633Z: JOB_MESSAGE_DEBUG: Adding workflow start and stop steps.
INFO:apache_beam.runners.dataflow.dataflow_runner:2020-03-05T07:08:20.670Z: JOB_MESSAGE_DEBUG: Assigning stage ids.
INFO:apache_beam.runners.dataflow.dataflow_runner:2020-03-05T07:08:20.821Z: JOB_MESSAGE_DEBUG: Executing wait step start13
INFO:apache_beam.runners.dataflow.dataflow_runner:2020-03-05T07:08:20.887Z: JOB_MESSAGE_BASIC: Executing operation GroupByKey/Create
INFO:apache_beam.runners.dataflow.dataflow_runner:2020-03-05T07:08:20.935Z: JOB_MESSAGE_DEBUG: Starting worker pool setup.
INFO:apache_beam.runners.dataflow.dataflow_runner:2020-03-05T07:08:20.971Z: JOB_MESSAGE_BASIC: Starting 1 workers in us-central1-f...
INFO:apache_beam.runners.dataflow.dataflow_runner:2020-03-05T07:08:21.020Z: JOB_MESSAGE_BASIC: Finished operation GroupByKey/Create
INFO:apache_beam.runners.dataflow.dataflow_runner:2020-03-05T07:08:21.091Z: JOB_MESSAGE_DEBUG: Value "GroupByKey/Session" materialized.
INFO:apache_beam.runners.dataflow.dataflow_runner:2020-03-05T07:08:21.218Z: JOB_MESSAGE_BASIC: Executing operation Create/Read+metrics+map_to_common_key+GroupByKey/Reify+GroupByKey/Write
INFO:apache_beam.runners.dataflow.dataflow_runner:2020-03-05T07:08:46.586Z: JOB_MESSAGE_DETAILED: Autoscaling: Raised the number of workers to 1 based on the rate of progress in the currently running step(s).
INFO:apache_beam.runners.dataflow.dataflow_runner:2020-03-05T07:08:49.700Z: JOB_MESSAGE_WARNING: Your project already contains 100 Dataflow-created metric descriptors and Stackdriver will not create new Dataflow custom metrics for this job. Each unique user-defined metric name (independent of the DoFn in which it is defined) produces a new metric descriptor. To delete old / unused metric descriptors see https://developers.google.com/apis-explorer/#p/monitoring/v3/monitoring.projects.metricDescriptors.list and https://developers.google.com/apis-explorer/#p/monitoring/v3/monitoring.projects.metricDescriptors.delete
INFO:apache_beam.runners.dataflow.dataflow_runner:2020-03-05T07:09:16.844Z: JOB_MESSAGE_BASIC: Finished operation Create/Read+ExternalTransform(simple)/Map(<lambda at external_it_test.py:43>)+assert_that/WindowInto(WindowIntoFn)+assert_that/ToVoidKey+assert_that/Group/pair_with_1+assert_that/Group/GroupByKey/Reify+assert_that/Group/GroupByKey/Write
INFO:apache_beam.runners.dataflow.dataflow_runner:2020-03-05T07:09:19.937Z: JOB_MESSAGE_BASIC: Finished operation assert_that/Create/Read+assert_that/Group/pair_with_0+assert_that/Group/GroupByKey/Reify+assert_that/Group/GroupByKey/Write
INFO:apache_beam.runners.dataflow.dataflow_runner:2020-03-05T07:09:20.020Z: JOB_MESSAGE_BASIC: Executing operation assert_that/Group/GroupByKey/Close
INFO:apache_beam.runners.dataflow.dataflow_runner:2020-03-05T07:09:20.068Z: JOB_MESSAGE_BASIC: Finished operation assert_that/Group/GroupByKey/Close
INFO:apache_beam.runners.dataflow.dataflow_runner:2020-03-05T07:09:20.141Z: JOB_MESSAGE_BASIC: Executing operation assert_that/Group/GroupByKey/Read+assert_that/Group/GroupByKey/GroupByWindow+assert_that/Group/Map(_merge_tagged_vals_under_key)+assert_that/Unkey+assert_that/Match
INFO:apache_beam.runners.dataflow.dataflow_runner:2020-03-05T07:09:29.405Z: JOB_MESSAGE_BASIC: Finished operation assert_that/Group/GroupByKey/Read+assert_that/Group/GroupByKey/GroupByWindow+assert_that/Group/Map(_merge_tagged_vals_under_key)+assert_that/Unkey+assert_that/Match
INFO:apache_beam.runners.dataflow.dataflow_runner:2020-03-05T07:09:29.468Z: JOB_MESSAGE_DEBUG: Executing success step success19
INFO:apache_beam.runners.dataflow.dataflow_runner:2020-03-05T07:09:29.744Z: JOB_MESSAGE_DETAILED: Cleaning up.
INFO:apache_beam.runners.dataflow.dataflow_runner:2020-03-05T07:09:29.811Z: JOB_MESSAGE_DEBUG: Starting worker pool teardown.
INFO:apache_beam.runners.dataflow.dataflow_runner:2020-03-05T07:09:29.845Z: JOB_MESSAGE_BASIC: Stopping worker pool...
INFO:apache_beam.runners.dataflow.dataflow_runner:2020-03-05T07:10:20.096Z: JOB_MESSAGE_DETAILED: Workers have started successfully.
INFO:apache_beam.runners.dataflow.dataflow_runner:2020-03-05T07:10:20.133Z: JOB_MESSAGE_DETAILED: Workers have started successfully.
INFO:apache_beam.runners.dataflow.dataflow_runner:2020-03-05T07:10:54.793Z: JOB_MESSAGE_DETAILED: Autoscaling: Resized worker pool from 1 to 0.
INFO:apache_beam.runners.dataflow.dataflow_runner:2020-03-05T07:10:54.839Z: JOB_MESSAGE_BASIC: Worker pool stopped.
INFO:apache_beam.runners.dataflow.dataflow_runner:2020-03-05T07:10:54.882Z: JOB_MESSAGE_DEBUG: Tearing down pending resources...
INFO:apache_beam.runners.dataflow.dataflow_runner:Job 2020-03-04_23_03_45-18212961935985536605 is in state JOB_STATE_DONE
INFO:apache_beam.runners.dataflow.dataflow_runner:2020-03-05T07:14:20.786Z: JOB_MESSAGE_DETAILED: Checking permissions granted to controller Service Account.
INFO:apache_beam.runners.dataflow.dataflow_runner:2020-03-05T07:14:37.104Z: JOB_MESSAGE_BASIC: Finished operation Create/Read+metrics+map_to_common_key+GroupByKey/Reify+GroupByKey/Write
INFO:apache_beam.runners.dataflow.dataflow_runner:2020-03-05T07:14:37.169Z: JOB_MESSAGE_BASIC: Executing operation GroupByKey/Close
INFO:apache_beam.runners.dataflow.dataflow_runner:2020-03-05T07:14:37.224Z: JOB_MESSAGE_BASIC: Finished operation GroupByKey/Close
INFO:apache_beam.runners.dataflow.dataflow_runner:2020-03-05T07:14:37.313Z: JOB_MESSAGE_BASIC: Executing operation GroupByKey/Read+GroupByKey/GroupByWindow+m_out
INFO:apache_beam.runners.dataflow.dataflow_runner:2020-03-05T07:14:46.523Z: JOB_MESSAGE_BASIC: Finished operation GroupByKey/Read+GroupByKey/GroupByWindow+m_out
INFO:apache_beam.runners.dataflow.dataflow_runner:2020-03-05T07:14:46.617Z: JOB_MESSAGE_DEBUG: Executing success step success11
INFO:apache_beam.runners.dataflow.dataflow_runner:2020-03-05T07:14:46.738Z: JOB_MESSAGE_DETAILED: Cleaning up.
INFO:apache_beam.runners.dataflow.dataflow_runner:2020-03-05T07:14:46.796Z: JOB_MESSAGE_DEBUG: Starting worker pool teardown.
INFO:apache_beam.runners.dataflow.dataflow_runner:2020-03-05T07:14:46.824Z: JOB_MESSAGE_BASIC: Stopping worker pool...
INFO:apache_beam.runners.dataflow.dataflow_runner:2020-03-05T07:16:19.193Z: JOB_MESSAGE_DETAILED: Autoscaling: Resized worker pool from 1 to 0.
INFO:apache_beam.runners.dataflow.dataflow_runner:2020-03-05T07:16:19.241Z: JOB_MESSAGE_BASIC: Worker pool stopped.
INFO:apache_beam.runners.dataflow.dataflow_runner:2020-03-05T07:16:19.271Z: JOB_MESSAGE_DEBUG: Tearing down pending resources...
INFO:apache_beam.runners.dataflow.dataflow_runner:Job 2020-03-04_23_08_14-643742168247982617 is in state JOB_STATE_DONE
Worker logs: https://console.cloud.google.com/dataflow/jobs/us-central1/2020-03-04_22_12_10-10126417407013814279?project=apache-beam-testing
Worker logs: https://console.cloud.google.com/dataflow/jobs/us-central1/2020-03-04_22_26_36-11780016366882294444?project=apache-beam-testing
Worker logs: https://console.cloud.google.com/dataflow/jobs/us-central1/2020-03-04_22_36_48-2777347156202120208?project=apache-beam-testing
Worker logs: https://console.cloud.google.com/dataflow/jobs/us-central1/2020-03-04_22_46_16-18053346505088601848?project=apache-beam-testing
Worker logs: https://console.cloud.google.com/dataflow/jobs/us-central1/2020-03-04_22_55_54-17840916702121030654?project=apache-beam-testing
Worker logs: https://console.cloud.google.com/dataflow/jobs/us-central1/2020-03-04_22_12_06-6373344609502446716?project=apache-beam-testing
Worker logs: https://console.cloud.google.com/dataflow/jobs/us-central1/2020-03-04_22_35_04-9884082554144877420?project=apache-beam-testing
Worker logs: https://console.cloud.google.com/dataflow/jobs/us-central1/2020-03-04_22_43_57-6305630797664946651?project=apache-beam-testing
Worker logs: https://console.cloud.google.com/dataflow/jobs/us-central1/2020-03-04_22_52_04-15581112099887837914?project=apache-beam-testing
Worker logs: https://console.cloud.google.com/dataflow/jobs/us-central1/2020-03-04_23_00_21-7711673348579779503?project=apache-beam-testing
Worker logs: https://console.cloud.google.com/dataflow/jobs/us-central1/2020-03-04_22_12_09-14182626460714695235?project=apache-beam-testing
Worker logs: https://console.cloud.google.com/dataflow/jobs/us-central1/2020-03-04_22_24_10-16666860139817894242?project=apache-beam-testing
Worker logs: https://console.cloud.google.com/dataflow/jobs/us-central1/2020-03-04_22_32_31-1039836669105521361?project=apache-beam-testing
Worker logs: https://console.cloud.google.com/dataflow/jobs/us-central1/2020-03-04_22_40_40-11373872139563913400?project=apache-beam-testing
Worker logs: https://console.cloud.google.com/dataflow/jobs/us-central1/2020-03-04_22_48_52-4014298226840618798?project=apache-beam-testing
Worker logs: https://console.cloud.google.com/dataflow/jobs/us-central1/2020-03-04_22_57_07-9461399593833138661?project=apache-beam-testing
Worker logs: https://console.cloud.google.com/dataflow/jobs/us-central1/2020-03-04_22_12_06-9347495611399684444?project=apache-beam-testing
Worker logs: https://console.cloud.google.com/dataflow/jobs/us-central1/2020-03-04_22_33_08-14706250297120688167?project=apache-beam-testing
Worker logs: https://console.cloud.google.com/dataflow/jobs/us-central1/2020-03-04_22_41_05-7000128182800348695?project=apache-beam-testing
Worker logs: https://console.cloud.google.com/dataflow/jobs/us-central1/2020-03-04_22_49_40-2104275303429696043?project=apache-beam-testing
Worker logs: https://console.cloud.google.com/dataflow/jobs/us-central1/2020-03-04_22_58_15-8941479741814607630?project=apache-beam-testing
Worker logs: https://console.cloud.google.com/dataflow/jobs/us-central1/2020-03-04_22_12_09-11342653481179649055?project=apache-beam-testing
Worker logs: https://console.cloud.google.com/dataflow/jobs/us-central1/2020-03-04_22_21_45-5307229391608899851?project=apache-beam-testing
Worker logs: https://console.cloud.google.com/dataflow/jobs/us-central1/2020-03-04_22_29_33-7266217789399415198?project=apache-beam-testing
Worker logs: https://console.cloud.google.com/dataflow/jobs/us-central1/2020-03-04_22_38_11-9107503667752021162?project=apache-beam-testing
Worker logs: https://console.cloud.google.com/dataflow/jobs/us-central1/2020-03-04_22_46_54-12958196617690465866?project=apache-beam-testing
Worker logs: https://console.cloud.google.com/dataflow/jobs/us-central1/2020-03-04_22_55_01-8463852417628303589?project=apache-beam-testing
Worker logs: https://console.cloud.google.com/dataflow/jobs/us-central1/2020-03-04_22_12_05-1912610349587753044?project=apache-beam-testing
Worker logs: https://console.cloud.google.com/dataflow/jobs/us-central1/2020-03-04_22_20_41-12829423702720418091?project=apache-beam-testing
Worker logs: https://console.cloud.google.com/dataflow/jobs/us-central1/2020-03-04_22_29_32-10705699630347792393?project=apache-beam-testing
Worker logs: https://console.cloud.google.com/dataflow/jobs/us-central1/2020-03-04_22_37_46-585009643070619452?project=apache-beam-testing
Worker logs: https://console.cloud.google.com/dataflow/jobs/us-central1/2020-03-04_22_46_07-17458762003977574182?project=apache-beam-testing
Worker logs: https://console.cloud.google.com/dataflow/jobs/us-central1/2020-03-04_22_53_39-212480177654077627?project=apache-beam-testing
Worker logs: https://console.cloud.google.com/dataflow/jobs/us-central1/2020-03-04_23_00_46-8517263820681326677?project=apache-beam-testing
Worker logs: https://console.cloud.google.com/dataflow/jobs/us-central1/2020-03-04_22_12_08-2213788679299388903?project=apache-beam-testing
Worker logs: https://console.cloud.google.com/dataflow/jobs/us-central1/2020-03-04_22_21_35-18425522396707176905?project=apache-beam-testing
Worker logs: https://console.cloud.google.com/dataflow/jobs/us-central1/2020-03-04_22_34_21-14497754616704152410?project=apache-beam-testing
Worker logs: https://console.cloud.google.com/dataflow/jobs/us-central1/2020-03-04_22_43_11-4804192595076435919?project=apache-beam-testing
Worker logs: https://console.cloud.google.com/dataflow/jobs/us-central1/2020-03-04_23_00_05-3320146676547189841?project=apache-beam-testing
Worker logs: https://console.cloud.google.com/dataflow/jobs/us-central1/2020-03-04_23_08_14-643742168247982617?project=apache-beam-testing
Worker logs: https://console.cloud.google.com/dataflow/jobs/us-central1/2020-03-04_22_12_10-8555663965859936829?project=apache-beam-testing
Worker logs: https://console.cloud.google.com/dataflow/jobs/us-central1/2020-03-04_22_20_34-10429814810267412980?project=apache-beam-testing
Worker logs: https://console.cloud.google.com/dataflow/jobs/us-central1/2020-03-04_22_29_42-1597475084150564355?project=apache-beam-testing
Worker logs: https://console.cloud.google.com/dataflow/jobs/us-central1/2020-03-04_22_38_30-16477900176253268621?project=apache-beam-testing
Worker logs: https://console.cloud.google.com/dataflow/jobs/us-central1/2020-03-04_22_47_10-7194304563968295097?project=apache-beam-testing
Worker logs: https://console.cloud.google.com/dataflow/jobs/us-central1/2020-03-04_22_56_06-5060116711598148257?project=apache-beam-testing
Worker logs: https://console.cloud.google.com/dataflow/jobs/us-central1/2020-03-04_23_03_45-18212961935985536605?project=apache-beam-testing
test_datastore_wordcount_it (apache_beam.examples.cookbook.datastore_wordcount_it_test.DatastoreWordCountIT) ... SKIP: This test still needs to be fixed on Python 3TODO: BEAM-4543
test_streaming_wordcount_it (apache_beam.examples.streaming_wordcount_it_test.StreamingWordCountIT) ... ok
test_bigquery_tornadoes_it (apache_beam.examples.cookbook.bigquery_tornadoes_it_test.BigqueryTornadoesIT) ... ok
test_autocomplete_it (apache_beam.examples.complete.autocomplete_test.AutocompleteTest) ... ok
test_leader_board_it (apache_beam.examples.complete.game.leader_board_it_test.LeaderBoardIT) ... ok
test_game_stats_it (apache_beam.examples.complete.game.game_stats_it_test.GameStatsIT) ... ok
test_wordcount_it (apache_beam.examples.wordcount_it_test.WordCountIT) ... ok
test_wordcount_fnapi_it (apache_beam.examples.wordcount_it_test.WordCountIT) ... ok
test_user_score_it (apache_beam.examples.complete.game.user_score_it_test.UserScoreIT) ... ok
test_avro_it (apache_beam.examples.fastavro_it_test.FastavroIT) ... ok
test_hourly_team_score_it (apache_beam.examples.complete.game.hourly_team_score_it_test.HourlyTeamScoreIT) ... ok
test_multiple_destinations_transform (apache_beam.io.gcp.bigquery_test.BigQueryStreamingInsertTransformIntegrationTests) ... ok
test_value_provider_transform (apache_beam.io.gcp.bigquery_test.BigQueryStreamingInsertTransformIntegrationTests) ... ok
test_bqfl_streaming (apache_beam.io.gcp.bigquery_file_loads_test.BigQueryFileLoadsIT) ... SKIP: TestStream is not supported on TestDataflowRunner
test_multiple_destinations_transform (apache_beam.io.gcp.bigquery_file_loads_test.BigQueryFileLoadsIT) ... ok
test_one_job_fails_all_jobs_fail (apache_beam.io.gcp.bigquery_file_loads_test.BigQueryFileLoadsIT) ... ok
test_datastore_write_limit (apache_beam.io.gcp.datastore_write_it_test.DatastoreWriteIT) ... SKIP: This test still needs to be fixed on Python 3TODO: BEAM-4543
test_bigquery_read_1M_python (apache_beam.io.gcp.bigquery_io_read_it_test.BigqueryIOReadIT) ... ok
test_bigquery_read_custom_1M_python (apache_beam.io.gcp.bigquery_io_read_it_test.BigqueryIOReadIT) ... ok
test_copy (apache_beam.io.gcp.gcsio_integration_test.GcsIOIntegrationTest) ... ok
test_copy_batch (apache_beam.io.gcp.gcsio_integration_test.GcsIOIntegrationTest) ... ok
test_copy_batch_kms (apache_beam.io.gcp.gcsio_integration_test.GcsIOIntegrationTest) ... ok
test_copy_batch_rewrite_token (apache_beam.io.gcp.gcsio_integration_test.GcsIOIntegrationTest) ... ok
test_copy_kms (apache_beam.io.gcp.gcsio_integration_test.GcsIOIntegrationTest) ... ok
test_copy_rewrite_token (apache_beam.io.gcp.gcsio_integration_test.GcsIOIntegrationTest) ... ok
test_iobase_source (apache_beam.io.gcp.bigquery_read_it_test.ReadNewTypesTests) ... ok
test_native_source (apache_beam.io.gcp.bigquery_read_it_test.ReadNewTypesTests) ... ok
test_iobase_source (apache_beam.io.gcp.bigquery_read_it_test.ReadTests) ... ok
test_native_source (apache_beam.io.gcp.bigquery_read_it_test.ReadTests) ... ok
test_transform_on_gcs (apache_beam.io.fileio_test.MatchIntegrationTest) ... ok
test_parquetio_it (apache_beam.io.parquetio_it_test.TestParquetIT) ... ok
test_file_loads (apache_beam.io.gcp.bigquery_test.PubSubBigQueryIT) ... SKIP: https://issuetracker.google.com/issues/118375066
test_streaming_inserts (apache_beam.io.gcp.bigquery_test.PubSubBigQueryIT) ... ok
test_streaming_data_only (apache_beam.io.gcp.pubsub_integration_test.PubSubIntegrationTest) ... ok
test_streaming_with_attributes (apache_beam.io.gcp.pubsub_integration_test.PubSubIntegrationTest) ... ok
test_text_detection_with_language_hint (apache_beam.ml.gcp.visionml_test_it.VisionMlTestIT) ... ok
test_datastore_write_limit (apache_beam.io.gcp.datastore.v1new.datastore_write_it_test.DatastoreWriteIT) ... ok
test_basic_execution (apache_beam.testing.test_stream_it_test.TestStreamIntegrationTests) ... SKIP: The "TestDataflowRunner", does not support the TestStream transform. Supported runners: ['DirectRunner', 'SwitchingDirectRunner']
Tests that the TestStream supports emitting to multiple PCollections. ... SKIP: The "TestDataflowRunner", does not support the TestStream transform. Supported runners: ['DirectRunner', 'SwitchingDirectRunner']
Tests that the TestStream can independently control output watermarks. ... SKIP: The "TestDataflowRunner", does not support the TestStream transform. Supported runners: ['DirectRunner', 'SwitchingDirectRunner']
test_big_query_legacy_sql (apache_beam.io.gcp.big_query_query_to_table_it_test.BigQueryQueryToTableIT) ... ok
test_big_query_new_types (apache_beam.io.gcp.big_query_query_to_table_it_test.BigQueryQueryToTableIT) ... ok
test_big_query_new_types_native (apache_beam.io.gcp.big_query_query_to_table_it_test.BigQueryQueryToTableIT) ... ok
test_big_query_standard_sql (apache_beam.io.gcp.big_query_query_to_table_it_test.BigQueryQueryToTableIT) ... ok
test_big_query_standard_sql_kms_key_native (apache_beam.io.gcp.big_query_query_to_table_it_test.BigQueryQueryToTableIT) ... ok
test_analyzing_syntax (apache_beam.ml.gcp.naturallanguageml_test_it.NaturalLanguageMlTestIT) ... ok
test_deidentification (apache_beam.ml.gcp.cloud_dlp_it_test.CloudDLPIT) ... ok
test_inspection (apache_beam.ml.gcp.cloud_dlp_it_test.CloudDLPIT) ... ok
Runs streaming Dataflow job and verifies that user metrics are reported ... ok
test_big_query_write (apache_beam.io.gcp.bigquery_write_it_test.BigQueryWriteIntegrationTests) ... ok
test_big_query_write_new_types (apache_beam.io.gcp.bigquery_write_it_test.BigQueryWriteIntegrationTests) ... ok
test_big_query_write_schema_autodetect (apache_beam.io.gcp.bigquery_write_it_test.BigQueryWriteIntegrationTests) ... SKIP: DataflowRunner does not support schema autodetection
test_big_query_write_without_schema (apache_beam.io.gcp.bigquery_write_it_test.BigQueryWriteIntegrationTests) ... ok
test_job_python_from_python_it (apache_beam.transforms.external_it_test.ExternalTransformIT) ... ok
test_metrics_fnapi_it (apache_beam.runners.dataflow.dataflow_exercise_metrics_pipeline_test.ExerciseMetricsPipelineTest) ... ok
test_metrics_it (apache_beam.runners.dataflow.dataflow_exercise_metrics_pipeline_test.ExerciseMetricsPipelineTest) ... ok

----------------------------------------------------------------------
XML: nosetests-postCommitIT-df-py36.xml
----------------------------------------------------------------------
XML: <https://builds.apache.org/job/beam_PostCommit_Python36/ws/src/sdks/python/nosetests.xml>
----------------------------------------------------------------------
Ran 56 tests in 3890.012s

OK (SKIP=8)

FAILURE: Build failed with an exception.

* Where:
Build file '<https://builds.apache.org/job/beam_PostCommit_Python36/ws/src/sdks/python/test-suites/direct/py36/build.gradle'> line: 51

* What went wrong:
Execution failed for task ':sdks:python:test-suites:direct:py36:postCommitIT'.
> Process 'command 'sh'' finished with non-zero exit value 1

* Try:
Run with --stacktrace option to get the stack trace. Run with --info or --debug option to get more log output. Run with --scan to get full insights.

* Get more help at https://help.gradle.org

Deprecated Gradle features were used in this build, making it incompatible with Gradle 6.0.
Use '--warning-mode all' to show the individual deprecation warnings.
See https://docs.gradle.org/5.2.1/userguide/command_line_interface.html#sec:command_line_warnings

BUILD FAILED in 1h 6m 15s
86 actionable tasks: 65 executed, 21 from cache

Publishing build scan...
https://gradle.com/s/eczkkjlh3c5eo

Build step 'Invoke Gradle script' changed build result to FAILURE
Build step 'Invoke Gradle script' marked build as failure

---------------------------------------------------------------------
To unsubscribe, e-mail: builds-unsubscribe@beam.apache.org
For additional commands, e-mail: builds-help@beam.apache.org


Build failed in Jenkins: beam_PostCommit_Python36 #1896

Posted by Apache Jenkins Server <je...@builds.apache.org>.
See <https://builds.apache.org/job/beam_PostCommit_Python36/1896/display/redirect?page=changes>

Changes:

[filiperegadas] Add BigQuery useAvroLogicalTypes option

[filiperegadas] fixup! Add BigQuery useAvroLogicalTypes option


------------------------------------------
[...truncated 74.42 KB...]
	at org.gradle.api.internal.tasks.execution.SkipTaskWithNoActionsExecuter.execute(SkipTaskWithNoActionsExecuter.java:57)
	at org.gradle.api.internal.tasks.execution.SkipOnlyIfTaskExecuter.execute(SkipOnlyIfTaskExecuter.java:56)
	at org.gradle.api.internal.tasks.execution.CatchExceptionTaskExecuter.execute(CatchExceptionTaskExecuter.java:36)
	at org.gradle.api.internal.tasks.execution.EventFiringTaskExecuter$1.executeTask(EventFiringTaskExecuter.java:63)
	at org.gradle.api.internal.tasks.execution.EventFiringTaskExecuter$1.call(EventFiringTaskExecuter.java:49)
	at org.gradle.api.internal.tasks.execution.EventFiringTaskExecuter$1.call(EventFiringTaskExecuter.java:46)
	at org.gradle.internal.operations.DefaultBuildOperationExecutor$CallableBuildOperationWorker.execute(DefaultBuildOperationExecutor.java:416)
	at org.gradle.internal.operations.DefaultBuildOperationExecutor$CallableBuildOperationWorker.execute(DefaultBuildOperationExecutor.java:406)
	at org.gradle.internal.operations.DefaultBuildOperationExecutor$1.execute(DefaultBuildOperationExecutor.java:165)
	at org.gradle.internal.operations.DefaultBuildOperationExecutor.execute(DefaultBuildOperationExecutor.java:250)
	at org.gradle.internal.operations.DefaultBuildOperationExecutor.execute(DefaultBuildOperationExecutor.java:158)
	at org.gradle.internal.operations.DefaultBuildOperationExecutor.call(DefaultBuildOperationExecutor.java:102)
	at org.gradle.internal.operations.DelegatingBuildOperationExecutor.call(DelegatingBuildOperationExecutor.java:36)
	at org.gradle.api.internal.tasks.execution.EventFiringTaskExecuter.execute(EventFiringTaskExecuter.java:46)
	at org.gradle.execution.plan.LocalTaskNodeExecutor.execute(LocalTaskNodeExecutor.java:43)
	at org.gradle.execution.taskgraph.DefaultTaskExecutionGraph$InvokeNodeExecutorsAction.execute(DefaultTaskExecutionGraph.java:355)
	at org.gradle.execution.taskgraph.DefaultTaskExecutionGraph$InvokeNodeExecutorsAction.execute(DefaultTaskExecutionGraph.java:343)
	at org.gradle.execution.taskgraph.DefaultTaskExecutionGraph$BuildOperationAwareExecutionAction.execute(DefaultTaskExecutionGraph.java:336)
	at org.gradle.execution.taskgraph.DefaultTaskExecutionGraph$BuildOperationAwareExecutionAction.execute(DefaultTaskExecutionGraph.java:322)
	at org.gradle.execution.plan.DefaultPlanExecutor$ExecutorWorker$1.execute(DefaultPlanExecutor.java:134)
	at org.gradle.execution.plan.DefaultPlanExecutor$ExecutorWorker$1.execute(DefaultPlanExecutor.java:129)
	at org.gradle.execution.plan.DefaultPlanExecutor$ExecutorWorker.execute(DefaultPlanExecutor.java:202)
	at org.gradle.execution.plan.DefaultPlanExecutor$ExecutorWorker.executeNextNode(DefaultPlanExecutor.java:193)
	at org.gradle.execution.plan.DefaultPlanExecutor$ExecutorWorker.run(DefaultPlanExecutor.java:129)
	at org.gradle.internal.concurrent.ExecutorPolicy$CatchAndRecordFailures.onExecute(ExecutorPolicy.java:63)
	at org.gradle.internal.concurrent.ManagedExecutorImpl$1.run(ManagedExecutorImpl.java:46)
	at java.util.concurrent.ThreadPoolExecutor.runWorker(ThreadPoolExecutor.java:1149)
	at java.util.concurrent.ThreadPoolExecutor$Worker.run(ThreadPoolExecutor.java:624)
	at org.gradle.internal.concurrent.ThreadFactoryImpl$ManagedThreadRunnable.run(ThreadFactoryImpl.java:55)
	at java.lang.Thread.run(Thread.java:748)
Caused by: org.gradle.api.GradleException: Failed to unpack trees for task ':runners:spark:compileJava'
	at org.gradle.caching.internal.command.BuildCacheCommandFactory$LoadCommand.load(BuildCacheCommandFactory.java:136)
	at org.gradle.caching.internal.controller.DefaultBuildCacheController$Unpack$1.run(DefaultBuildCacheController.java:179)
	at org.gradle.internal.operations.DefaultBuildOperationExecutor$RunnableBuildOperationWorker.execute(DefaultBuildOperationExecutor.java:402)
	at org.gradle.internal.operations.DefaultBuildOperationExecutor$RunnableBuildOperationWorker.execute(DefaultBuildOperationExecutor.java:394)
	at org.gradle.internal.operations.DefaultBuildOperationExecutor$1.execute(DefaultBuildOperationExecutor.java:165)
	at org.gradle.internal.operations.DefaultBuildOperationExecutor.execute(DefaultBuildOperationExecutor.java:250)
	at org.gradle.internal.operations.DefaultBuildOperationExecutor.execute(DefaultBuildOperationExecutor.java:158)
	at org.gradle.internal.operations.DefaultBuildOperationExecutor.run(DefaultBuildOperationExecutor.java:92)
	at org.gradle.internal.operations.DelegatingBuildOperationExecutor.run(DelegatingBuildOperationExecutor.java:31)
	at org.gradle.caching.internal.controller.DefaultBuildCacheController$Unpack.execute(DefaultBuildCacheController.java:175)
	at org.gradle.caching.internal.controller.DefaultBuildCacheController$Unpack.execute(DefaultBuildCacheController.java:164)
	at org.gradle.caching.local.internal.DirectoryBuildCacheService.loadInsideLock(DirectoryBuildCacheService.java:117)
	at org.gradle.caching.local.internal.DirectoryBuildCacheService.access$200(DirectoryBuildCacheService.java:42)
	at org.gradle.caching.local.internal.DirectoryBuildCacheService$1.run(DirectoryBuildCacheService.java:99)
	at org.gradle.internal.Factories$1.create(Factories.java:25)
	at org.gradle.cache.internal.LockOnDemandCrossProcessCacheAccess.withFileLock(LockOnDemandCrossProcessCacheAccess.java:90)
	at org.gradle.cache.internal.DefaultCacheAccess.withFileLock(DefaultCacheAccess.java:199)
	at org.gradle.cache.internal.DefaultPersistentDirectoryStore.withFileLock(DefaultPersistentDirectoryStore.java:175)
	at org.gradle.cache.internal.DefaultCacheFactory$ReferenceTrackingCache.withFileLock(DefaultCacheFactory.java:199)
	at org.gradle.caching.local.internal.DirectoryBuildCacheService.loadLocally(DirectoryBuildCacheService.java:94)
	at org.gradle.caching.internal.controller.service.DefaultLocalBuildCacheServiceHandle.load(DefaultLocalBuildCacheServiceHandle.java:49)
	at org.gradle.caching.internal.controller.DefaultBuildCacheController.load(DefaultBuildCacheController.java:115)
	... 58 more
Caused by: java.io.IOException: Unable to create directory <https://builds.apache.org/job/beam_PostCommit_Python36/ws/src/runners/spark/build/classes/java/main/org/apache/beam>
	at org.apache.commons.io.FileUtils.forceMkdir(FileUtils.java:2491)
	at org.gradle.caching.internal.packaging.impl.TarBuildCacheEntryPacker.unpackDirectoryTree(TarBuildCacheEntryPacker.java:305)
	at org.gradle.caching.internal.packaging.impl.TarBuildCacheEntryPacker.unpackTree(TarBuildCacheEntryPacker.java:254)
	at org.gradle.caching.internal.packaging.impl.TarBuildCacheEntryPacker.unpack(TarBuildCacheEntryPacker.java:198)
	at org.gradle.caching.internal.packaging.impl.TarBuildCacheEntryPacker.unpack(TarBuildCacheEntryPacker.java:158)
	at org.gradle.caching.internal.packaging.impl.GZipBuildCacheEntryPacker.unpack(GZipBuildCacheEntryPacker.java:49)
	at org.gradle.caching.internal.command.BuildCacheCommandFactory$LoadCommand.load(BuildCacheCommandFactory.java:103)
	... 79 more

> Task :runners:google-cloud-dataflow-java:jar

> Task :sdks:python:test-suites:dataflow:py36:installGcpTest
Processing /home/jenkins/.cache/pip/wheels/d6/c2/92/837e8a4d649a209dff85b38d7fbb576b4b480738be70865f29/google_apitools-0.5.28-cp36-none-any.whl
Collecting google-cloud-datastore<1.8.0,>=1.7.1
  Using cached google_cloud_datastore-1.7.4-py2.py3-none-any.whl (82 kB)
Collecting google-cloud-pubsub<1.1.0,>=0.39.0
  Using cached google_cloud_pubsub-1.0.2-py2.py3-none-any.whl (118 kB)
Collecting google-cloud-bigquery<=1.24.0,>=1.6.0
  Using cached google_cloud_bigquery-1.24.0-py2.py3-none-any.whl (165 kB)
Collecting google-cloud-core<2,>=0.28.1
  Using cached google_cloud_core-1.3.0-py2.py3-none-any.whl (26 kB)
Collecting google-cloud-bigtable<1.1.0,>=0.31.1
  Using cached google_cloud_bigtable-1.0.0-py2.py3-none-any.whl (232 kB)
Collecting google-cloud-spanner<1.14.0,>=1.13.0
  Using cached google_cloud_spanner-1.13.0-py2.py3-none-any.whl (212 kB)
Collecting grpcio-gcp<1,>=0.2.2
  Using cached grpcio_gcp-0.2.2-py2.py3-none-any.whl (9.4 kB)
Collecting google-cloud-dlp<=0.13.0,>=0.12.0
  Using cached google_cloud_dlp-0.13.0-py2.py3-none-any.whl (151 kB)
Collecting google-cloud-language<2,>=1.3.0
  Using cached google_cloud_language-1.3.0-py2.py3-none-any.whl (83 kB)
Collecting google-cloud-videointelligence<1.14.0,>=1.8.0
  Using cached google_cloud_videointelligence-1.13.0-py2.py3-none-any.whl (177 kB)
Collecting google-cloud-vision<0.43.0,>=0.38.0
  Using cached google_cloud_vision-0.42.0-py2.py3-none-any.whl (435 kB)
Collecting freezegun>=0.3.12
  Using cached freezegun-0.3.15-py2.py3-none-any.whl (14 kB)
Collecting nose>=1.3.7
  Using cached nose-1.3.7-py3-none-any.whl (154 kB)
Processing /home/jenkins/.cache/pip/wheels/c4/1f/cd/9250fbf2fcc179e28bb4f7ee26a4fc7525914469d83a4f0c09/nose_xunitmp-0.4.1-cp36-none-any.whl
Collecting pandas<0.25,>=0.23.4
  Using cached pandas-0.24.2-cp36-cp36m-manylinux1_x86_64.whl (10.1 MB)
Collecting parameterized<0.8.0,>=0.7.1
  Using cached parameterized-0.7.1-py2.py3-none-any.whl (24 kB)
Collecting pyhamcrest!=1.10.0,<2.0.0,>=1.9
  Using cached PyHamcrest-1.10.1-py3-none-any.whl (48 kB)
Processing /home/jenkins/.cache/pip/wheels/e4/76/4d/a95b8dd7b452b69e8ed4f68b69e1b55e12c9c9624dd962b191/PyYAML-5.3-cp36-cp36m-linux_x86_64.whl
Collecting requests_mock<2.0,>=1.7
  Using cached requests_mock-1.7.0-py2.py3-none-any.whl (23 kB)
Collecting tenacity<6.0,>=5.0.2
  Using cached tenacity-5.1.5-py2.py3-none-any.whl (34 kB)
Collecting pytest<5.0,>=4.4.0
  Using cached pytest-4.6.9-py2.py3-none-any.whl (231 kB)
Collecting pytest-xdist<2,>=1.29.0
  Using cached pytest_xdist-1.31.0-py2.py3-none-any.whl (36 kB)
Collecting pytest-timeout<2,>=1.3.3
  Using cached pytest_timeout-1.3.4-py2.py3-none-any.whl (10 kB)
Requirement already satisfied: six>=1.5.2 in <https://builds.apache.org/job/beam_PostCommit_Python36/ws/src/build/gradleenv/-1734967053/lib/python3.6/site-packages> (from grpcio<2,>=1.12.1->apache-beam==2.21.0.dev0) (1.14.0)
Collecting requests>=2.7.0
  Using cached requests-2.23.0-py2.py3-none-any.whl (58 kB)
Processing /home/jenkins/.cache/pip/wheels/9b/04/dd/7daf4150b6d9b12949298737de9431a324d4b797ffd63f526e/docopt-0.6.2-py2.py3-none-any.whl
Collecting pbr>=0.11
  Using cached pbr-5.4.4-py2.py3-none-any.whl (110 kB)
Collecting pyasn1>=0.1.7
  Using cached pyasn1-0.4.8-py2.py3-none-any.whl (77 kB)
Collecting rsa>=3.1.4
  Using cached rsa-4.0-py2.py3-none-any.whl (38 kB)
Collecting pyasn1-modules>=0.0.5
  Using cached pyasn1_modules-0.2.8-py2.py3-none-any.whl (155 kB)
Requirement already satisfied: setuptools in <https://builds.apache.org/job/beam_PostCommit_Python36/ws/src/build/gradleenv/-1734967053/lib/python3.6/site-packages> (from protobuf<4,>=3.5.0.post1->apache-beam==2.21.0.dev0) (45.2.0)
Collecting pyparsing>=2.1.4
  Using cached pyparsing-2.4.6-py2.py3-none-any.whl (67 kB)
Collecting fasteners>=0.14
  Using cached fasteners-0.15-py2.py3-none-any.whl (23 kB)
Collecting google-api-core[grpc]<2.0.0dev,>=1.6.0
  Using cached google_api_core-1.16.0-py2.py3-none-any.whl (70 kB)
Processing /home/jenkins/.cache/pip/wheels/de/3a/83/77a1e18e1a8757186df834b86ce6800120ac9c79cd8ca4091b/grpc_google_iam_v1-0.12.3-cp36-none-any.whl
Collecting google-resumable-media<0.6dev,>=0.5.0
  Using cached google_resumable_media-0.5.0-py2.py3-none-any.whl (38 kB)
Collecting google-auth<2.0dev,>=1.9.0
  Using cached google_auth-1.11.2-py2.py3-none-any.whl (76 kB)
Collecting wcwidth
  Using cached wcwidth-0.1.8-py2.py3-none-any.whl (17 kB)
Collecting packaging
  Using cached packaging-20.1-py2.py3-none-any.whl (36 kB)
Requirement already satisfied: importlib-metadata>=0.12; python_version < "3.8" in <https://builds.apache.org/job/beam_PostCommit_Python36/ws/src/build/gradleenv/-1734967053/lib/python3.6/site-packages> (from pytest<5.0,>=4.4.0->apache-beam==2.21.0.dev0) (1.5.0)
Requirement already satisfied: py>=1.5.0 in <https://builds.apache.org/job/beam_PostCommit_Python36/ws/src/build/gradleenv/-1734967053/lib/python3.6/site-packages> (from pytest<5.0,>=4.4.0->apache-beam==2.21.0.dev0) (1.8.1)
Requirement already satisfied: pluggy<1.0,>=0.12 in <https://builds.apache.org/job/beam_PostCommit_Python36/ws/src/build/gradleenv/-1734967053/lib/python3.6/site-packages> (from pytest<5.0,>=4.4.0->apache-beam==2.21.0.dev0) (0.13.1)
Collecting attrs>=17.4.0
  Using cached attrs-19.3.0-py2.py3-none-any.whl (39 kB)
Collecting more-itertools>=4.0.0; python_version > "2.7"
  Using cached more_itertools-8.2.0-py3-none-any.whl (43 kB)
Collecting atomicwrites>=1.0
  Using cached atomicwrites-1.3.0-py2.py3-none-any.whl (5.9 kB)
Collecting execnet>=1.1
  Using cached execnet-1.7.1-py2.py3-none-any.whl (39 kB)
Collecting pytest-forked
  Using cached pytest_forked-1.1.3-py2.py3-none-any.whl (4.5 kB)
Collecting idna<3,>=2.5
  Using cached idna-2.9-py2.py3-none-any.whl (58 kB)

> Task :runners:spark:compileJava
Note: Some input files use or override a deprecated API.
Note: Recompile with -Xlint:deprecation for details.
Note: Some input files use unchecked or unsafe operations.
Note: Recompile with -Xlint:unchecked for details.

> Task :runners:spark:classes
> Task :runners:spark:jar
> Task :runners:spark:job-server:compileJava NO-SOURCE
> Task :runners:spark:job-server:classes UP-TO-DATE

> Task :sdks:python:test-suites:dataflow:py36:installGcpTest
Collecting certifi>=2017.4.17
  Using cached certifi-2019.11.28-py2.py3-none-any.whl (156 kB)
Collecting urllib3!=1.25.0,!=1.25.1,<1.26,>=1.21.1
  Using cached urllib3-1.25.8-py2.py3-none-any.whl (125 kB)
Collecting chardet<4,>=3.0.2
  Using cached chardet-3.0.4-py2.py3-none-any.whl (133 kB)
Collecting monotonic>=0.1
  Using cached monotonic-1.5-py2.py3-none-any.whl (5.3 kB)
Processing /home/jenkins/.cache/pip/wheels/2c/f9/7f/6eb87e636072bf467e25348bbeb96849333e6a080dca78f706/googleapis_common_protos-1.51.0-cp36-none-any.whl
Requirement already satisfied: zipp>=0.5 in <https://builds.apache.org/job/beam_PostCommit_Python36/ws/src/build/gradleenv/-1734967053/lib/python3.6/site-packages> (from importlib-metadata>=0.12; python_version < "3.8"->pytest<5.0,>=4.4.0->apache-beam==2.21.0.dev0) (3.1.0)
Collecting apipkg>=1.4
  Using cached apipkg-1.5-py2.py3-none-any.whl (4.9 kB)
Building wheels for collected packages: apache-beam
  Building wheel for apache-beam (setup.py): started
  Building wheel for apache-beam (setup.py): finished with status 'done'
  Created wheel for apache-beam: filename=apache_beam-2.21.0.dev0-py3-none-any.whl size=1955560 sha256=0fe8d86d9eef5caa8cbefe43cdbdc1faecc22e647ddea78b89fc361835210451
  Stored in directory: /home/jenkins/.cache/pip/wheels/b6/99/80/8e9de2138ad4625b1ed70fb0682f92647ce81ba8787521889d
Successfully built apache-beam
Installing collected packages: crcmod, dill, fastavro, idna, certifi, urllib3, chardet, requests, docopt, hdfs, httplib2, pbr, mock, numpy, pymongo, pyasn1, rsa, pyasn1-modules, oauth2client, pyparsing, pydot, python-dateutil, pytz, typing, typing-extensions, avro-python3, pyarrow, cachetools, monotonic, fasteners, google-apitools, googleapis-common-protos, google-auth, google-api-core, google-cloud-core, google-cloud-datastore, grpc-google-iam-v1, google-cloud-pubsub, google-resumable-media, google-cloud-bigquery, google-cloud-bigtable, google-cloud-spanner, grpcio-gcp, google-cloud-dlp, google-cloud-language, google-cloud-videointelligence, google-cloud-vision, freezegun, nose, nose-xunitmp, pandas, parameterized, pyhamcrest, pyyaml, requests-mock, tenacity, wcwidth, packaging, attrs, more-itertools, atomicwrites, pytest, apipkg, execnet, pytest-forked, pytest-xdist, pytest-timeout, apache-beam
ERROR: Could not install packages due to an EnvironmentError: [Errno 28] No space left on device


> Task :sdks:python:test-suites:dataflow:py36:installGcpTest FAILED
> Task :runners:flink:1.9:job-server:shadowJar

> Task :runners:google-cloud-dataflow-java:worker:compileJava
Note: Some input files use or override a deprecated API.
Note: Recompile with -Xlint:deprecation for details.
Note: Some input files use unchecked or unsafe operations.
Note: Recompile with -Xlint:unchecked for details.

> Task :runners:google-cloud-dataflow-java:worker:classes
> Task :runners:spark:job-server:shadowJar
> Task :runners:google-cloud-dataflow-java:worker:shadowJar

FAILURE: Build completed with 3 failures.

1: Task failed with an exception.
-----------
* What went wrong:
Execution failed for task ':sdks:python:test-suites:direct:py36:installGcpTest'.
> Process 'command 'sh'' finished with non-zero exit value 1

* Try:
Run with --stacktrace option to get the stack trace. Run with --info or --debug option to get more log output. Run with --scan to get full insights.
==============================================================================

2: Task failed with an exception.
-----------
* What went wrong:
Execution failed for task ':sdks:python:test-suites:portable:py36:installGcpTest'.
> Process 'command 'sh'' finished with non-zero exit value 1

* Try:
Run with --stacktrace option to get the stack trace. Run with --info or --debug option to get more log output. Run with --scan to get full insights.
==============================================================================

3: Task failed with an exception.
-----------
* What went wrong:
Execution failed for task ':sdks:python:test-suites:dataflow:py36:installGcpTest'.
> Process 'command 'sh'' finished with non-zero exit value 1

* Try:
Run with --stacktrace option to get the stack trace. Run with --info or --debug option to get more log output. Run with --scan to get full insights.
==============================================================================

* Get more help at https://help.gradle.org

Deprecated Gradle features were used in this build, making it incompatible with Gradle 6.0.
Use '--warning-mode all' to show the individual deprecation warnings.
See https://docs.gradle.org/5.2.1/userguide/command_line_interface.html#sec:command_line_warnings

BUILD FAILED in 1m 53s
80 actionable tasks: 62 executed, 18 from cache

Publishing build scan...
https://gradle.com/s/4sfalphzyjgiq

Build step 'Invoke Gradle script' changed build result to FAILURE
Build step 'Invoke Gradle script' marked build as failure

---------------------------------------------------------------------
To unsubscribe, e-mail: builds-unsubscribe@beam.apache.org
For additional commands, e-mail: builds-help@beam.apache.org