You are viewing a plain text version of this content. The canonical link for it is here.
Posted to dev@zookeeper.apache.org by Apache Jenkins Server <je...@builds.apache.org> on 2018/02/20 23:35:30 UTC

ZooKeeper-trunk - Build # 3734 - Still Failing

See https://builds.apache.org/job/ZooKeeper-trunk/3734/

###################################################################################
########################## LAST 60 LINES OF THE CONSOLE ###########################
[...truncated 142.91 KB...]
    [junit] Running org.apache.zookeeper.test.StatTest in thread 6
    [junit] Tests run: 4, Failures: 0, Errors: 0, Skipped: 0, Time elapsed: 1.12 sec, Thread: 6, Class: org.apache.zookeeper.test.StatTest
    [junit] Running org.apache.zookeeper.test.StaticHostProviderTest in thread 6
    [junit] Tests run: 13, Failures: 0, Errors: 0, Skipped: 0, Time elapsed: 3.5 sec, Thread: 6, Class: org.apache.zookeeper.test.StaticHostProviderTest
    [junit] Running org.apache.zookeeper.test.StringUtilTest in thread 6
    [junit] Tests run: 1, Failures: 0, Errors: 0, Skipped: 0, Time elapsed: 0.082 sec, Thread: 6, Class: org.apache.zookeeper.test.StringUtilTest
    [junit] Running org.apache.zookeeper.test.SyncCallTest in thread 6
    [junit] Tests run: 1, Failures: 0, Errors: 0, Skipped: 0, Time elapsed: 0.901 sec, Thread: 6, Class: org.apache.zookeeper.test.SyncCallTest
    [junit] Running org.apache.zookeeper.test.TruncateTest in thread 6
    [junit] Tests run: 2, Failures: 0, Errors: 0, Skipped: 0, Time elapsed: 73.461 sec, Thread: 1, Class: org.apache.zookeeper.test.QuorumZxidSyncTest
    [junit] Tests run: 14, Failures: 0, Errors: 1, Skipped: 1, Time elapsed: 83.224 sec, Thread: 2, Class: org.apache.zookeeper.test.QuorumTest
    [junit] Test org.apache.zookeeper.test.QuorumTest FAILED
    [junit] Running org.apache.zookeeper.test.WatchEventWhenAutoResetTest in thread 2
    [junit] Running org.apache.zookeeper.test.WatchedEventTest in thread 1
    [junit] Tests run: 4, Failures: 0, Errors: 0, Skipped: 0, Time elapsed: 0.095 sec, Thread: 1, Class: org.apache.zookeeper.test.WatchedEventTest
    [junit] Tests run: 3, Failures: 0, Errors: 0, Skipped: 0, Time elapsed: 6.295 sec, Thread: 6, Class: org.apache.zookeeper.test.TruncateTest
    [junit] Tests run: 4, Failures: 0, Errors: 0, Skipped: 0, Time elapsed: 20.371 sec, Thread: 3, Class: org.apache.zookeeper.test.SessionUpgradeTest
    [junit] Running org.apache.zookeeper.test.WatcherFuncTest in thread 1
    [junit] Running org.apache.zookeeper.test.WatcherTest in thread 6
    [junit] Running org.apache.zookeeper.test.X509AuthTest in thread 3
    [junit] Tests run: 3, Failures: 0, Errors: 0, Skipped: 0, Time elapsed: 0.104 sec, Thread: 3, Class: org.apache.zookeeper.test.X509AuthTest
    [junit] Running org.apache.zookeeper.test.ZkDatabaseCorruptionTest in thread 3
    [junit] Tests run: 6, Failures: 0, Errors: 0, Skipped: 0, Time elapsed: 1.438 sec, Thread: 1, Class: org.apache.zookeeper.test.WatcherFuncTest
    [junit] Running org.apache.zookeeper.test.ZooKeeperQuotaTest in thread 1
    [junit] Tests run: 1, Failures: 0, Errors: 0, Skipped: 0, Time elapsed: 0.831 sec, Thread: 1, Class: org.apache.zookeeper.test.ZooKeeperQuotaTest
    [junit] Tests run: 6, Failures: 0, Errors: 0, Skipped: 0, Time elapsed: 34.849 sec, Thread: 7, Class: org.apache.zookeeper.test.SessionTest
    [junit] Tests run: 1, Failures: 0, Errors: 0, Skipped: 0, Time elapsed: 13.713 sec, Thread: 3, Class: org.apache.zookeeper.test.ZkDatabaseCorruptionTest
    [junit] Tests run: 4, Failures: 0, Errors: 0, Skipped: 0, Time elapsed: 23.742 sec, Thread: 2, Class: org.apache.zookeeper.test.WatchEventWhenAutoResetTest
    [junit] Tests run: 7, Failures: 0, Errors: 0, Skipped: 0, Time elapsed: 29.665 sec, Thread: 6, Class: org.apache.zookeeper.test.WatcherTest
    [junit] Tests run: 13, Failures: 0, Errors: 0, Skipped: 0, Time elapsed: 263.638 sec, Thread: 5, Class: org.apache.zookeeper.test.ReconfigTest
    [junit] Tests run: 105, Failures: 0, Errors: 0, Skipped: 0, Time elapsed: 350.958 sec, Thread: 8, Class: org.apache.zookeeper.test.NettyNettySuiteTest
    [junit] Tests run: 105, Failures: 1, Errors: 0, Skipped: 0, Time elapsed: 388.739 sec, Thread: 4, Class: org.apache.zookeeper.test.NioNettySuiteTest
    [junit] Test org.apache.zookeeper.test.NioNettySuiteTest FAILED

fail.build.on.test.failure:

BUILD FAILED
/home/jenkins/jenkins-slave/workspace/ZooKeeper-trunk@2/build.xml:1395: The following error occurred while executing this line:
/home/jenkins/jenkins-slave/workspace/ZooKeeper-trunk@2/build.xml:1276: The following error occurred while executing this line:
/home/jenkins/jenkins-slave/workspace/ZooKeeper-trunk@2/build.xml:1280: Tests failed!

Total time: 9 minutes 59 seconds
Build step 'Execute shell' marked build as failure
[FINDBUGS] Skipping publisher since build result is FAILURE
[WARNINGS] Skipping publisher since build result is FAILURE
Archiving artifacts
Setting JDK_1_7_LATEST__HOME=/home/jenkins/tools/java/latest1.7
Recording fingerprints
Setting JDK_1_7_LATEST__HOME=/home/jenkins/tools/java/latest1.7
JIRA: Update relevant issues is waiting for a checkpoint on ZooKeeper-trunk #3733
Recording test results
Setting JDK_1_7_LATEST__HOME=/home/jenkins/tools/java/latest1.7
Publishing Javadoc
Setting JDK_1_7_LATEST__HOME=/home/jenkins/tools/java/latest1.7
Setting JDK_1_7_LATEST__HOME=/home/jenkins/tools/java/latest1.7
Email was triggered for: Failure - Any
Sending email for trigger: Failure - Any
Setting JDK_1_7_LATEST__HOME=/home/jenkins/tools/java/latest1.7
Setting JDK_1_7_LATEST__HOME=/home/jenkins/tools/java/latest1.7



###################################################################################
############################## FAILED TESTS (if any) ##############################
11 tests failed.
FAILED:  org.apache.zookeeper.server.quorum.ReconfigBackupTest.testReconfigCreateNewVersionFile

Error Message:
null

Stack Trace:
junit.framework.AssertionFailedError
	at org.apache.zookeeper.server.quorum.ReconfigBackupTest.testReconfigCreateNewVersionFile(ReconfigBackupTest.java:221)
	at org.apache.zookeeper.JUnit4ZKTestRunner$LoggedInvokeMethod.evaluate(JUnit4ZKTestRunner.java:79)


FAILED:  org.apache.zookeeper.test.AsyncHammerTest.testHammer

Error Message:
waiting for server up

Stack Trace:
junit.framework.AssertionFailedError: waiting for server up
	at org.apache.zookeeper.test.QuorumBase.startServers(QuorumBase.java:224)
	at org.apache.zookeeper.test.QuorumBase.startServers(QuorumBase.java:133)
	at org.apache.zookeeper.test.AsyncHammerTest.restart(AsyncHammerTest.java:61)
	at org.apache.zookeeper.test.AsyncHammerTest.testHammer(AsyncHammerTest.java:192)
	at org.apache.zookeeper.JUnit4ZKTestRunner$LoggedInvokeMethod.evaluate(JUnit4ZKTestRunner.java:79)


FAILED:  org.apache.zookeeper.test.MultiTransactionTest.testGetResults[1]

Error Message:
Unable to connect to server

Stack Trace:
junit.framework.AssertionFailedError: Unable to connect to server
	at org.apache.zookeeper.test.ClientBase.createClient(ClientBase.java:231)
	at org.apache.zookeeper.test.ClientBase.createClient(ClientBase.java:220)
	at org.apache.zookeeper.test.ClientBase.createClient(ClientBase.java:205)
	at org.apache.zookeeper.test.ClientBase.createClient(ClientBase.java:198)
	at org.apache.zookeeper.test.MultiTransactionTest.setUp(MultiTransactionTest.java:82)


FAILED:  org.apache.zookeeper.test.NIOConnectionFactoryFdLeakTest.testFileDescriptorLeak

Error Message:
unable to create new native thread

Stack Trace:
java.lang.OutOfMemoryError: unable to create new native thread
	at java.lang.Thread.start0(Native Method)
	at java.lang.Thread.start(Thread.java:714)
	at org.apache.zookeeper.server.NIOServerCnxnFactory.start(NIOServerCnxnFactory.java:751)
	at org.apache.zookeeper.test.NIOConnectionFactoryFdLeakTest.testFileDescriptorLeak(NIOConnectionFactoryFdLeakTest.java:57)
	at org.apache.zookeeper.JUnit4ZKTestRunner$LoggedInvokeMethod.evaluate(JUnit4ZKTestRunner.java:79)


FAILED:  org.apache.zookeeper.test.AsyncHammerTest.testHammer

Error Message:
unable to create new native thread

Stack Trace:
java.lang.OutOfMemoryError: unable to create new native thread
	at java.lang.Thread.start0(Native Method)
	at java.lang.Thread.start(Thread.java:714)
	at org.apache.zookeeper.test.AsyncHammerTest.testHammer(AsyncHammerTest.java:176)
	at org.apache.zookeeper.JUnit4ZKTestRunner$LoggedInvokeMethod.evaluate(JUnit4ZKTestRunner.java:79)


FAILED:  org.apache.zookeeper.test.ReconfigTest.testQuorumSystemChange

Error Message:
waiting for server up

Stack Trace:
junit.framework.AssertionFailedError: waiting for server up
	at org.apache.zookeeper.test.QuorumUtil.startAll(QuorumUtil.java:151)
	at org.apache.zookeeper.test.ReconfigTest.testQuorumSystemChange(ReconfigTest.java:818)
	at org.apache.zookeeper.JUnit4ZKTestRunner$LoggedInvokeMethod.evaluate(JUnit4ZKTestRunner.java:79)


FAILED:  org.apache.zookeeper.test.QuorumTest.testLeaderShutdown

Error Message:
unable to create new native thread

Stack Trace:
java.lang.OutOfMemoryError: unable to create new native thread
	at java.lang.Thread.start0(Native Method)
	at java.lang.Thread.start(Thread.java:714)
	at org.apache.zookeeper.server.NIOServerCnxnFactory.start(NIOServerCnxnFactory.java:746)
	at org.apache.zookeeper.server.quorum.QuorumPeer.startServerCnxnFactory(QuorumPeer.java:1688)
	at org.apache.zookeeper.server.quorum.QuorumPeer.start(QuorumPeer.java:853)
	at org.apache.zookeeper.test.QuorumBase.startServers(QuorumBase.java:219)
	at org.apache.zookeeper.test.QuorumBase.setUp(QuorumBase.java:121)
	at org.apache.zookeeper.test.QuorumBase.setUp(QuorumBase.java:79)
	at org.apache.zookeeper.test.QuorumTest.setUp(QuorumTest.java:60)


FAILED:  org.apache.zookeeper.server.ZooKeeperServerMainTest.testReadOnlySnapshotDir

Error Message:
waiting for server being up

Stack Trace:
junit.framework.AssertionFailedError: waiting for server being up
	at org.apache.zookeeper.server.ZooKeeperServerMainTest.testReadOnlySnapshotDir(ZooKeeperServerMainTest.java:235)
	at org.apache.zookeeper.JUnit4ZKTestRunner$LoggedInvokeMethod.evaluate(JUnit4ZKTestRunner.java:79)
	at java.util.concurrent.FutureTask.run(FutureTask.java:262)
	at java.lang.Thread.run(Thread.java:745)


FAILED:  org.apache.zookeeper.server.quorum.QuorumPeerMainTest.testEarlyLeaderAbandonment

Error Message:
Waiting too long

Stack Trace:
java.lang.RuntimeException: Waiting too long
	at org.apache.zookeeper.server.quorum.QuorumPeerMainTest.waitForAll(QuorumPeerMainTest.java:450)
	at org.apache.zookeeper.server.quorum.QuorumPeerMainTest.testEarlyLeaderAbandonment(QuorumPeerMainTest.java:178)
	at org.apache.zookeeper.JUnit4ZKTestRunner$LoggedInvokeMethod.evaluate(JUnit4ZKTestRunner.java:79)


FAILED:  org.apache.zookeeper.test.AsyncHammerTest.testObserversHammer

Error Message:
Couldn't instantiate org.apache.zookeeper.server.NettyServerCnxnFactory

Stack Trace:
java.io.IOException: Couldn't instantiate org.apache.zookeeper.server.NettyServerCnxnFactory
	at org.apache.zookeeper.server.ServerCnxnFactory.createFactory(ServerCnxnFactory.java:138)
	at org.apache.zookeeper.server.ServerCnxnFactory.createFactory(ServerCnxnFactory.java:154)
	at org.apache.zookeeper.server.quorum.QuorumPeer.<init>(QuorumPeer.java:952)
	at org.apache.zookeeper.test.QuorumBase.startServers(QuorumBase.java:173)
	at org.apache.zookeeper.test.QuorumBase.setUp(QuorumBase.java:121)
	at org.apache.zookeeper.test.AsyncHammerTest.setUp(AsyncHammerTest.java:52)
	at org.apache.zookeeper.test.AsyncHammerTest.testObserversHammer(AsyncHammerTest.java:202)
	at org.apache.zookeeper.JUnit4ZKTestRunner$LoggedInvokeMethod.evaluate(JUnit4ZKTestRunner.java:79)
Caused by: java.lang.reflect.InvocationTargetException
	at java.lang.reflect.Constructor.newInstance(Constructor.java:526)
	at org.apache.zookeeper.server.ServerCnxnFactory.createFactory(ServerCnxnFactory.java:133)
Caused by: java.lang.OutOfMemoryError: unable to create new native thread
	at java.lang.Thread.start0(Native Method)
	at java.lang.Thread.start(Thread.java:714)
	at java.util.concurrent.ThreadPoolExecutor.addWorker(ThreadPoolExecutor.java:949)
	at java.util.concurrent.ThreadPoolExecutor.execute(ThreadPoolExecutor.java:1371)
	at org.jboss.netty.util.internal.DeadLockProofWorker.start(DeadLockProofWorker.java:38)
	at org.jboss.netty.channel.socket.nio.AbstractNioSelector.openSelector(AbstractNioSelector.java:368)
	at org.jboss.netty.channel.socket.nio.AbstractNioSelector.<init>(AbstractNioSelector.java:100)
	at org.jboss.netty.channel.socket.nio.AbstractNioWorker.<init>(AbstractNioWorker.java:52)
	at org.jboss.netty.channel.socket.nio.NioWorker.<init>(NioWorker.java:45)
	at org.jboss.netty.channel.socket.nio.NioWorkerPool.newWorker(NioWorkerPool.java:44)
	at org.jboss.netty.channel.socket.nio.NioWorkerPool.newWorker(NioWorkerPool.java:28)
	at org.jboss.netty.channel.socket.nio.AbstractNioWorkerPool.init(AbstractNioWorkerPool.java:80)
	at org.jboss.netty.channel.socket.nio.NioWorkerPool.<init>(NioWorkerPool.java:39)
	at org.jboss.netty.channel.socket.nio.NioWorkerPool.<init>(NioWorkerPool.java:33)
	at org.jboss.netty.channel.socket.nio.NioServerSocketChannelFactory.<init>(NioServerSocketChannelFactory.java:149)
	at org.jboss.netty.channel.socket.nio.NioServerSocketChannelFactory.<init>(NioServerSocketChannelFactory.java:131)
	at org.jboss.netty.channel.socket.nio.NioServerSocketChannelFactory.<init>(NioServerSocketChannelFactory.java:115)
	at org.apache.zookeeper.server.NettyServerCnxnFactory.<init>(NettyServerCnxnFactory.java:329)


FAILED:  org.apache.zookeeper.test.QuorumUtilTest.validateAllMXBeanAreUnregistered

Error Message:
Address already in use

Stack Trace:
java.net.BindException: Address already in use
	at sun.nio.ch.Net.bind0(Native Method)
	at sun.nio.ch.Net.bind(Net.java:463)
	at sun.nio.ch.Net.bind(Net.java:455)
	at sun.nio.ch.ServerSocketChannelImpl.bind(ServerSocketChannelImpl.java:223)
	at sun.nio.ch.ServerSocketAdaptor.bind(ServerSocketAdaptor.java:74)
	at sun.nio.ch.ServerSocketAdaptor.bind(ServerSocketAdaptor.java:67)
	at org.apache.zookeeper.server.NIOServerCnxnFactory.configure(NIOServerCnxnFactory.java:687)
	at org.apache.zookeeper.server.ServerCnxnFactory.configure(ServerCnxnFactory.java:76)
	at org.apache.zookeeper.server.ServerCnxnFactory.createFactory(ServerCnxnFactory.java:155)
	at org.apache.zookeeper.server.quorum.QuorumPeer.<init>(QuorumPeer.java:952)
	at org.apache.zookeeper.test.QuorumUtil.start(QuorumUtil.java:204)
	at org.apache.zookeeper.test.QuorumUtil.restart(QuorumUtil.java:215)
	at org.apache.zookeeper.test.QuorumUtilTest.validateAllMXBeanAreUnregistered(QuorumUtilTest.java:86)
	at org.apache.zookeeper.JUnit4ZKTestRunner$LoggedInvokeMethod.evaluate(JUnit4ZKTestRunner.java:79)

ZooKeeper-trunk - Build # 3739 - Still Failing

Posted by Apache Jenkins Server <je...@builds.apache.org>.
See https://builds.apache.org/job/ZooKeeper-trunk/3739/

###################################################################################
########################## LAST 60 LINES OF THE CONSOLE ###########################
[...truncated 11.24 KB...]
	at hudson.model.FreeStyleBuild.run(FreeStyleBuild.java:43)
	at hudson.model.ResourceController.execute(ResourceController.java:97)
	at hudson.model.Executor.run(Executor.java:429)
Caused by: hudson.plugins.git.GitException: Command "git clean -fdx" returned status code 1:
stdout: 
stderr: warning: failed to remove build/test/tmp/test7299294491915492585.junit.dir/data/version-2/snapshot.0

	at org.jenkinsci.plugins.gitclient.CliGitAPIImpl.launchCommandIn(CliGitAPIImpl.java:1996)
	at org.jenkinsci.plugins.gitclient.CliGitAPIImpl.launchCommandIn(CliGitAPIImpl.java:1964)
	at org.jenkinsci.plugins.gitclient.CliGitAPIImpl.launchCommandIn(CliGitAPIImpl.java:1960)
	at org.jenkinsci.plugins.gitclient.CliGitAPIImpl.launchCommand(CliGitAPIImpl.java:1597)
	at org.jenkinsci.plugins.gitclient.CliGitAPIImpl.launchCommand(CliGitAPIImpl.java:1609)
	at org.jenkinsci.plugins.gitclient.CliGitAPIImpl.clean(CliGitAPIImpl.java:787)
	at hudson.plugins.git.GitAPI.clean(GitAPI.java:311)
	at sun.reflect.NativeMethodAccessorImpl.invoke0(Native Method)
	at sun.reflect.NativeMethodAccessorImpl.invoke(NativeMethodAccessorImpl.java:62)
	at sun.reflect.DelegatingMethodAccessorImpl.invoke(DelegatingMethodAccessorImpl.java:43)
	at java.lang.reflect.Method.invoke(Method.java:498)
	at hudson.remoting.RemoteInvocationHandler$RPCRequest.perform(RemoteInvocationHandler.java:922)
	at hudson.remoting.RemoteInvocationHandler$RPCRequest.call(RemoteInvocationHandler.java:896)
	at hudson.remoting.RemoteInvocationHandler$RPCRequest.call(RemoteInvocationHandler.java:853)
	at hudson.remoting.UserRequest.perform(UserRequest.java:207)
	at hudson.remoting.UserRequest.perform(UserRequest.java:53)
	at hudson.remoting.Request$2.run(Request.java:358)
	at hudson.remoting.InterceptingExecutorService$1.call(InterceptingExecutorService.java:72)
	at java.util.concurrent.FutureTask.run(FutureTask.java:266)
	at java.util.concurrent.ThreadPoolExecutor.runWorker(ThreadPoolExecutor.java:1142)
	at java.util.concurrent.ThreadPoolExecutor$Worker.run(ThreadPoolExecutor.java:617)
	at java.lang.Thread.run(Thread.java:748)
	Suppressed: hudson.remoting.Channel$CallSiteStackTrace: Remote call to H12
		at hudson.remoting.Channel.attachCallSiteStackTrace(Channel.java:1693)
		at hudson.remoting.UserResponse.retrieve(UserRequest.java:310)
		at hudson.remoting.Channel.call(Channel.java:908)
		at hudson.remoting.RemoteInvocationHandler.invoke(RemoteInvocationHandler.java:281)
		at com.sun.proxy.$Proxy110.clean(Unknown Source)
		at org.jenkinsci.plugins.gitclient.RemoteGitImpl.clean(RemoteGitImpl.java:450)
		at hudson.plugins.git.extensions.impl.CleanBeforeCheckout.decorateFetchCommand(CleanBeforeCheckout.java:30)
		at hudson.plugins.git.GitSCM.fetchFrom(GitSCM.java:858)
		at hudson.plugins.git.GitSCM.retrieveChanges(GitSCM.java:1129)
		at hudson.plugins.git.GitSCM.checkout(GitSCM.java:1160)
		at hudson.scm.SCM.checkout(SCM.java:495)
		at hudson.model.AbstractProject.checkout(AbstractProject.java:1202)
		at hudson.model.AbstractBuild$AbstractBuildExecution.defaultCheckout(AbstractBuild.java:574)
		at jenkins.scm.SCMCheckoutStrategy.checkout(SCMCheckoutStrategy.java:86)
		at hudson.model.AbstractBuild$AbstractBuildExecution.run(AbstractBuild.java:499)
		at hudson.model.Run.execute(Run.java:1724)
		at hudson.model.FreeStyleBuild.run(FreeStyleBuild.java:43)
		at hudson.model.ResourceController.execute(ResourceController.java:97)
		at hudson.model.Executor.run(Executor.java:429)
ERROR: Error fetching remote repo 'origin'
[FINDBUGS] Skipping publisher since build result is FAILURE
[WARNINGS] Skipping publisher since build result is FAILURE
Archiving artifacts
Recording fingerprints
Recording test results
ERROR: Step ?Publish JUnit test result report? failed: No test report files were found. Configuration error?
Publishing Javadoc
Email was triggered for: Failure - Any
Sending email for trigger: Failure - Any



###################################################################################
############################## FAILED TESTS (if any) ##############################
No tests ran.

ZooKeeper-trunk - Build # 3738 - Still Failing

Posted by Apache Jenkins Server <je...@builds.apache.org>.
See https://builds.apache.org/job/ZooKeeper-trunk/3738/

###################################################################################
########################## LAST 60 LINES OF THE CONSOLE ###########################
[...truncated 146.31 KB...]
	at hudson.model.FreeStyleBuild.run(FreeStyleBuild.java:43)
	at hudson.model.ResourceController.execute(ResourceController.java:97)
	at hudson.model.Executor.run(Executor.java:429)
Caused by: hudson.plugins.git.GitException: Command "git clean -fdx" returned status code 1:
stdout: 
stderr: warning: failed to remove build/test/tmp/test1226267976911289536.junit.dir/data/version-2/snapshot.0

	at org.jenkinsci.plugins.gitclient.CliGitAPIImpl.launchCommandIn(CliGitAPIImpl.java:1996)
	at org.jenkinsci.plugins.gitclient.CliGitAPIImpl.launchCommandIn(CliGitAPIImpl.java:1964)
	at org.jenkinsci.plugins.gitclient.CliGitAPIImpl.launchCommandIn(CliGitAPIImpl.java:1960)
	at org.jenkinsci.plugins.gitclient.CliGitAPIImpl.launchCommand(CliGitAPIImpl.java:1597)
	at org.jenkinsci.plugins.gitclient.CliGitAPIImpl.launchCommand(CliGitAPIImpl.java:1609)
	at org.jenkinsci.plugins.gitclient.CliGitAPIImpl.clean(CliGitAPIImpl.java:787)
	at hudson.plugins.git.GitAPI.clean(GitAPI.java:311)
	at sun.reflect.NativeMethodAccessorImpl.invoke0(Native Method)
	at sun.reflect.NativeMethodAccessorImpl.invoke(NativeMethodAccessorImpl.java:62)
	at sun.reflect.DelegatingMethodAccessorImpl.invoke(DelegatingMethodAccessorImpl.java:43)
	at java.lang.reflect.Method.invoke(Method.java:498)
	at hudson.remoting.RemoteInvocationHandler$RPCRequest.perform(RemoteInvocationHandler.java:922)
	at hudson.remoting.RemoteInvocationHandler$RPCRequest.call(RemoteInvocationHandler.java:896)
	at hudson.remoting.RemoteInvocationHandler$RPCRequest.call(RemoteInvocationHandler.java:853)
	at hudson.remoting.UserRequest.perform(UserRequest.java:207)
	at hudson.remoting.UserRequest.perform(UserRequest.java:53)
	at hudson.remoting.Request$2.run(Request.java:358)
	at hudson.remoting.InterceptingExecutorService$1.call(InterceptingExecutorService.java:72)
	at java.util.concurrent.FutureTask.run(FutureTask.java:266)
	at java.util.concurrent.ThreadPoolExecutor.runWorker(ThreadPoolExecutor.java:1142)
	at java.util.concurrent.ThreadPoolExecutor$Worker.run(ThreadPoolExecutor.java:617)
	at java.lang.Thread.run(Thread.java:748)
	Suppressed: hudson.remoting.Channel$CallSiteStackTrace: Remote call to H12
		at hudson.remoting.Channel.attachCallSiteStackTrace(Channel.java:1693)
		at hudson.remoting.UserResponse.retrieve(UserRequest.java:310)
		at hudson.remoting.Channel.call(Channel.java:908)
		at hudson.remoting.RemoteInvocationHandler.invoke(RemoteInvocationHandler.java:281)
		at com.sun.proxy.$Proxy110.clean(Unknown Source)
		at org.jenkinsci.plugins.gitclient.RemoteGitImpl.clean(RemoteGitImpl.java:450)
		at hudson.plugins.git.extensions.impl.CleanBeforeCheckout.decorateFetchCommand(CleanBeforeCheckout.java:30)
		at hudson.plugins.git.GitSCM.fetchFrom(GitSCM.java:858)
		at hudson.plugins.git.GitSCM.retrieveChanges(GitSCM.java:1129)
		at hudson.plugins.git.GitSCM.checkout(GitSCM.java:1160)
		at hudson.scm.SCM.checkout(SCM.java:495)
		at hudson.model.AbstractProject.checkout(AbstractProject.java:1202)
		at hudson.model.AbstractBuild$AbstractBuildExecution.defaultCheckout(AbstractBuild.java:574)
		at jenkins.scm.SCMCheckoutStrategy.checkout(SCMCheckoutStrategy.java:86)
		at hudson.model.AbstractBuild$AbstractBuildExecution.run(AbstractBuild.java:499)
		at hudson.model.Run.execute(Run.java:1724)
		at hudson.model.FreeStyleBuild.run(FreeStyleBuild.java:43)
		at hudson.model.ResourceController.execute(ResourceController.java:97)
		at hudson.model.Executor.run(Executor.java:429)
ERROR: Error fetching remote repo 'origin'
[FINDBUGS] Skipping publisher since build result is FAILURE
[WARNINGS] Skipping publisher since build result is FAILURE
Archiving artifacts
Recording fingerprints
Recording test results
ERROR: Step ?Publish JUnit test result report? failed: No test report files were found. Configuration error?
Publishing Javadoc
Email was triggered for: Failure - Any
Sending email for trigger: Failure - Any



###################################################################################
############################## FAILED TESTS (if any) ##############################
No tests ran.

ZooKeeper-trunk - Build # 3737 - Still Failing

Posted by Apache Jenkins Server <je...@builds.apache.org>.
See https://builds.apache.org/job/ZooKeeper-trunk/3737/

###################################################################################
########################## LAST 60 LINES OF THE CONSOLE ###########################
[...truncated 11.24 KB...]
	at hudson.model.FreeStyleBuild.run(FreeStyleBuild.java:43)
	at hudson.model.ResourceController.execute(ResourceController.java:97)
	at hudson.model.Executor.run(Executor.java:429)
Caused by: hudson.plugins.git.GitException: Command "git clean -fdx" returned status code 1:
stdout: 
stderr: warning: failed to remove build/test/tmp/test7299294491915492585.junit.dir/data/version-2/snapshot.0

	at org.jenkinsci.plugins.gitclient.CliGitAPIImpl.launchCommandIn(CliGitAPIImpl.java:1996)
	at org.jenkinsci.plugins.gitclient.CliGitAPIImpl.launchCommandIn(CliGitAPIImpl.java:1964)
	at org.jenkinsci.plugins.gitclient.CliGitAPIImpl.launchCommandIn(CliGitAPIImpl.java:1960)
	at org.jenkinsci.plugins.gitclient.CliGitAPIImpl.launchCommand(CliGitAPIImpl.java:1597)
	at org.jenkinsci.plugins.gitclient.CliGitAPIImpl.launchCommand(CliGitAPIImpl.java:1609)
	at org.jenkinsci.plugins.gitclient.CliGitAPIImpl.clean(CliGitAPIImpl.java:787)
	at hudson.plugins.git.GitAPI.clean(GitAPI.java:311)
	at sun.reflect.NativeMethodAccessorImpl.invoke0(Native Method)
	at sun.reflect.NativeMethodAccessorImpl.invoke(NativeMethodAccessorImpl.java:62)
	at sun.reflect.DelegatingMethodAccessorImpl.invoke(DelegatingMethodAccessorImpl.java:43)
	at java.lang.reflect.Method.invoke(Method.java:498)
	at hudson.remoting.RemoteInvocationHandler$RPCRequest.perform(RemoteInvocationHandler.java:922)
	at hudson.remoting.RemoteInvocationHandler$RPCRequest.call(RemoteInvocationHandler.java:896)
	at hudson.remoting.RemoteInvocationHandler$RPCRequest.call(RemoteInvocationHandler.java:853)
	at hudson.remoting.UserRequest.perform(UserRequest.java:207)
	at hudson.remoting.UserRequest.perform(UserRequest.java:53)
	at hudson.remoting.Request$2.run(Request.java:358)
	at hudson.remoting.InterceptingExecutorService$1.call(InterceptingExecutorService.java:72)
	at java.util.concurrent.FutureTask.run(FutureTask.java:266)
	at java.util.concurrent.ThreadPoolExecutor.runWorker(ThreadPoolExecutor.java:1142)
	at java.util.concurrent.ThreadPoolExecutor$Worker.run(ThreadPoolExecutor.java:617)
	at java.lang.Thread.run(Thread.java:748)
	Suppressed: hudson.remoting.Channel$CallSiteStackTrace: Remote call to H12
		at hudson.remoting.Channel.attachCallSiteStackTrace(Channel.java:1693)
		at hudson.remoting.UserResponse.retrieve(UserRequest.java:310)
		at hudson.remoting.Channel.call(Channel.java:908)
		at hudson.remoting.RemoteInvocationHandler.invoke(RemoteInvocationHandler.java:281)
		at com.sun.proxy.$Proxy110.clean(Unknown Source)
		at org.jenkinsci.plugins.gitclient.RemoteGitImpl.clean(RemoteGitImpl.java:450)
		at hudson.plugins.git.extensions.impl.CleanBeforeCheckout.decorateFetchCommand(CleanBeforeCheckout.java:30)
		at hudson.plugins.git.GitSCM.fetchFrom(GitSCM.java:858)
		at hudson.plugins.git.GitSCM.retrieveChanges(GitSCM.java:1129)
		at hudson.plugins.git.GitSCM.checkout(GitSCM.java:1160)
		at hudson.scm.SCM.checkout(SCM.java:495)
		at hudson.model.AbstractProject.checkout(AbstractProject.java:1202)
		at hudson.model.AbstractBuild$AbstractBuildExecution.defaultCheckout(AbstractBuild.java:574)
		at jenkins.scm.SCMCheckoutStrategy.checkout(SCMCheckoutStrategy.java:86)
		at hudson.model.AbstractBuild$AbstractBuildExecution.run(AbstractBuild.java:499)
		at hudson.model.Run.execute(Run.java:1724)
		at hudson.model.FreeStyleBuild.run(FreeStyleBuild.java:43)
		at hudson.model.ResourceController.execute(ResourceController.java:97)
		at hudson.model.Executor.run(Executor.java:429)
ERROR: Error fetching remote repo 'origin'
[FINDBUGS] Skipping publisher since build result is FAILURE
[WARNINGS] Skipping publisher since build result is FAILURE
Archiving artifacts
Recording fingerprints
Recording test results
ERROR: Step ?Publish JUnit test result report? failed: No test report files were found. Configuration error?
Publishing Javadoc
Email was triggered for: Failure - Any
Sending email for trigger: Failure - Any



###################################################################################
############################## FAILED TESTS (if any) ##############################
No tests ran.

ZooKeeper-trunk - Build # 3736 - Still Failing

Posted by Apache Jenkins Server <je...@builds.apache.org>.
See https://builds.apache.org/job/ZooKeeper-trunk/3736/

###################################################################################
########################## LAST 60 LINES OF THE CONSOLE ###########################
[...truncated 11.24 KB...]
	at hudson.model.FreeStyleBuild.run(FreeStyleBuild.java:43)
	at hudson.model.ResourceController.execute(ResourceController.java:97)
	at hudson.model.Executor.run(Executor.java:429)
Caused by: hudson.plugins.git.GitException: Command "git clean -fdx" returned status code 1:
stdout: 
stderr: warning: failed to remove build/test/tmp/test7299294491915492585.junit.dir/data/version-2/snapshot.0

	at org.jenkinsci.plugins.gitclient.CliGitAPIImpl.launchCommandIn(CliGitAPIImpl.java:1996)
	at org.jenkinsci.plugins.gitclient.CliGitAPIImpl.launchCommandIn(CliGitAPIImpl.java:1964)
	at org.jenkinsci.plugins.gitclient.CliGitAPIImpl.launchCommandIn(CliGitAPIImpl.java:1960)
	at org.jenkinsci.plugins.gitclient.CliGitAPIImpl.launchCommand(CliGitAPIImpl.java:1597)
	at org.jenkinsci.plugins.gitclient.CliGitAPIImpl.launchCommand(CliGitAPIImpl.java:1609)
	at org.jenkinsci.plugins.gitclient.CliGitAPIImpl.clean(CliGitAPIImpl.java:787)
	at hudson.plugins.git.GitAPI.clean(GitAPI.java:311)
	at sun.reflect.NativeMethodAccessorImpl.invoke0(Native Method)
	at sun.reflect.NativeMethodAccessorImpl.invoke(NativeMethodAccessorImpl.java:62)
	at sun.reflect.DelegatingMethodAccessorImpl.invoke(DelegatingMethodAccessorImpl.java:43)
	at java.lang.reflect.Method.invoke(Method.java:498)
	at hudson.remoting.RemoteInvocationHandler$RPCRequest.perform(RemoteInvocationHandler.java:922)
	at hudson.remoting.RemoteInvocationHandler$RPCRequest.call(RemoteInvocationHandler.java:896)
	at hudson.remoting.RemoteInvocationHandler$RPCRequest.call(RemoteInvocationHandler.java:853)
	at hudson.remoting.UserRequest.perform(UserRequest.java:207)
	at hudson.remoting.UserRequest.perform(UserRequest.java:53)
	at hudson.remoting.Request$2.run(Request.java:358)
	at hudson.remoting.InterceptingExecutorService$1.call(InterceptingExecutorService.java:72)
	at java.util.concurrent.FutureTask.run(FutureTask.java:266)
	at java.util.concurrent.ThreadPoolExecutor.runWorker(ThreadPoolExecutor.java:1142)
	at java.util.concurrent.ThreadPoolExecutor$Worker.run(ThreadPoolExecutor.java:617)
	at java.lang.Thread.run(Thread.java:748)
	Suppressed: hudson.remoting.Channel$CallSiteStackTrace: Remote call to H12
		at hudson.remoting.Channel.attachCallSiteStackTrace(Channel.java:1693)
		at hudson.remoting.UserResponse.retrieve(UserRequest.java:310)
		at hudson.remoting.Channel.call(Channel.java:908)
		at hudson.remoting.RemoteInvocationHandler.invoke(RemoteInvocationHandler.java:281)
		at com.sun.proxy.$Proxy110.clean(Unknown Source)
		at org.jenkinsci.plugins.gitclient.RemoteGitImpl.clean(RemoteGitImpl.java:450)
		at hudson.plugins.git.extensions.impl.CleanBeforeCheckout.decorateFetchCommand(CleanBeforeCheckout.java:30)
		at hudson.plugins.git.GitSCM.fetchFrom(GitSCM.java:858)
		at hudson.plugins.git.GitSCM.retrieveChanges(GitSCM.java:1129)
		at hudson.plugins.git.GitSCM.checkout(GitSCM.java:1160)
		at hudson.scm.SCM.checkout(SCM.java:495)
		at hudson.model.AbstractProject.checkout(AbstractProject.java:1202)
		at hudson.model.AbstractBuild$AbstractBuildExecution.defaultCheckout(AbstractBuild.java:574)
		at jenkins.scm.SCMCheckoutStrategy.checkout(SCMCheckoutStrategy.java:86)
		at hudson.model.AbstractBuild$AbstractBuildExecution.run(AbstractBuild.java:499)
		at hudson.model.Run.execute(Run.java:1724)
		at hudson.model.FreeStyleBuild.run(FreeStyleBuild.java:43)
		at hudson.model.ResourceController.execute(ResourceController.java:97)
		at hudson.model.Executor.run(Executor.java:429)
ERROR: Error fetching remote repo 'origin'
[FINDBUGS] Skipping publisher since build result is FAILURE
[WARNINGS] Skipping publisher since build result is FAILURE
Archiving artifacts
Recording fingerprints
Recording test results
ERROR: Step ?Publish JUnit test result report? failed: No test report files were found. Configuration error?
Publishing Javadoc
Email was triggered for: Failure - Any
Sending email for trigger: Failure - Any



###################################################################################
############################## FAILED TESTS (if any) ##############################
No tests ran.

ZooKeeper-trunk - Build # 3735 - Still Failing

Posted by Apache Jenkins Server <je...@builds.apache.org>.
See https://builds.apache.org/job/ZooKeeper-trunk/3735/

###################################################################################
########################## LAST 60 LINES OF THE CONSOLE ###########################
[...truncated 138.41 KB...]
	at hudson.model.FreeStyleBuild.run(FreeStyleBuild.java:43)
	at hudson.model.ResourceController.execute(ResourceController.java:97)
	at hudson.model.Executor.run(Executor.java:429)
Caused by: hudson.plugins.git.GitException: Command "git clean -fdx" returned status code 1:
stdout: 
stderr: warning: failed to remove build/test/tmp/test7299294491915492585.junit.dir/data/version-2/snapshot.0

	at org.jenkinsci.plugins.gitclient.CliGitAPIImpl.launchCommandIn(CliGitAPIImpl.java:1996)
	at org.jenkinsci.plugins.gitclient.CliGitAPIImpl.launchCommandIn(CliGitAPIImpl.java:1964)
	at org.jenkinsci.plugins.gitclient.CliGitAPIImpl.launchCommandIn(CliGitAPIImpl.java:1960)
	at org.jenkinsci.plugins.gitclient.CliGitAPIImpl.launchCommand(CliGitAPIImpl.java:1597)
	at org.jenkinsci.plugins.gitclient.CliGitAPIImpl.launchCommand(CliGitAPIImpl.java:1609)
	at org.jenkinsci.plugins.gitclient.CliGitAPIImpl.clean(CliGitAPIImpl.java:787)
	at hudson.plugins.git.GitAPI.clean(GitAPI.java:311)
	at sun.reflect.NativeMethodAccessorImpl.invoke0(Native Method)
	at sun.reflect.NativeMethodAccessorImpl.invoke(NativeMethodAccessorImpl.java:62)
	at sun.reflect.DelegatingMethodAccessorImpl.invoke(DelegatingMethodAccessorImpl.java:43)
	at java.lang.reflect.Method.invoke(Method.java:498)
	at hudson.remoting.RemoteInvocationHandler$RPCRequest.perform(RemoteInvocationHandler.java:922)
	at hudson.remoting.RemoteInvocationHandler$RPCRequest.call(RemoteInvocationHandler.java:896)
	at hudson.remoting.RemoteInvocationHandler$RPCRequest.call(RemoteInvocationHandler.java:853)
	at hudson.remoting.UserRequest.perform(UserRequest.java:207)
	at hudson.remoting.UserRequest.perform(UserRequest.java:53)
	at hudson.remoting.Request$2.run(Request.java:358)
	at hudson.remoting.InterceptingExecutorService$1.call(InterceptingExecutorService.java:72)
	at java.util.concurrent.FutureTask.run(FutureTask.java:266)
	at java.util.concurrent.ThreadPoolExecutor.runWorker(ThreadPoolExecutor.java:1142)
	at java.util.concurrent.ThreadPoolExecutor$Worker.run(ThreadPoolExecutor.java:617)
	at java.lang.Thread.run(Thread.java:748)
	Suppressed: hudson.remoting.Channel$CallSiteStackTrace: Remote call to H12
		at hudson.remoting.Channel.attachCallSiteStackTrace(Channel.java:1693)
		at hudson.remoting.UserResponse.retrieve(UserRequest.java:310)
		at hudson.remoting.Channel.call(Channel.java:908)
		at hudson.remoting.RemoteInvocationHandler.invoke(RemoteInvocationHandler.java:281)
		at com.sun.proxy.$Proxy110.clean(Unknown Source)
		at org.jenkinsci.plugins.gitclient.RemoteGitImpl.clean(RemoteGitImpl.java:450)
		at hudson.plugins.git.extensions.impl.CleanBeforeCheckout.decorateFetchCommand(CleanBeforeCheckout.java:30)
		at hudson.plugins.git.GitSCM.fetchFrom(GitSCM.java:858)
		at hudson.plugins.git.GitSCM.retrieveChanges(GitSCM.java:1129)
		at hudson.plugins.git.GitSCM.checkout(GitSCM.java:1160)
		at hudson.scm.SCM.checkout(SCM.java:495)
		at hudson.model.AbstractProject.checkout(AbstractProject.java:1202)
		at hudson.model.AbstractBuild$AbstractBuildExecution.defaultCheckout(AbstractBuild.java:574)
		at jenkins.scm.SCMCheckoutStrategy.checkout(SCMCheckoutStrategy.java:86)
		at hudson.model.AbstractBuild$AbstractBuildExecution.run(AbstractBuild.java:499)
		at hudson.model.Run.execute(Run.java:1724)
		at hudson.model.FreeStyleBuild.run(FreeStyleBuild.java:43)
		at hudson.model.ResourceController.execute(ResourceController.java:97)
		at hudson.model.Executor.run(Executor.java:429)
ERROR: Error fetching remote repo 'origin'
[FINDBUGS] Skipping publisher since build result is FAILURE
[WARNINGS] Skipping publisher since build result is FAILURE
Archiving artifacts
Recording fingerprints
Recording test results
ERROR: Step ?Publish JUnit test result report? failed: No test report files were found. Configuration error?
Publishing Javadoc
Email was triggered for: Failure - Any
Sending email for trigger: Failure - Any



###################################################################################
############################## FAILED TESTS (if any) ##############################
No tests ran.