You are viewing a plain text version of this content. The canonical link for it is here.
Posted to builds@lucene.apache.org by Policeman Jenkins Server <je...@thetaphi.de> on 2024/04/29 05:46:18 UTC

[JENKINS] Lucene-9.x-Linux (64bit/openj9/jdk-11.0.20) - Build # 16430 - Unstable!

Build: https://jenkins.thetaphi.de/job/Lucene-9.x-Linux/16430/
Java: 64bit/openj9/jdk-11.0.20 -XX:+UseCompressedOops -Xgcpolicy:balanced

14 tests failed.
FAILED:  org.apache.lucene.backward_codecs.lucene80.TestBestCompressionLucene80DocValuesFormat.testSortedVariableLengthBigVsStoredFields

Error Message:
java.lang.RuntimeException: Invalid vInt detected (too many bits)

Stack Trace:
java.lang.RuntimeException: Invalid vInt detected (too many bits)
	at __randomizedtesting.SeedInfo.seed([E17DA67C5488D3A3:118DE1196793762C]:0)
	at app/org.apache.lucene.core@9.11.0-SNAPSHOT/org.apache.lucene.store.ByteArrayDataInput.readVInt(ByteArrayDataInput.java:128)
	at app//org.apache.lucene.backward_codecs.lucene80.Lucene80DocValuesProducer$TermsDict.next(Lucene80DocValuesProducer.java:1229)
	at app//org.apache.lucene.backward_codecs.lucene80.Lucene80DocValuesProducer$TermsDict.seekExact(Lucene80DocValuesProducer.java:1247)
	at app//org.apache.lucene.backward_codecs.lucene80.Lucene80DocValuesProducer$BaseSortedDocValues.lookupOrd(Lucene80DocValuesProducer.java:1102)
	at app/org.apache.lucene.core@9.11.0-SNAPSHOT/org.apache.lucene.index.CheckIndex.checkSortedDocValues(CheckIndex.java:3469)
	at app/org.apache.lucene.core@9.11.0-SNAPSHOT/org.apache.lucene.index.CheckIndex.checkDocValues(CheckIndex.java:3652)
	at app/org.apache.lucene.core@9.11.0-SNAPSHOT/org.apache.lucene.index.CheckIndex.testDocValues(CheckIndex.java:3241)
	at app/org.apache.lucene.test_framework@9.11.0-SNAPSHOT/org.apache.lucene.tests.util.TestUtil.checkReader(TestUtil.java:387)
	at app/org.apache.lucene.test_framework@9.11.0-SNAPSHOT/org.apache.lucene.tests.util.TestUtil.checkReader(TestUtil.java:366)
	at app/org.apache.lucene.test_framework@9.11.0-SNAPSHOT/org.apache.lucene.tests.index.BaseDocValuesFormatTestCase.doTestSortedVsStoredFields(BaseDocValuesFormatTestCase.java:1725)
	at app/org.apache.lucene.test_framework@9.11.0-SNAPSHOT/org.apache.lucene.tests.index.BaseDocValuesFormatTestCase.doTestSortedVsStoredFields(BaseDocValuesFormatTestCase.java:1803)
	at app//org.apache.lucene.backward_codecs.lucene80.BaseLucene80DocValuesFormatTestCase.testSortedVariableLengthBigVsStoredFields(BaseLucene80DocValuesFormatTestCase.java:97)
	at java.base@11.0.20.1/jdk.internal.reflect.NativeMethodAccessorImpl.invoke0(Native Method)
	at java.base@11.0.20.1/jdk.internal.reflect.NativeMethodAccessorImpl.invoke(NativeMethodAccessorImpl.java:62)
	at java.base@11.0.20.1/jdk.internal.reflect.DelegatingMethodAccessorImpl.invoke(DelegatingMethodAccessorImpl.java:43)
	at java.base@11.0.20.1/java.lang.reflect.Method.invoke(Method.java:566)
	at app/randomizedtesting.runner@2.8.1/com.carrotsearch.randomizedtesting.RandomizedRunner.invoke(RandomizedRunner.java:1758)
	at app/randomizedtesting.runner@2.8.1/com.carrotsearch.randomizedtesting.RandomizedRunner$8.evaluate(RandomizedRunner.java:946)
	at app/randomizedtesting.runner@2.8.1/com.carrotsearch.randomizedtesting.RandomizedRunner$9.evaluate(RandomizedRunner.java:982)
	at app/randomizedtesting.runner@2.8.1/com.carrotsearch.randomizedtesting.RandomizedRunner$10.evaluate(RandomizedRunner.java:996)
	at app/org.apache.lucene.test_framework@9.11.0-SNAPSHOT/org.apache.lucene.tests.util.TestRuleSetupTeardownChained$1.evaluate(TestRuleSetupTeardownChained.java:48)
	at app/org.apache.lucene.test_framework@9.11.0-SNAPSHOT/org.apache.lucene.tests.util.AbstractBeforeAfterRule$1.evaluate(AbstractBeforeAfterRule.java:43)
	at app/org.apache.lucene.test_framework@9.11.0-SNAPSHOT/org.apache.lucene.tests.util.TestRuleThreadAndTestName$1.evaluate(TestRuleThreadAndTestName.java:45)
	at app/org.apache.lucene.test_framework@9.11.0-SNAPSHOT/org.apache.lucene.tests.util.TestRuleIgnoreAfterMaxFailures$1.evaluate(TestRuleIgnoreAfterMaxFailures.java:60)
	at app/org.apache.lucene.test_framework@9.11.0-SNAPSHOT/org.apache.lucene.tests.util.TestRuleMarkFailure$1.evaluate(TestRuleMarkFailure.java:44)
	at app/junit@4.13.1/org.junit.rules.RunRules.evaluate(RunRules.java:20)
	at app/randomizedtesting.runner@2.8.1/com.carrotsearch.randomizedtesting.rules.StatementAdapter.evaluate(StatementAdapter.java:36)
	at app/randomizedtesting.runner@2.8.1/com.carrotsearch.randomizedtesting.ThreadLeakControl$StatementRunner.run(ThreadLeakControl.java:390)
	at app/randomizedtesting.runner@2.8.1/com.carrotsearch.randomizedtesting.ThreadLeakControl.forkTimeoutingTask(ThreadLeakControl.java:843)
	at app/randomizedtesting.runner@2.8.1/com.carrotsearch.randomizedtesting.ThreadLeakControl$3.evaluate(ThreadLeakControl.java:490)
	at app/randomizedtesting.runner@2.8.1/com.carrotsearch.randomizedtesting.RandomizedRunner.runSingleTest(RandomizedRunner.java:955)
	at app/randomizedtesting.runner@2.8.1/com.carrotsearch.randomizedtesting.RandomizedRunner$5.evaluate(RandomizedRunner.java:840)
	at app/randomizedtesting.runner@2.8.1/com.carrotsearch.randomizedtesting.RandomizedRunner$6.evaluate(RandomizedRunner.java:891)
	at app/randomizedtesting.runner@2.8.1/com.carrotsearch.randomizedtesting.RandomizedRunner$7.evaluate(RandomizedRunner.java:902)
	at app/org.apache.lucene.test_framework@9.11.0-SNAPSHOT/org.apache.lucene.tests.util.AbstractBeforeAfterRule$1.evaluate(AbstractBeforeAfterRule.java:43)
	at app/randomizedtesting.runner@2.8.1/com.carrotsearch.randomizedtesting.rules.StatementAdapter.evaluate(StatementAdapter.java:36)
	at app/org.apache.lucene.test_framework@9.11.0-SNAPSHOT/org.apache.lucene.tests.util.TestRuleStoreClassName$1.evaluate(TestRuleStoreClassName.java:38)
	at app/randomizedtesting.runner@2.8.1/com.carrotsearch.randomizedtesting.rules.NoShadowingOrOverridesOnMethodsRule$1.evaluate(NoShadowingOrOverridesOnMethodsRule.java:40)
	at app/randomizedtesting.runner@2.8.1/com.carrotsearch.randomizedtesting.rules.NoShadowingOrOverridesOnMethodsRule$1.evaluate(NoShadowingOrOverridesOnMethodsRule.java:40)
	at app/randomizedtesting.runner@2.8.1/com.carrotsearch.randomizedtesting.rules.StatementAdapter.evaluate(StatementAdapter.java:36)
	at app/randomizedtesting.runner@2.8.1/com.carrotsearch.randomizedtesting.rules.StatementAdapter.evaluate(StatementAdapter.java:36)
	at app/org.apache.lucene.test_framework@9.11.0-SNAPSHOT/org.apache.lucene.tests.util.TestRuleAssertionsRequired$1.evaluate(TestRuleAssertionsRequired.java:53)
	at app/org.apache.lucene.test_framework@9.11.0-SNAPSHOT/org.apache.lucene.tests.util.AbstractBeforeAfterRule$1.evaluate(AbstractBeforeAfterRule.java:43)
	at app/org.apache.lucene.test_framework@9.11.0-SNAPSHOT/org.apache.lucene.tests.util.TestRuleMarkFailure$1.evaluate(TestRuleMarkFailure.java:44)
	at app/org.apache.lucene.test_framework@9.11.0-SNAPSHOT/org.apache.lucene.tests.util.TestRuleIgnoreAfterMaxFailures$1.evaluate(TestRuleIgnoreAfterMaxFailures.java:60)
	at app/org.apache.lucene.test_framework@9.11.0-SNAPSHOT/org.apache.lucene.tests.util.TestRuleIgnoreTestSuites$1.evaluate(TestRuleIgnoreTestSuites.java:47)
	at app/junit@4.13.1/org.junit.rules.RunRules.evaluate(RunRules.java:20)
	at app/randomizedtesting.runner@2.8.1/com.carrotsearch.randomizedtesting.rules.StatementAdapter.evaluate(StatementAdapter.java:36)
	at app/randomizedtesting.runner@2.8.1/com.carrotsearch.randomizedtesting.ThreadLeakControl$StatementRunner.run(ThreadLeakControl.java:390)
	at app/randomizedtesting.runner@2.8.1/com.carrotsearch.randomizedtesting.ThreadLeakControl.lambda$forkTimeoutingTask$0(ThreadLeakControl.java:850)
	at java.base@11.0.20.1/java.lang.Thread.run(Thread.java:839)


FAILED:  org.apache.lucene.backward_codecs.lucene80.TestBestCompressionLucene80DocValuesFormat.testSortedSetVariableLengthBigVsStoredFields

Error Message:
java.lang.RuntimeException: Invalid vInt detected (too many bits)

Stack Trace:
java.lang.RuntimeException: Invalid vInt detected (too many bits)
	at __randomizedtesting.SeedInfo.seed([E17DA67C5488D3A3:84652EC0C7FBB0E8]:0)
	at app/org.apache.lucene.core@9.11.0-SNAPSHOT/org.apache.lucene.store.ByteArrayDataInput.readVInt(ByteArrayDataInput.java:128)
	at app//org.apache.lucene.backward_codecs.lucene80.Lucene80DocValuesProducer$TermsDict.next(Lucene80DocValuesProducer.java:1229)
	at app//org.apache.lucene.backward_codecs.lucene80.Lucene80DocValuesProducer$TermsDict.seekExact(Lucene80DocValuesProducer.java:1247)
	at app//org.apache.lucene.backward_codecs.lucene80.Lucene80DocValuesProducer$BaseSortedSetDocValues.lookupOrd(Lucene80DocValuesProducer.java:1144)
	at app/org.apache.lucene.core@9.11.0-SNAPSHOT/org.apache.lucene.index.CheckIndex.checkSortedSetDocValues(CheckIndex.java:3565)
	at app/org.apache.lucene.core@9.11.0-SNAPSHOT/org.apache.lucene.index.CheckIndex.checkDocValues(CheckIndex.java:3663)
	at app/org.apache.lucene.core@9.11.0-SNAPSHOT/org.apache.lucene.index.CheckIndex.testDocValues(CheckIndex.java:3241)
	at app/org.apache.lucene.test_framework@9.11.0-SNAPSHOT/org.apache.lucene.tests.util.TestUtil.checkReader(TestUtil.java:387)
	at app/org.apache.lucene.test_framework@9.11.0-SNAPSHOT/org.apache.lucene.tests.util.TestUtil.checkReader(TestUtil.java:366)
	at app/org.apache.lucene.test_framework@9.11.0-SNAPSHOT/org.apache.lucene.tests.index.BaseDocValuesFormatTestCase.doTestSortedSetVsStoredFields(BaseDocValuesFormatTestCase.java:2335)
	at app//org.apache.lucene.backward_codecs.lucene80.BaseLucene80DocValuesFormatTestCase.testSortedSetVariableLengthBigVsStoredFields(BaseLucene80DocValuesFormatTestCase.java:82)
	at java.base@11.0.20.1/jdk.internal.reflect.NativeMethodAccessorImpl.invoke0(Native Method)
	at java.base@11.0.20.1/jdk.internal.reflect.NativeMethodAccessorImpl.invoke(NativeMethodAccessorImpl.java:62)
	at java.base@11.0.20.1/jdk.internal.reflect.DelegatingMethodAccessorImpl.invoke(DelegatingMethodAccessorImpl.java:43)
	at java.base@11.0.20.1/java.lang.reflect.Method.invoke(Method.java:566)
	at app/randomizedtesting.runner@2.8.1/com.carrotsearch.randomizedtesting.RandomizedRunner.invoke(RandomizedRunner.java:1758)
	at app/randomizedtesting.runner@2.8.1/com.carrotsearch.randomizedtesting.RandomizedRunner$8.evaluate(RandomizedRunner.java:946)
	at app/randomizedtesting.runner@2.8.1/com.carrotsearch.randomizedtesting.RandomizedRunner$9.evaluate(RandomizedRunner.java:982)
	at app/randomizedtesting.runner@2.8.1/com.carrotsearch.randomizedtesting.RandomizedRunner$10.evaluate(RandomizedRunner.java:996)
	at app/org.apache.lucene.test_framework@9.11.0-SNAPSHOT/org.apache.lucene.tests.util.TestRuleSetupTeardownChained$1.evaluate(TestRuleSetupTeardownChained.java:48)
	at app/org.apache.lucene.test_framework@9.11.0-SNAPSHOT/org.apache.lucene.tests.util.AbstractBeforeAfterRule$1.evaluate(AbstractBeforeAfterRule.java:43)
	at app/org.apache.lucene.test_framework@9.11.0-SNAPSHOT/org.apache.lucene.tests.util.TestRuleThreadAndTestName$1.evaluate(TestRuleThreadAndTestName.java:45)
	at app/org.apache.lucene.test_framework@9.11.0-SNAPSHOT/org.apache.lucene.tests.util.TestRuleIgnoreAfterMaxFailures$1.evaluate(TestRuleIgnoreAfterMaxFailures.java:60)
	at app/org.apache.lucene.test_framework@9.11.0-SNAPSHOT/org.apache.lucene.tests.util.TestRuleMarkFailure$1.evaluate(TestRuleMarkFailure.java:44)
	at app/junit@4.13.1/org.junit.rules.RunRules.evaluate(RunRules.java:20)
	at app/randomizedtesting.runner@2.8.1/com.carrotsearch.randomizedtesting.rules.StatementAdapter.evaluate(StatementAdapter.java:36)
	at app/randomizedtesting.runner@2.8.1/com.carrotsearch.randomizedtesting.ThreadLeakControl$StatementRunner.run(ThreadLeakControl.java:390)
	at app/randomizedtesting.runner@2.8.1/com.carrotsearch.randomizedtesting.ThreadLeakControl.forkTimeoutingTask(ThreadLeakControl.java:843)
	at app/randomizedtesting.runner@2.8.1/com.carrotsearch.randomizedtesting.ThreadLeakControl$3.evaluate(ThreadLeakControl.java:490)
	at app/randomizedtesting.runner@2.8.1/com.carrotsearch.randomizedtesting.RandomizedRunner.runSingleTest(RandomizedRunner.java:955)
	at app/randomizedtesting.runner@2.8.1/com.carrotsearch.randomizedtesting.RandomizedRunner$5.evaluate(RandomizedRunner.java:840)
	at app/randomizedtesting.runner@2.8.1/com.carrotsearch.randomizedtesting.RandomizedRunner$6.evaluate(RandomizedRunner.java:891)
	at app/randomizedtesting.runner@2.8.1/com.carrotsearch.randomizedtesting.RandomizedRunner$7.evaluate(RandomizedRunner.java:902)
	at app/org.apache.lucene.test_framework@9.11.0-SNAPSHOT/org.apache.lucene.tests.util.AbstractBeforeAfterRule$1.evaluate(AbstractBeforeAfterRule.java:43)
	at app/randomizedtesting.runner@2.8.1/com.carrotsearch.randomizedtesting.rules.StatementAdapter.evaluate(StatementAdapter.java:36)
	at app/org.apache.lucene.test_framework@9.11.0-SNAPSHOT/org.apache.lucene.tests.util.TestRuleStoreClassName$1.evaluate(TestRuleStoreClassName.java:38)
	at app/randomizedtesting.runner@2.8.1/com.carrotsearch.randomizedtesting.rules.NoShadowingOrOverridesOnMethodsRule$1.evaluate(NoShadowingOrOverridesOnMethodsRule.java:40)
	at app/randomizedtesting.runner@2.8.1/com.carrotsearch.randomizedtesting.rules.NoShadowingOrOverridesOnMethodsRule$1.evaluate(NoShadowingOrOverridesOnMethodsRule.java:40)
	at app/randomizedtesting.runner@2.8.1/com.carrotsearch.randomizedtesting.rules.StatementAdapter.evaluate(StatementAdapter.java:36)
	at app/randomizedtesting.runner@2.8.1/com.carrotsearch.randomizedtesting.rules.StatementAdapter.evaluate(StatementAdapter.java:36)
	at app/org.apache.lucene.test_framework@9.11.0-SNAPSHOT/org.apache.lucene.tests.util.TestRuleAssertionsRequired$1.evaluate(TestRuleAssertionsRequired.java:53)
	at app/org.apache.lucene.test_framework@9.11.0-SNAPSHOT/org.apache.lucene.tests.util.AbstractBeforeAfterRule$1.evaluate(AbstractBeforeAfterRule.java:43)
	at app/org.apache.lucene.test_framework@9.11.0-SNAPSHOT/org.apache.lucene.tests.util.TestRuleMarkFailure$1.evaluate(TestRuleMarkFailure.java:44)
	at app/org.apache.lucene.test_framework@9.11.0-SNAPSHOT/org.apache.lucene.tests.util.TestRuleIgnoreAfterMaxFailures$1.evaluate(TestRuleIgnoreAfterMaxFailures.java:60)
	at app/org.apache.lucene.test_framework@9.11.0-SNAPSHOT/org.apache.lucene.tests.util.TestRuleIgnoreTestSuites$1.evaluate(TestRuleIgnoreTestSuites.java:47)
	at app/junit@4.13.1/org.junit.rules.RunRules.evaluate(RunRules.java:20)
	at app/randomizedtesting.runner@2.8.1/com.carrotsearch.randomizedtesting.rules.StatementAdapter.evaluate(StatementAdapter.java:36)
	at app/randomizedtesting.runner@2.8.1/com.carrotsearch.randomizedtesting.ThreadLeakControl$StatementRunner.run(ThreadLeakControl.java:390)
	at app/randomizedtesting.runner@2.8.1/com.carrotsearch.randomizedtesting.ThreadLeakControl.lambda$forkTimeoutingTask$0(ThreadLeakControl.java:850)
	at java.base@11.0.20.1/java.lang.Thread.run(Thread.java:839)


FAILED:  org.apache.lucene.codecs.compressing.TestFastCompressionMode.testExtremelyLargeInput

Error Message:
java.lang.AssertionError

Stack Trace:
java.lang.AssertionError
	at __randomizedtesting.SeedInfo.seed([E17DA67C5488D3A3:8DC8DA250F9318D5]:0)
	at app//org.apache.lucene.util.compress.LZ4.decompress(LZ4.java:114)
	at app//org.apache.lucene.codecs.compressing.CompressionMode$4.decompress(CompressionMode.java:135)
	at app//org.apache.lucene.codecs.compressing.AbstractTestCompressionMode.decompress(AbstractTestCompressionMode.java:77)
	at app//org.apache.lucene.codecs.compressing.AbstractTestCompressionMode.decompress(AbstractTestCompressionMode.java:71)
	at app//org.apache.lucene.codecs.compressing.AbstractTestCompressionMode.test(AbstractTestCompressionMode.java:131)
	at app//org.apache.lucene.codecs.compressing.AbstractTestCompressionMode.test(AbstractTestCompressionMode.java:126)
	at app//org.apache.lucene.codecs.compressing.AbstractTestCompressionMode.testExtremelyLargeInput(AbstractTestCompressionMode.java:163)
	at java.base@11.0.20.1/jdk.internal.reflect.NativeMethodAccessorImpl.invoke0(Native Method)
	at java.base@11.0.20.1/jdk.internal.reflect.NativeMethodAccessorImpl.invoke(NativeMethodAccessorImpl.java:62)
	at java.base@11.0.20.1/jdk.internal.reflect.DelegatingMethodAccessorImpl.invoke(DelegatingMethodAccessorImpl.java:43)
	at java.base@11.0.20.1/java.lang.reflect.Method.invoke(Method.java:566)
	at app//com.carrotsearch.randomizedtesting.RandomizedRunner.invoke(RandomizedRunner.java:1758)
	at app//com.carrotsearch.randomizedtesting.RandomizedRunner$8.evaluate(RandomizedRunner.java:946)
	at app//com.carrotsearch.randomizedtesting.RandomizedRunner$9.evaluate(RandomizedRunner.java:982)
	at app//com.carrotsearch.randomizedtesting.RandomizedRunner$10.evaluate(RandomizedRunner.java:996)
	at app//org.apache.lucene.tests.util.TestRuleSetupTeardownChained$1.evaluate(TestRuleSetupTeardownChained.java:48)
	at app//org.apache.lucene.tests.util.AbstractBeforeAfterRule$1.evaluate(AbstractBeforeAfterRule.java:43)
	at app//org.apache.lucene.tests.util.TestRuleThreadAndTestName$1.evaluate(TestRuleThreadAndTestName.java:45)
	at app//org.apache.lucene.tests.util.TestRuleIgnoreAfterMaxFailures$1.evaluate(TestRuleIgnoreAfterMaxFailures.java:60)
	at app//org.apache.lucene.tests.util.TestRuleMarkFailure$1.evaluate(TestRuleMarkFailure.java:44)
	at app//org.junit.rules.RunRules.evaluate(RunRules.java:20)
	at app//com.carrotsearch.randomizedtesting.rules.StatementAdapter.evaluate(StatementAdapter.java:36)
	at app//com.carrotsearch.randomizedtesting.ThreadLeakControl$StatementRunner.run(ThreadLeakControl.java:390)
	at app//com.carrotsearch.randomizedtesting.ThreadLeakControl.forkTimeoutingTask(ThreadLeakControl.java:843)
	at app//com.carrotsearch.randomizedtesting.ThreadLeakControl$3.evaluate(ThreadLeakControl.java:490)
	at app//com.carrotsearch.randomizedtesting.RandomizedRunner.runSingleTest(RandomizedRunner.java:955)
	at app//com.carrotsearch.randomizedtesting.RandomizedRunner$5.evaluate(RandomizedRunner.java:840)
	at app//com.carrotsearch.randomizedtesting.RandomizedRunner$6.evaluate(RandomizedRunner.java:891)
	at app//com.carrotsearch.randomizedtesting.RandomizedRunner$7.evaluate(RandomizedRunner.java:902)
	at app//org.apache.lucene.tests.util.AbstractBeforeAfterRule$1.evaluate(AbstractBeforeAfterRule.java:43)
	at app//com.carrotsearch.randomizedtesting.rules.StatementAdapter.evaluate(StatementAdapter.java:36)
	at app//org.apache.lucene.tests.util.TestRuleStoreClassName$1.evaluate(TestRuleStoreClassName.java:38)
	at app//com.carrotsearch.randomizedtesting.rules.NoShadowingOrOverridesOnMethodsRule$1.evaluate(NoShadowingOrOverridesOnMethodsRule.java:40)
	at app//com.carrotsearch.randomizedtesting.rules.NoShadowingOrOverridesOnMethodsRule$1.evaluate(NoShadowingOrOverridesOnMethodsRule.java:40)
	at app//com.carrotsearch.randomizedtesting.rules.StatementAdapter.evaluate(StatementAdapter.java:36)
	at app//com.carrotsearch.randomizedtesting.rules.StatementAdapter.evaluate(StatementAdapter.java:36)
	at app//org.apache.lucene.tests.util.TestRuleAssertionsRequired$1.evaluate(TestRuleAssertionsRequired.java:53)
	at app//org.apache.lucene.tests.util.AbstractBeforeAfterRule$1.evaluate(AbstractBeforeAfterRule.java:43)
	at app//org.apache.lucene.tests.util.TestRuleMarkFailure$1.evaluate(TestRuleMarkFailure.java:44)
	at app//org.apache.lucene.tests.util.TestRuleIgnoreAfterMaxFailures$1.evaluate(TestRuleIgnoreAfterMaxFailures.java:60)
	at app//org.apache.lucene.tests.util.TestRuleIgnoreTestSuites$1.evaluate(TestRuleIgnoreTestSuites.java:47)
	at app//org.junit.rules.RunRules.evaluate(RunRules.java:20)
	at app//com.carrotsearch.randomizedtesting.rules.StatementAdapter.evaluate(StatementAdapter.java:36)
	at app//com.carrotsearch.randomizedtesting.ThreadLeakControl$StatementRunner.run(ThreadLeakControl.java:390)
	at app//com.carrotsearch.randomizedtesting.ThreadLeakControl.lambda$forkTimeoutingTask$0(ThreadLeakControl.java:850)
	at java.base@11.0.20.1/java.lang.Thread.run(Thread.java:839)


FAILED:  org.apache.lucene.codecs.compressing.TestFastDecompressionMode.testExtremelyLargeInput

Error Message:
java.lang.AssertionError

Stack Trace:
java.lang.AssertionError
	at __randomizedtesting.SeedInfo.seed([E17DA67C5488D3A3:8DC8DA250F9318D5]:0)
	at app//org.apache.lucene.util.compress.LZ4.decompress(LZ4.java:114)
	at app//org.apache.lucene.codecs.compressing.CompressionMode$4.decompress(CompressionMode.java:135)
	at app//org.apache.lucene.codecs.compressing.AbstractTestCompressionMode.decompress(AbstractTestCompressionMode.java:77)
	at app//org.apache.lucene.codecs.compressing.AbstractTestCompressionMode.decompress(AbstractTestCompressionMode.java:71)
	at app//org.apache.lucene.codecs.compressing.AbstractTestCompressionMode.test(AbstractTestCompressionMode.java:131)
	at app//org.apache.lucene.codecs.compressing.AbstractTestCompressionMode.test(AbstractTestCompressionMode.java:126)
	at app//org.apache.lucene.codecs.compressing.AbstractTestCompressionMode.testExtremelyLargeInput(AbstractTestCompressionMode.java:163)
	at java.base@11.0.20.1/jdk.internal.reflect.NativeMethodAccessorImpl.invoke0(Native Method)
	at java.base@11.0.20.1/jdk.internal.reflect.NativeMethodAccessorImpl.invoke(NativeMethodAccessorImpl.java:62)
	at java.base@11.0.20.1/jdk.internal.reflect.DelegatingMethodAccessorImpl.invoke(DelegatingMethodAccessorImpl.java:43)
	at java.base@11.0.20.1/java.lang.reflect.Method.invoke(Method.java:566)
	at app//com.carrotsearch.randomizedtesting.RandomizedRunner.invoke(RandomizedRunner.java:1758)
	at app//com.carrotsearch.randomizedtesting.RandomizedRunner$8.evaluate(RandomizedRunner.java:946)
	at app//com.carrotsearch.randomizedtesting.RandomizedRunner$9.evaluate(RandomizedRunner.java:982)
	at app//com.carrotsearch.randomizedtesting.RandomizedRunner$10.evaluate(RandomizedRunner.java:996)
	at app//org.apache.lucene.tests.util.TestRuleSetupTeardownChained$1.evaluate(TestRuleSetupTeardownChained.java:48)
	at app//org.apache.lucene.tests.util.AbstractBeforeAfterRule$1.evaluate(AbstractBeforeAfterRule.java:43)
	at app//org.apache.lucene.tests.util.TestRuleThreadAndTestName$1.evaluate(TestRuleThreadAndTestName.java:45)
	at app//org.apache.lucene.tests.util.TestRuleIgnoreAfterMaxFailures$1.evaluate(TestRuleIgnoreAfterMaxFailures.java:60)
	at app//org.apache.lucene.tests.util.TestRuleMarkFailure$1.evaluate(TestRuleMarkFailure.java:44)
	at app//org.junit.rules.RunRules.evaluate(RunRules.java:20)
	at app//com.carrotsearch.randomizedtesting.rules.StatementAdapter.evaluate(StatementAdapter.java:36)
	at app//com.carrotsearch.randomizedtesting.ThreadLeakControl$StatementRunner.run(ThreadLeakControl.java:390)
	at app//com.carrotsearch.randomizedtesting.ThreadLeakControl.forkTimeoutingTask(ThreadLeakControl.java:843)
	at app//com.carrotsearch.randomizedtesting.ThreadLeakControl$3.evaluate(ThreadLeakControl.java:490)
	at app//com.carrotsearch.randomizedtesting.RandomizedRunner.runSingleTest(RandomizedRunner.java:955)
	at app//com.carrotsearch.randomizedtesting.RandomizedRunner$5.evaluate(RandomizedRunner.java:840)
	at app//com.carrotsearch.randomizedtesting.RandomizedRunner$6.evaluate(RandomizedRunner.java:891)
	at app//com.carrotsearch.randomizedtesting.RandomizedRunner$7.evaluate(RandomizedRunner.java:902)
	at app//org.apache.lucene.tests.util.AbstractBeforeAfterRule$1.evaluate(AbstractBeforeAfterRule.java:43)
	at app//com.carrotsearch.randomizedtesting.rules.StatementAdapter.evaluate(StatementAdapter.java:36)
	at app//org.apache.lucene.tests.util.TestRuleStoreClassName$1.evaluate(TestRuleStoreClassName.java:38)
	at app//com.carrotsearch.randomizedtesting.rules.NoShadowingOrOverridesOnMethodsRule$1.evaluate(NoShadowingOrOverridesOnMethodsRule.java:40)
	at app//com.carrotsearch.randomizedtesting.rules.NoShadowingOrOverridesOnMethodsRule$1.evaluate(NoShadowingOrOverridesOnMethodsRule.java:40)
	at app//com.carrotsearch.randomizedtesting.rules.StatementAdapter.evaluate(StatementAdapter.java:36)
	at app//com.carrotsearch.randomizedtesting.rules.StatementAdapter.evaluate(StatementAdapter.java:36)
	at app//org.apache.lucene.tests.util.TestRuleAssertionsRequired$1.evaluate(TestRuleAssertionsRequired.java:53)
	at app//org.apache.lucene.tests.util.AbstractBeforeAfterRule$1.evaluate(AbstractBeforeAfterRule.java:43)
	at app//org.apache.lucene.tests.util.TestRuleMarkFailure$1.evaluate(TestRuleMarkFailure.java:44)
	at app//org.apache.lucene.tests.util.TestRuleIgnoreAfterMaxFailures$1.evaluate(TestRuleIgnoreAfterMaxFailures.java:60)
	at app//org.apache.lucene.tests.util.TestRuleIgnoreTestSuites$1.evaluate(TestRuleIgnoreTestSuites.java:47)
	at app//org.junit.rules.RunRules.evaluate(RunRules.java:20)
	at app//com.carrotsearch.randomizedtesting.rules.StatementAdapter.evaluate(StatementAdapter.java:36)
	at app//com.carrotsearch.randomizedtesting.ThreadLeakControl$StatementRunner.run(ThreadLeakControl.java:390)
	at app//com.carrotsearch.randomizedtesting.ThreadLeakControl.lambda$forkTimeoutingTask$0(ThreadLeakControl.java:850)
	at java.base@11.0.20.1/java.lang.Thread.run(Thread.java:839)


FAILED:  org.apache.lucene.codecs.lucene90.TestLucene90DocValuesFormat.testSortedSetVariableLengthBigVsStoredFields

Error Message:
java.lang.RuntimeException: Invalid vInt detected (too many bits)

Stack Trace:
java.lang.RuntimeException: Invalid vInt detected (too many bits)
	at __randomizedtesting.SeedInfo.seed([E17DA67C5488D3A3:84652EC0C7FBB0E8]:0)
	at app//org.apache.lucene.store.ByteArrayDataInput.readVInt(ByteArrayDataInput.java:128)
	at app//org.apache.lucene.codecs.lucene90.Lucene90DocValuesProducer$TermsDict.next(Lucene90DocValuesProducer.java:1103)
	at app//org.apache.lucene.codecs.lucene90.Lucene90DocValuesProducer$TermsDict.seekExact(Lucene90DocValuesProducer.java:1127)
	at app//org.apache.lucene.codecs.lucene90.Lucene90DocValuesProducer$BaseSortedSetDocValues.lookupOrd(Lucene90DocValuesProducer.java:1024)
	at app//org.apache.lucene.index.CheckIndex.checkSortedSetDocValues(CheckIndex.java:3565)
	at app//org.apache.lucene.index.CheckIndex.checkDocValues(CheckIndex.java:3663)
	at app//org.apache.lucene.index.CheckIndex.testDocValues(CheckIndex.java:3241)
	at app//org.apache.lucene.tests.util.TestUtil.checkReader(TestUtil.java:387)
	at app//org.apache.lucene.tests.util.TestUtil.checkReader(TestUtil.java:366)
	at app//org.apache.lucene.tests.index.BaseDocValuesFormatTestCase.doTestSortedSetVsStoredFields(BaseDocValuesFormatTestCase.java:2335)
	at app//org.apache.lucene.codecs.lucene90.TestLucene90DocValuesFormat.testSortedSetVariableLengthBigVsStoredFields(TestLucene90DocValuesFormat.java:92)
	at java.base@11.0.20.1/jdk.internal.reflect.NativeMethodAccessorImpl.invoke0(Native Method)
	at java.base@11.0.20.1/jdk.internal.reflect.NativeMethodAccessorImpl.invoke(NativeMethodAccessorImpl.java:62)
	at java.base@11.0.20.1/jdk.internal.reflect.DelegatingMethodAccessorImpl.invoke(DelegatingMethodAccessorImpl.java:43)
	at java.base@11.0.20.1/java.lang.reflect.Method.invoke(Method.java:566)
	at app//com.carrotsearch.randomizedtesting.RandomizedRunner.invoke(RandomizedRunner.java:1758)
	at app//com.carrotsearch.randomizedtesting.RandomizedRunner$8.evaluate(RandomizedRunner.java:946)
	at app//com.carrotsearch.randomizedtesting.RandomizedRunner$9.evaluate(RandomizedRunner.java:982)
	at app//com.carrotsearch.randomizedtesting.RandomizedRunner$10.evaluate(RandomizedRunner.java:996)
	at app//org.apache.lucene.tests.util.TestRuleSetupTeardownChained$1.evaluate(TestRuleSetupTeardownChained.java:48)
	at app//org.apache.lucene.tests.util.AbstractBeforeAfterRule$1.evaluate(AbstractBeforeAfterRule.java:43)
	at app//org.apache.lucene.tests.util.TestRuleThreadAndTestName$1.evaluate(TestRuleThreadAndTestName.java:45)
	at app//org.apache.lucene.tests.util.TestRuleIgnoreAfterMaxFailures$1.evaluate(TestRuleIgnoreAfterMaxFailures.java:60)
	at app//org.apache.lucene.tests.util.TestRuleMarkFailure$1.evaluate(TestRuleMarkFailure.java:44)
	at app//org.junit.rules.RunRules.evaluate(RunRules.java:20)
	at app//com.carrotsearch.randomizedtesting.rules.StatementAdapter.evaluate(StatementAdapter.java:36)
	at app//com.carrotsearch.randomizedtesting.ThreadLeakControl$StatementRunner.run(ThreadLeakControl.java:390)
	at app//com.carrotsearch.randomizedtesting.ThreadLeakControl.forkTimeoutingTask(ThreadLeakControl.java:843)
	at app//com.carrotsearch.randomizedtesting.ThreadLeakControl$3.evaluate(ThreadLeakControl.java:490)
	at app//com.carrotsearch.randomizedtesting.RandomizedRunner.runSingleTest(RandomizedRunner.java:955)
	at app//com.carrotsearch.randomizedtesting.RandomizedRunner$5.evaluate(RandomizedRunner.java:840)
	at app//com.carrotsearch.randomizedtesting.RandomizedRunner$6.evaluate(RandomizedRunner.java:891)
	at app//com.carrotsearch.randomizedtesting.RandomizedRunner$7.evaluate(RandomizedRunner.java:902)
	at app//org.apache.lucene.tests.util.AbstractBeforeAfterRule$1.evaluate(AbstractBeforeAfterRule.java:43)
	at app//com.carrotsearch.randomizedtesting.rules.StatementAdapter.evaluate(StatementAdapter.java:36)
	at app//org.apache.lucene.tests.util.TestRuleStoreClassName$1.evaluate(TestRuleStoreClassName.java:38)
	at app//com.carrotsearch.randomizedtesting.rules.NoShadowingOrOverridesOnMethodsRule$1.evaluate(NoShadowingOrOverridesOnMethodsRule.java:40)
	at app//com.carrotsearch.randomizedtesting.rules.NoShadowingOrOverridesOnMethodsRule$1.evaluate(NoShadowingOrOverridesOnMethodsRule.java:40)
	at app//com.carrotsearch.randomizedtesting.rules.StatementAdapter.evaluate(StatementAdapter.java:36)
	at app//com.carrotsearch.randomizedtesting.rules.StatementAdapter.evaluate(StatementAdapter.java:36)
	at app//org.apache.lucene.tests.util.TestRuleAssertionsRequired$1.evaluate(TestRuleAssertionsRequired.java:53)
	at app//org.apache.lucene.tests.util.AbstractBeforeAfterRule$1.evaluate(AbstractBeforeAfterRule.java:43)
	at app//org.apache.lucene.tests.util.TestRuleMarkFailure$1.evaluate(TestRuleMarkFailure.java:44)
	at app//org.apache.lucene.tests.util.TestRuleIgnoreAfterMaxFailures$1.evaluate(TestRuleIgnoreAfterMaxFailures.java:60)
	at app//org.apache.lucene.tests.util.TestRuleIgnoreTestSuites$1.evaluate(TestRuleIgnoreTestSuites.java:47)
	at app//org.junit.rules.RunRules.evaluate(RunRules.java:20)
	at app//com.carrotsearch.randomizedtesting.rules.StatementAdapter.evaluate(StatementAdapter.java:36)
	at app//com.carrotsearch.randomizedtesting.ThreadLeakControl$StatementRunner.run(ThreadLeakControl.java:390)
	at app//com.carrotsearch.randomizedtesting.ThreadLeakControl.lambda$forkTimeoutingTask$0(ThreadLeakControl.java:850)
	at java.base@11.0.20.1/java.lang.Thread.run(Thread.java:839)


FAILED:  org.apache.lucene.codecs.lucene90.TestLucene90DocValuesFormat.testSortedVariableLengthBigVsStoredFields

Error Message:
java.lang.IllegalStateException: this writer hit an unrecoverable error; cannot complete commit

Stack Trace:
java.lang.IllegalStateException: this writer hit an unrecoverable error; cannot complete commit
	at __randomizedtesting.SeedInfo.seed([E17DA67C5488D3A3:118DE1196793762C]:0)
	at app//org.apache.lucene.index.IndexWriter.finishCommit(IndexWriter.java:4159)
	at app//org.apache.lucene.index.IndexWriter.commitInternal(IndexWriter.java:4136)
	at app//org.apache.lucene.index.IndexWriter.commit(IndexWriter.java:4090)
	at app//org.apache.lucene.tests.index.RandomIndexWriter.commit(RandomIndexWriter.java:414)
	at app//org.apache.lucene.tests.index.RandomIndexWriter.commit(RandomIndexWriter.java:370)
	at app//org.apache.lucene.tests.index.BaseDocValuesFormatTestCase.doTestSortedVsStoredFields(BaseDocValuesFormatTestCase.java:1712)
	at app//org.apache.lucene.tests.index.BaseDocValuesFormatTestCase.doTestSortedVsStoredFields(BaseDocValuesFormatTestCase.java:1803)
	at app//org.apache.lucene.codecs.lucene90.TestLucene90DocValuesFormat.testSortedVariableLengthBigVsStoredFields(TestLucene90DocValuesFormat.java:107)
	at java.base@11.0.20.1/jdk.internal.reflect.NativeMethodAccessorImpl.invoke0(Native Method)
	at java.base@11.0.20.1/jdk.internal.reflect.NativeMethodAccessorImpl.invoke(NativeMethodAccessorImpl.java:62)
	at java.base@11.0.20.1/jdk.internal.reflect.DelegatingMethodAccessorImpl.invoke(DelegatingMethodAccessorImpl.java:43)
	at java.base@11.0.20.1/java.lang.reflect.Method.invoke(Method.java:566)
	at app//com.carrotsearch.randomizedtesting.RandomizedRunner.invoke(RandomizedRunner.java:1758)
	at app//com.carrotsearch.randomizedtesting.RandomizedRunner$8.evaluate(RandomizedRunner.java:946)
	at app//com.carrotsearch.randomizedtesting.RandomizedRunner$9.evaluate(RandomizedRunner.java:982)
	at app//com.carrotsearch.randomizedtesting.RandomizedRunner$10.evaluate(RandomizedRunner.java:996)
	at app//org.apache.lucene.tests.util.TestRuleSetupTeardownChained$1.evaluate(TestRuleSetupTeardownChained.java:48)
	at app//org.apache.lucene.tests.util.AbstractBeforeAfterRule$1.evaluate(AbstractBeforeAfterRule.java:43)
	at app//org.apache.lucene.tests.util.TestRuleThreadAndTestName$1.evaluate(TestRuleThreadAndTestName.java:45)
	at app//org.apache.lucene.tests.util.TestRuleIgnoreAfterMaxFailures$1.evaluate(TestRuleIgnoreAfterMaxFailures.java:60)
	at app//org.apache.lucene.tests.util.TestRuleMarkFailure$1.evaluate(TestRuleMarkFailure.java:44)
	at app//org.junit.rules.RunRules.evaluate(RunRules.java:20)
	at app//com.carrotsearch.randomizedtesting.rules.StatementAdapter.evaluate(StatementAdapter.java:36)
	at app//com.carrotsearch.randomizedtesting.ThreadLeakControl$StatementRunner.run(ThreadLeakControl.java:390)
	at app//com.carrotsearch.randomizedtesting.ThreadLeakControl.forkTimeoutingTask(ThreadLeakControl.java:843)
	at app//com.carrotsearch.randomizedtesting.ThreadLeakControl$3.evaluate(ThreadLeakControl.java:490)
	at app//com.carrotsearch.randomizedtesting.RandomizedRunner.runSingleTest(RandomizedRunner.java:955)
	at app//com.carrotsearch.randomizedtesting.RandomizedRunner$5.evaluate(RandomizedRunner.java:840)
	at app//com.carrotsearch.randomizedtesting.RandomizedRunner$6.evaluate(RandomizedRunner.java:891)
	at app//com.carrotsearch.randomizedtesting.RandomizedRunner$7.evaluate(RandomizedRunner.java:902)
	at app//org.apache.lucene.tests.util.AbstractBeforeAfterRule$1.evaluate(AbstractBeforeAfterRule.java:43)
	at app//com.carrotsearch.randomizedtesting.rules.StatementAdapter.evaluate(StatementAdapter.java:36)
	at app//org.apache.lucene.tests.util.TestRuleStoreClassName$1.evaluate(TestRuleStoreClassName.java:38)
	at app//com.carrotsearch.randomizedtesting.rules.NoShadowingOrOverridesOnMethodsRule$1.evaluate(NoShadowingOrOverridesOnMethodsRule.java:40)
	at app//com.carrotsearch.randomizedtesting.rules.NoShadowingOrOverridesOnMethodsRule$1.evaluate(NoShadowingOrOverridesOnMethodsRule.java:40)
	at app//com.carrotsearch.randomizedtesting.rules.StatementAdapter.evaluate(StatementAdapter.java:36)
	at app//com.carrotsearch.randomizedtesting.rules.StatementAdapter.evaluate(StatementAdapter.java:36)
	at app//org.apache.lucene.tests.util.TestRuleAssertionsRequired$1.evaluate(TestRuleAssertionsRequired.java:53)
	at app//org.apache.lucene.tests.util.AbstractBeforeAfterRule$1.evaluate(AbstractBeforeAfterRule.java:43)
	at app//org.apache.lucene.tests.util.TestRuleMarkFailure$1.evaluate(TestRuleMarkFailure.java:44)
	at app//org.apache.lucene.tests.util.TestRuleIgnoreAfterMaxFailures$1.evaluate(TestRuleIgnoreAfterMaxFailures.java:60)
	at app//org.apache.lucene.tests.util.TestRuleIgnoreTestSuites$1.evaluate(TestRuleIgnoreTestSuites.java:47)
	at app//org.junit.rules.RunRules.evaluate(RunRules.java:20)
	at app//com.carrotsearch.randomizedtesting.rules.StatementAdapter.evaluate(StatementAdapter.java:36)
	at app//com.carrotsearch.randomizedtesting.ThreadLeakControl$StatementRunner.run(ThreadLeakControl.java:390)
	at app//com.carrotsearch.randomizedtesting.ThreadLeakControl.lambda$forkTimeoutingTask$0(ThreadLeakControl.java:850)
	at java.base@11.0.20.1/java.lang.Thread.run(Thread.java:839)
Caused by: java.lang.ArrayIndexOutOfBoundsException: Array index out of range: -1910753152
	at java.base@11.0.20.1/java.lang.System.arraycopy(Native Method)
	at app//org.apache.lucene.store.ByteArrayDataInput.readBytes(ByteArrayDataInput.java:172)
	at app//org.apache.lucene.codecs.lucene90.Lucene90DocValuesProducer$TermsDict.next(Lucene90DocValuesProducer.java:1106)
	at app//org.apache.lucene.index.TermsEnumIndex.next(TermsEnumIndex.java:95)
	at app//org.apache.lucene.index.OrdinalMap.<init>(OrdinalMap.java:313)
	at app//org.apache.lucene.index.OrdinalMap.build(OrdinalMap.java:176)
	at app//org.apache.lucene.codecs.DocValuesConsumer.mergeSortedField(DocValuesConsumer.java:663)
	at app//org.apache.lucene.codecs.DocValuesConsumer.merge(DocValuesConsumer.java:146)
	at app//org.apache.lucene.codecs.perfield.PerFieldDocValuesFormat$FieldsWriter.merge(PerFieldDocValuesFormat.java:151)
	at app//org.apache.lucene.index.SegmentMerger.mergeDocValues(SegmentMerger.java:205)
	at app//org.apache.lucene.index.SegmentMerger.mergeWithLogging(SegmentMerger.java:325)
	at app//org.apache.lucene.index.SegmentMerger.lambda$merge$1(SegmentMerger.java:155)
	at app//org.apache.lucene.search.TaskExecutor$TaskGroup.lambda$createTask$0(TaskExecutor.java:117)
	at java.base@11.0.20.1/java.util.concurrent.FutureTask.run(FutureTask.java:264)
	at app//org.apache.lucene.util.SameThreadExecutorService.execute(SameThreadExecutorService.java:36)
	at app//org.apache.lucene.search.TaskExecutor$TaskGroup.invokeAll(TaskExecutor.java:152)
	at app//org.apache.lucene.search.TaskExecutor.invokeAll(TaskExecutor.java:76)
	at app//org.apache.lucene.index.SegmentMerger.merge(SegmentMerger.java:187)
	at app//org.apache.lucene.index.IndexWriter.mergeMiddle(IndexWriter.java:5290)
	at app//org.apache.lucene.index.IndexWriter.merge(IndexWriter.java:4758)
	at app//org.apache.lucene.index.IndexWriter$IndexWriterMergeSource.merge(IndexWriter.java:6579)
	at app//org.apache.lucene.index.ConcurrentMergeScheduler.doMerge(ConcurrentMergeScheduler.java:660)
	at app//org.apache.lucene.index.ConcurrentMergeScheduler$MergeThread.run(ConcurrentMergeScheduler.java:721)


FAILED:  org.apache.lucene.codecs.lucene90.TestLucene90DocValuesFormat.testDocValuesSimple

Error Message:
com.carrotsearch.randomizedtesting.UncaughtExceptionError: Captured an uncaught exception in thread: Thread[id=580, name=Lucene Merge Thread #0, state=RUNNABLE, group=TGRP-TestLucene90DocValuesFormat]

Stack Trace:
com.carrotsearch.randomizedtesting.UncaughtExceptionError: Captured an uncaught exception in thread: Thread[id=580, name=Lucene Merge Thread #0, state=RUNNABLE, group=TGRP-TestLucene90DocValuesFormat]
	at __randomizedtesting.SeedInfo.seed([E17DA67C5488D3A3:CC505D76E2B31721]:0)
Caused by: org.apache.lucene.index.MergePolicy$MergeException: java.lang.ArrayIndexOutOfBoundsException: Array index out of range: -1910753152
	at __randomizedtesting.SeedInfo.seed([E17DA67C5488D3A3]:0)
	at app//org.apache.lucene.index.ConcurrentMergeScheduler.handleMergeException(ConcurrentMergeScheduler.java:756)
	at app//org.apache.lucene.index.ConcurrentMergeScheduler$MergeThread.run(ConcurrentMergeScheduler.java:748)
Caused by: java.lang.ArrayIndexOutOfBoundsException: Array index out of range: -1910753152
	at java.base@11.0.20.1/java.lang.System.arraycopy(Native Method)
	at app//org.apache.lucene.store.ByteArrayDataInput.readBytes(ByteArrayDataInput.java:172)
	at app//org.apache.lucene.codecs.lucene90.Lucene90DocValuesProducer$TermsDict.next(Lucene90DocValuesProducer.java:1106)
	at app//org.apache.lucene.index.TermsEnumIndex.next(TermsEnumIndex.java:95)
	at app//org.apache.lucene.index.OrdinalMap.<init>(OrdinalMap.java:313)
	at app//org.apache.lucene.index.OrdinalMap.build(OrdinalMap.java:176)
	at app//org.apache.lucene.codecs.DocValuesConsumer.mergeSortedField(DocValuesConsumer.java:663)
	at app//org.apache.lucene.codecs.DocValuesConsumer.merge(DocValuesConsumer.java:146)
	at app//org.apache.lucene.codecs.perfield.PerFieldDocValuesFormat$FieldsWriter.merge(PerFieldDocValuesFormat.java:151)
	at app//org.apache.lucene.index.SegmentMerger.mergeDocValues(SegmentMerger.java:205)
	at app//org.apache.lucene.index.SegmentMerger.mergeWithLogging(SegmentMerger.java:325)
	at app//org.apache.lucene.index.SegmentMerger.lambda$merge$1(SegmentMerger.java:155)
	at app//org.apache.lucene.search.TaskExecutor$TaskGroup.lambda$createTask$0(TaskExecutor.java:117)
	at java.base@11.0.20.1/java.util.concurrent.FutureTask.run(FutureTask.java:264)
	at app//org.apache.lucene.util.SameThreadExecutorService.execute(SameThreadExecutorService.java:36)
	at app//org.apache.lucene.search.TaskExecutor$TaskGroup.invokeAll(TaskExecutor.java:152)
	at app//org.apache.lucene.search.TaskExecutor.invokeAll(TaskExecutor.java:76)
	at app//org.apache.lucene.index.SegmentMerger.merge(SegmentMerger.java:187)
	at app//org.apache.lucene.index.IndexWriter.mergeMiddle(IndexWriter.java:5290)
	at app//org.apache.lucene.index.IndexWriter.merge(IndexWriter.java:4758)
	at app//org.apache.lucene.index.IndexWriter$IndexWriterMergeSource.merge(IndexWriter.java:6579)
	at app//org.apache.lucene.index.ConcurrentMergeScheduler.doMerge(ConcurrentMergeScheduler.java:660)
	at app//org.apache.lucene.index.ConcurrentMergeScheduler$MergeThread.run(ConcurrentMergeScheduler.java:721)


FAILED:  org.apache.lucene.codecs.lucene90.TestLucene90DocValuesFormatMergeInstance.testSortedSetVariableLengthBigVsStoredFields

Error Message:
java.lang.RuntimeException: Invalid vInt detected (too many bits)

Stack Trace:
java.lang.RuntimeException: Invalid vInt detected (too many bits)
	at __randomizedtesting.SeedInfo.seed([E17DA67C5488D3A3:84652EC0C7FBB0E8]:0)
	at app//org.apache.lucene.store.ByteArrayDataInput.readVInt(ByteArrayDataInput.java:128)
	at app//org.apache.lucene.codecs.lucene90.Lucene90DocValuesProducer$TermsDict.next(Lucene90DocValuesProducer.java:1103)
	at app//org.apache.lucene.codecs.lucene90.Lucene90DocValuesProducer$TermsDict.seekExact(Lucene90DocValuesProducer.java:1127)
	at app//org.apache.lucene.codecs.lucene90.Lucene90DocValuesProducer$BaseSortedSetDocValues.lookupOrd(Lucene90DocValuesProducer.java:1024)
	at app//org.apache.lucene.index.CheckIndex.checkSortedSetDocValues(CheckIndex.java:3565)
	at app//org.apache.lucene.index.CheckIndex.checkDocValues(CheckIndex.java:3663)
	at app//org.apache.lucene.index.CheckIndex.testDocValues(CheckIndex.java:3241)
	at app//org.apache.lucene.tests.util.TestUtil.checkReader(TestUtil.java:387)
	at app//org.apache.lucene.tests.util.TestUtil.checkReader(TestUtil.java:366)
	at app//org.apache.lucene.tests.index.BaseDocValuesFormatTestCase.doTestSortedSetVsStoredFields(BaseDocValuesFormatTestCase.java:2335)
	at app//org.apache.lucene.codecs.lucene90.TestLucene90DocValuesFormat.testSortedSetVariableLengthBigVsStoredFields(TestLucene90DocValuesFormat.java:92)
	at java.base@11.0.20.1/jdk.internal.reflect.NativeMethodAccessorImpl.invoke0(Native Method)
	at java.base@11.0.20.1/jdk.internal.reflect.NativeMethodAccessorImpl.invoke(NativeMethodAccessorImpl.java:62)
	at java.base@11.0.20.1/jdk.internal.reflect.DelegatingMethodAccessorImpl.invoke(DelegatingMethodAccessorImpl.java:43)
	at java.base@11.0.20.1/java.lang.reflect.Method.invoke(Method.java:566)
	at app//com.carrotsearch.randomizedtesting.RandomizedRunner.invoke(RandomizedRunner.java:1758)
	at app//com.carrotsearch.randomizedtesting.RandomizedRunner$8.evaluate(RandomizedRunner.java:946)
	at app//com.carrotsearch.randomizedtesting.RandomizedRunner$9.evaluate(RandomizedRunner.java:982)
	at app//com.carrotsearch.randomizedtesting.RandomizedRunner$10.evaluate(RandomizedRunner.java:996)
	at app//org.apache.lucene.tests.util.TestRuleSetupTeardownChained$1.evaluate(TestRuleSetupTeardownChained.java:48)
	at app//org.apache.lucene.tests.util.AbstractBeforeAfterRule$1.evaluate(AbstractBeforeAfterRule.java:43)
	at app//org.apache.lucene.tests.util.TestRuleThreadAndTestName$1.evaluate(TestRuleThreadAndTestName.java:45)
	at app//org.apache.lucene.tests.util.TestRuleIgnoreAfterMaxFailures$1.evaluate(TestRuleIgnoreAfterMaxFailures.java:60)
	at app//org.apache.lucene.tests.util.TestRuleMarkFailure$1.evaluate(TestRuleMarkFailure.java:44)
	at app//org.junit.rules.RunRules.evaluate(RunRules.java:20)
	at app//com.carrotsearch.randomizedtesting.rules.StatementAdapter.evaluate(StatementAdapter.java:36)
	at app//com.carrotsearch.randomizedtesting.ThreadLeakControl$StatementRunner.run(ThreadLeakControl.java:390)
	at app//com.carrotsearch.randomizedtesting.ThreadLeakControl.forkTimeoutingTask(ThreadLeakControl.java:843)
	at app//com.carrotsearch.randomizedtesting.ThreadLeakControl$3.evaluate(ThreadLeakControl.java:490)
	at app//com.carrotsearch.randomizedtesting.RandomizedRunner.runSingleTest(RandomizedRunner.java:955)
	at app//com.carrotsearch.randomizedtesting.RandomizedRunner$5.evaluate(RandomizedRunner.java:840)
	at app//com.carrotsearch.randomizedtesting.RandomizedRunner$6.evaluate(RandomizedRunner.java:891)
	at app//com.carrotsearch.randomizedtesting.RandomizedRunner$7.evaluate(RandomizedRunner.java:902)
	at app//org.apache.lucene.tests.util.AbstractBeforeAfterRule$1.evaluate(AbstractBeforeAfterRule.java:43)
	at app//com.carrotsearch.randomizedtesting.rules.StatementAdapter.evaluate(StatementAdapter.java:36)
	at app//org.apache.lucene.tests.util.TestRuleStoreClassName$1.evaluate(TestRuleStoreClassName.java:38)
	at app//com.carrotsearch.randomizedtesting.rules.NoShadowingOrOverridesOnMethodsRule$1.evaluate(NoShadowingOrOverridesOnMethodsRule.java:40)
	at app//com.carrotsearch.randomizedtesting.rules.NoShadowingOrOverridesOnMethodsRule$1.evaluate(NoShadowingOrOverridesOnMethodsRule.java:40)
	at app//com.carrotsearch.randomizedtesting.rules.StatementAdapter.evaluate(StatementAdapter.java:36)
	at app//com.carrotsearch.randomizedtesting.rules.StatementAdapter.evaluate(StatementAdapter.java:36)
	at app//org.apache.lucene.tests.util.TestRuleAssertionsRequired$1.evaluate(TestRuleAssertionsRequired.java:53)
	at app//org.apache.lucene.tests.util.AbstractBeforeAfterRule$1.evaluate(AbstractBeforeAfterRule.java:43)
	at app//org.apache.lucene.tests.util.TestRuleMarkFailure$1.evaluate(TestRuleMarkFailure.java:44)
	at app//org.apache.lucene.tests.util.TestRuleIgnoreAfterMaxFailures$1.evaluate(TestRuleIgnoreAfterMaxFailures.java:60)
	at app//org.apache.lucene.tests.util.TestRuleIgnoreTestSuites$1.evaluate(TestRuleIgnoreTestSuites.java:47)
	at app//org.junit.rules.RunRules.evaluate(RunRules.java:20)
	at app//com.carrotsearch.randomizedtesting.rules.StatementAdapter.evaluate(StatementAdapter.java:36)
	at app//com.carrotsearch.randomizedtesting.ThreadLeakControl$StatementRunner.run(ThreadLeakControl.java:390)
	at app//com.carrotsearch.randomizedtesting.ThreadLeakControl.lambda$forkTimeoutingTask$0(ThreadLeakControl.java:850)
	at java.base@11.0.20.1/java.lang.Thread.run(Thread.java:839)


FAILED:  org.apache.lucene.codecs.lucene90.TestLucene90DocValuesFormatMergeInstance.testSortedVariableLengthBigVsStoredFields

Error Message:
java.lang.RuntimeException: Invalid vInt detected (too many bits)

Stack Trace:
java.lang.RuntimeException: Invalid vInt detected (too many bits)
	at __randomizedtesting.SeedInfo.seed([E17DA67C5488D3A3:118DE1196793762C]:0)
	at app//org.apache.lucene.store.ByteArrayDataInput.readVInt(ByteArrayDataInput.java:128)
	at app//org.apache.lucene.codecs.lucene90.Lucene90DocValuesProducer$TermsDict.next(Lucene90DocValuesProducer.java:1103)
	at app//org.apache.lucene.codecs.lucene90.Lucene90DocValuesProducer$TermsDict.seekExact(Lucene90DocValuesProducer.java:1127)
	at app//org.apache.lucene.codecs.lucene90.Lucene90DocValuesProducer$BaseSortedDocValues.lookupOrd(Lucene90DocValuesProducer.java:982)
	at app//org.apache.lucene.index.CheckIndex.checkSortedDocValues(CheckIndex.java:3469)
	at app//org.apache.lucene.index.CheckIndex.checkDocValues(CheckIndex.java:3652)
	at app//org.apache.lucene.index.CheckIndex.testDocValues(CheckIndex.java:3241)
	at app//org.apache.lucene.tests.util.TestUtil.checkReader(TestUtil.java:387)
	at app//org.apache.lucene.tests.util.TestUtil.checkReader(TestUtil.java:366)
	at app//org.apache.lucene.tests.index.BaseDocValuesFormatTestCase.doTestSortedVsStoredFields(BaseDocValuesFormatTestCase.java:1725)
	at app//org.apache.lucene.tests.index.BaseDocValuesFormatTestCase.doTestSortedVsStoredFields(BaseDocValuesFormatTestCase.java:1803)
	at app//org.apache.lucene.codecs.lucene90.TestLucene90DocValuesFormat.testSortedVariableLengthBigVsStoredFields(TestLucene90DocValuesFormat.java:107)
	at java.base@11.0.20.1/jdk.internal.reflect.NativeMethodAccessorImpl.invoke0(Native Method)
	at java.base@11.0.20.1/jdk.internal.reflect.NativeMethodAccessorImpl.invoke(NativeMethodAccessorImpl.java:62)
	at java.base@11.0.20.1/jdk.internal.reflect.DelegatingMethodAccessorImpl.invoke(DelegatingMethodAccessorImpl.java:43)
	at java.base@11.0.20.1/java.lang.reflect.Method.invoke(Method.java:566)
	at app//com.carrotsearch.randomizedtesting.RandomizedRunner.invoke(RandomizedRunner.java:1758)
	at app//com.carrotsearch.randomizedtesting.RandomizedRunner$8.evaluate(RandomizedRunner.java:946)
	at app//com.carrotsearch.randomizedtesting.RandomizedRunner$9.evaluate(RandomizedRunner.java:982)
	at app//com.carrotsearch.randomizedtesting.RandomizedRunner$10.evaluate(RandomizedRunner.java:996)
	at app//org.apache.lucene.tests.util.TestRuleSetupTeardownChained$1.evaluate(TestRuleSetupTeardownChained.java:48)
	at app//org.apache.lucene.tests.util.AbstractBeforeAfterRule$1.evaluate(AbstractBeforeAfterRule.java:43)
	at app//org.apache.lucene.tests.util.TestRuleThreadAndTestName$1.evaluate(TestRuleThreadAndTestName.java:45)
	at app//org.apache.lucene.tests.util.TestRuleIgnoreAfterMaxFailures$1.evaluate(TestRuleIgnoreAfterMaxFailures.java:60)
	at app//org.apache.lucene.tests.util.TestRuleMarkFailure$1.evaluate(TestRuleMarkFailure.java:44)
	at app//org.junit.rules.RunRules.evaluate(RunRules.java:20)
	at app//com.carrotsearch.randomizedtesting.rules.StatementAdapter.evaluate(StatementAdapter.java:36)
	at app//com.carrotsearch.randomizedtesting.ThreadLeakControl$StatementRunner.run(ThreadLeakControl.java:390)
	at app//com.carrotsearch.randomizedtesting.ThreadLeakControl.forkTimeoutingTask(ThreadLeakControl.java:843)
	at app//com.carrotsearch.randomizedtesting.ThreadLeakControl$3.evaluate(ThreadLeakControl.java:490)
	at app//com.carrotsearch.randomizedtesting.RandomizedRunner.runSingleTest(RandomizedRunner.java:955)
	at app//com.carrotsearch.randomizedtesting.RandomizedRunner$5.evaluate(RandomizedRunner.java:840)
	at app//com.carrotsearch.randomizedtesting.RandomizedRunner$6.evaluate(RandomizedRunner.java:891)
	at app//com.carrotsearch.randomizedtesting.RandomizedRunner$7.evaluate(RandomizedRunner.java:902)
	at app//org.apache.lucene.tests.util.AbstractBeforeAfterRule$1.evaluate(AbstractBeforeAfterRule.java:43)
	at app//com.carrotsearch.randomizedtesting.rules.StatementAdapter.evaluate(StatementAdapter.java:36)
	at app//org.apache.lucene.tests.util.TestRuleStoreClassName$1.evaluate(TestRuleStoreClassName.java:38)
	at app//com.carrotsearch.randomizedtesting.rules.NoShadowingOrOverridesOnMethodsRule$1.evaluate(NoShadowingOrOverridesOnMethodsRule.java:40)
	at app//com.carrotsearch.randomizedtesting.rules.NoShadowingOrOverridesOnMethodsRule$1.evaluate(NoShadowingOrOverridesOnMethodsRule.java:40)
	at app//com.carrotsearch.randomizedtesting.rules.StatementAdapter.evaluate(StatementAdapter.java:36)
	at app//com.carrotsearch.randomizedtesting.rules.StatementAdapter.evaluate(StatementAdapter.java:36)
	at app//org.apache.lucene.tests.util.TestRuleAssertionsRequired$1.evaluate(TestRuleAssertionsRequired.java:53)
	at app//org.apache.lucene.tests.util.AbstractBeforeAfterRule$1.evaluate(AbstractBeforeAfterRule.java:43)
	at app//org.apache.lucene.tests.util.TestRuleMarkFailure$1.evaluate(TestRuleMarkFailure.java:44)
	at app//org.apache.lucene.tests.util.TestRuleIgnoreAfterMaxFailures$1.evaluate(TestRuleIgnoreAfterMaxFailures.java:60)
	at app//org.apache.lucene.tests.util.TestRuleIgnoreTestSuites$1.evaluate(TestRuleIgnoreTestSuites.java:47)
	at app//org.junit.rules.RunRules.evaluate(RunRules.java:20)
	at app//com.carrotsearch.randomizedtesting.rules.StatementAdapter.evaluate(StatementAdapter.java:36)
	at app//com.carrotsearch.randomizedtesting.ThreadLeakControl$StatementRunner.run(ThreadLeakControl.java:390)
	at app//com.carrotsearch.randomizedtesting.ThreadLeakControl.lambda$forkTimeoutingTask$0(ThreadLeakControl.java:850)
	at java.base@11.0.20.1/java.lang.Thread.run(Thread.java:839)


FAILED:  org.apache.lucene.index.TestFilterIndexInput.testByteArrayDataInput

Error Message:
java.lang.RuntimeException: Invalid vInt detected (too many bits)

Stack Trace:
java.lang.RuntimeException: Invalid vInt detected (too many bits)
	at __randomizedtesting.SeedInfo.seed([E17DA67C5488D3A3:B4C59A62C954D938]:0)
	at app//org.apache.lucene.store.ByteArrayDataInput.readVInt(ByteArrayDataInput.java:128)
	at app//org.apache.lucene.index.TestIndexInput.checkRandomReads(TestIndexInput.java:259)
	at app//org.apache.lucene.index.TestIndexInput.testByteArrayDataInput(TestIndexInput.java:329)
	at java.base@11.0.20.1/jdk.internal.reflect.NativeMethodAccessorImpl.invoke0(Native Method)
	at java.base@11.0.20.1/jdk.internal.reflect.NativeMethodAccessorImpl.invoke(NativeMethodAccessorImpl.java:62)
	at java.base@11.0.20.1/jdk.internal.reflect.DelegatingMethodAccessorImpl.invoke(DelegatingMethodAccessorImpl.java:43)
	at java.base@11.0.20.1/java.lang.reflect.Method.invoke(Method.java:566)
	at app//com.carrotsearch.randomizedtesting.RandomizedRunner.invoke(RandomizedRunner.java:1758)
	at app//com.carrotsearch.randomizedtesting.RandomizedRunner$8.evaluate(RandomizedRunner.java:946)
	at app//com.carrotsearch.randomizedtesting.RandomizedRunner$9.evaluate(RandomizedRunner.java:982)
	at app//com.carrotsearch.randomizedtesting.RandomizedRunner$10.evaluate(RandomizedRunner.java:996)
	at app//org.apache.lucene.tests.util.TestRuleSetupTeardownChained$1.evaluate(TestRuleSetupTeardownChained.java:48)
	at app//org.apache.lucene.tests.util.AbstractBeforeAfterRule$1.evaluate(AbstractBeforeAfterRule.java:43)
	at app//org.apache.lucene.tests.util.TestRuleThreadAndTestName$1.evaluate(TestRuleThreadAndTestName.java:45)
	at app//org.apache.lucene.tests.util.TestRuleIgnoreAfterMaxFailures$1.evaluate(TestRuleIgnoreAfterMaxFailures.java:60)
	at app//org.apache.lucene.tests.util.TestRuleMarkFailure$1.evaluate(TestRuleMarkFailure.java:44)
	at app//org.junit.rules.RunRules.evaluate(RunRules.java:20)
	at app//com.carrotsearch.randomizedtesting.rules.StatementAdapter.evaluate(StatementAdapter.java:36)
	at app//com.carrotsearch.randomizedtesting.ThreadLeakControl$StatementRunner.run(ThreadLeakControl.java:390)
	at app//com.carrotsearch.randomizedtesting.ThreadLeakControl.forkTimeoutingTask(ThreadLeakControl.java:843)
	at app//com.carrotsearch.randomizedtesting.ThreadLeakControl$3.evaluate(ThreadLeakControl.java:490)
	at app//com.carrotsearch.randomizedtesting.RandomizedRunner.runSingleTest(RandomizedRunner.java:955)
	at app//com.carrotsearch.randomizedtesting.RandomizedRunner$5.evaluate(RandomizedRunner.java:840)
	at app//com.carrotsearch.randomizedtesting.RandomizedRunner$6.evaluate(RandomizedRunner.java:891)
	at app//com.carrotsearch.randomizedtesting.RandomizedRunner$7.evaluate(RandomizedRunner.java:902)
	at app//org.apache.lucene.tests.util.AbstractBeforeAfterRule$1.evaluate(AbstractBeforeAfterRule.java:43)
	at app//com.carrotsearch.randomizedtesting.rules.StatementAdapter.evaluate(StatementAdapter.java:36)
	at app//org.apache.lucene.tests.util.TestRuleStoreClassName$1.evaluate(TestRuleStoreClassName.java:38)
	at app//com.carrotsearch.randomizedtesting.rules.NoShadowingOrOverridesOnMethodsRule$1.evaluate(NoShadowingOrOverridesOnMethodsRule.java:40)
	at app//com.carrotsearch.randomizedtesting.rules.NoShadowingOrOverridesOnMethodsRule$1.evaluate(NoShadowingOrOverridesOnMethodsRule.java:40)
	at app//com.carrotsearch.randomizedtesting.rules.StatementAdapter.evaluate(StatementAdapter.java:36)
	at app//com.carrotsearch.randomizedtesting.rules.StatementAdapter.evaluate(StatementAdapter.java:36)
	at app//org.apache.lucene.tests.util.TestRuleAssertionsRequired$1.evaluate(TestRuleAssertionsRequired.java:53)
	at app//org.apache.lucene.tests.util.AbstractBeforeAfterRule$1.evaluate(AbstractBeforeAfterRule.java:43)
	at app//org.apache.lucene.tests.util.TestRuleMarkFailure$1.evaluate(TestRuleMarkFailure.java:44)
	at app//org.apache.lucene.tests.util.TestRuleIgnoreAfterMaxFailures$1.evaluate(TestRuleIgnoreAfterMaxFailures.java:60)
	at app//org.apache.lucene.tests.util.TestRuleIgnoreTestSuites$1.evaluate(TestRuleIgnoreTestSuites.java:47)
	at app//org.junit.rules.RunRules.evaluate(RunRules.java:20)
	at app//com.carrotsearch.randomizedtesting.rules.StatementAdapter.evaluate(StatementAdapter.java:36)
	at app//com.carrotsearch.randomizedtesting.ThreadLeakControl$StatementRunner.run(ThreadLeakControl.java:390)
	at app//com.carrotsearch.randomizedtesting.ThreadLeakControl.lambda$forkTimeoutingTask$0(ThreadLeakControl.java:850)
	at java.base@11.0.20.1/java.lang.Thread.run(Thread.java:839)


FAILED:  org.apache.lucene.index.TestFilterIndexInput.testRawFilterIndexInputRead

Error Message:
java.io.IOException: Invalid vInt detected (too many bits)

Stack Trace:
java.io.IOException: Invalid vInt detected (too many bits)
	at __randomizedtesting.SeedInfo.seed([E17DA67C5488D3A3:837D0B236CE22894]:0)
	at app//org.apache.lucene.store.DataInput.readVInt(DataInput.java:164)
	at app//org.apache.lucene.index.TestIndexInput.checkRandomReads(TestIndexInput.java:259)
	at app//org.apache.lucene.index.TestFilterIndexInput.testRawFilterIndexInputRead(TestFilterIndexInput.java:55)
	at java.base@11.0.20.1/jdk.internal.reflect.NativeMethodAccessorImpl.invoke0(Native Method)
	at java.base@11.0.20.1/jdk.internal.reflect.NativeMethodAccessorImpl.invoke(NativeMethodAccessorImpl.java:62)
	at java.base@11.0.20.1/jdk.internal.reflect.DelegatingMethodAccessorImpl.invoke(DelegatingMethodAccessorImpl.java:43)
	at java.base@11.0.20.1/java.lang.reflect.Method.invoke(Method.java:566)
	at app//com.carrotsearch.randomizedtesting.RandomizedRunner.invoke(RandomizedRunner.java:1758)
	at app//com.carrotsearch.randomizedtesting.RandomizedRunner$8.evaluate(RandomizedRunner.java:946)
	at app//com.carrotsearch.randomizedtesting.RandomizedRunner$9.evaluate(RandomizedRunner.java:982)
	at app//com.carrotsearch.randomizedtesting.RandomizedRunner$10.evaluate(RandomizedRunner.java:996)
	at app//org.apache.lucene.tests.util.TestRuleSetupTeardownChained$1.evaluate(TestRuleSetupTeardownChained.java:48)
	at app//org.apache.lucene.tests.util.AbstractBeforeAfterRule$1.evaluate(AbstractBeforeAfterRule.java:43)
	at app//org.apache.lucene.tests.util.TestRuleThreadAndTestName$1.evaluate(TestRuleThreadAndTestName.java:45)
	at app//org.apache.lucene.tests.util.TestRuleIgnoreAfterMaxFailures$1.evaluate(TestRuleIgnoreAfterMaxFailures.java:60)
	at app//org.apache.lucene.tests.util.TestRuleMarkFailure$1.evaluate(TestRuleMarkFailure.java:44)
	at app//org.junit.rules.RunRules.evaluate(RunRules.java:20)
	at app//com.carrotsearch.randomizedtesting.rules.StatementAdapter.evaluate(StatementAdapter.java:36)
	at app//com.carrotsearch.randomizedtesting.ThreadLeakControl$StatementRunner.run(ThreadLeakControl.java:390)
	at app//com.carrotsearch.randomizedtesting.ThreadLeakControl.forkTimeoutingTask(ThreadLeakControl.java:843)
	at app//com.carrotsearch.randomizedtesting.ThreadLeakControl$3.evaluate(ThreadLeakControl.java:490)
	at app//com.carrotsearch.randomizedtesting.RandomizedRunner.runSingleTest(RandomizedRunner.java:955)
	at app//com.carrotsearch.randomizedtesting.RandomizedRunner$5.evaluate(RandomizedRunner.java:840)
	at app//com.carrotsearch.randomizedtesting.RandomizedRunner$6.evaluate(RandomizedRunner.java:891)
	at app//com.carrotsearch.randomizedtesting.RandomizedRunner$7.evaluate(RandomizedRunner.java:902)
	at app//org.apache.lucene.tests.util.AbstractBeforeAfterRule$1.evaluate(AbstractBeforeAfterRule.java:43)
	at app//com.carrotsearch.randomizedtesting.rules.StatementAdapter.evaluate(StatementAdapter.java:36)
	at app//org.apache.lucene.tests.util.TestRuleStoreClassName$1.evaluate(TestRuleStoreClassName.java:38)
	at app//com.carrotsearch.randomizedtesting.rules.NoShadowingOrOverridesOnMethodsRule$1.evaluate(NoShadowingOrOverridesOnMethodsRule.java:40)
	at app//com.carrotsearch.randomizedtesting.rules.NoShadowingOrOverridesOnMethodsRule$1.evaluate(NoShadowingOrOverridesOnMethodsRule.java:40)
	at app//com.carrotsearch.randomizedtesting.rules.StatementAdapter.evaluate(StatementAdapter.java:36)
	at app//com.carrotsearch.randomizedtesting.rules.StatementAdapter.evaluate(StatementAdapter.java:36)
	at app//org.apache.lucene.tests.util.TestRuleAssertionsRequired$1.evaluate(TestRuleAssertionsRequired.java:53)
	at app//org.apache.lucene.tests.util.AbstractBeforeAfterRule$1.evaluate(AbstractBeforeAfterRule.java:43)
	at app//org.apache.lucene.tests.util.TestRuleMarkFailure$1.evaluate(TestRuleMarkFailure.java:44)
	at app//org.apache.lucene.tests.util.TestRuleIgnoreAfterMaxFailures$1.evaluate(TestRuleIgnoreAfterMaxFailures.java:60)
	at app//org.apache.lucene.tests.util.TestRuleIgnoreTestSuites$1.evaluate(TestRuleIgnoreTestSuites.java:47)
	at app//org.junit.rules.RunRules.evaluate(RunRules.java:20)
	at app//com.carrotsearch.randomizedtesting.rules.StatementAdapter.evaluate(StatementAdapter.java:36)
	at app//com.carrotsearch.randomizedtesting.ThreadLeakControl$StatementRunner.run(ThreadLeakControl.java:390)
	at app//com.carrotsearch.randomizedtesting.ThreadLeakControl.lambda$forkTimeoutingTask$0(ThreadLeakControl.java:850)
	at java.base@11.0.20.1/java.lang.Thread.run(Thread.java:839)


FAILED:  org.apache.lucene.index.TestFilterIndexInput.testRawIndexInputRead

Error Message:
java.io.IOException: Invalid vInt detected (too many bits)

Stack Trace:
java.io.IOException: Invalid vInt detected (too many bits)
	at __randomizedtesting.SeedInfo.seed([E17DA67C5488D3A3:7D4C095183CC1182]:0)
	at app//org.apache.lucene.store.DataInput.readVInt(DataInput.java:164)
	at app//org.apache.lucene.store.ByteBuffersIndexInput.readVInt(ByteBuffersIndexInput.java:115)
	at app//org.apache.lucene.tests.store.MockIndexInputWrapper.readVInt(MockIndexInputWrapper.java:190)
	at app//org.apache.lucene.index.TestIndexInput.checkRandomReads(TestIndexInput.java:259)
	at app//org.apache.lucene.index.TestIndexInput.testRawIndexInputRead(TestIndexInput.java:318)
	at java.base@11.0.20.1/jdk.internal.reflect.NativeMethodAccessorImpl.invoke0(Native Method)
	at java.base@11.0.20.1/jdk.internal.reflect.NativeMethodAccessorImpl.invoke(NativeMethodAccessorImpl.java:62)
	at java.base@11.0.20.1/jdk.internal.reflect.DelegatingMethodAccessorImpl.invoke(DelegatingMethodAccessorImpl.java:43)
	at java.base@11.0.20.1/java.lang.reflect.Method.invoke(Method.java:566)
	at app//com.carrotsearch.randomizedtesting.RandomizedRunner.invoke(RandomizedRunner.java:1758)
	at app//com.carrotsearch.randomizedtesting.RandomizedRunner$8.evaluate(RandomizedRunner.java:946)
	at app//com.carrotsearch.randomizedtesting.RandomizedRunner$9.evaluate(RandomizedRunner.java:982)
	at app//com.carrotsearch.randomizedtesting.RandomizedRunner$10.evaluate(RandomizedRunner.java:996)
	at app//org.apache.lucene.tests.util.TestRuleSetupTeardownChained$1.evaluate(TestRuleSetupTeardownChained.java:48)
	at app//org.apache.lucene.tests.util.AbstractBeforeAfterRule$1.evaluate(AbstractBeforeAfterRule.java:43)
	at app//org.apache.lucene.tests.util.TestRuleThreadAndTestName$1.evaluate(TestRuleThreadAndTestName.java:45)
	at app//org.apache.lucene.tests.util.TestRuleIgnoreAfterMaxFailures$1.evaluate(TestRuleIgnoreAfterMaxFailures.java:60)
	at app//org.apache.lucene.tests.util.TestRuleMarkFailure$1.evaluate(TestRuleMarkFailure.java:44)
	at app//org.junit.rules.RunRules.evaluate(RunRules.java:20)
	at app//com.carrotsearch.randomizedtesting.rules.StatementAdapter.evaluate(StatementAdapter.java:36)
	at app//com.carrotsearch.randomizedtesting.ThreadLeakControl$StatementRunner.run(ThreadLeakControl.java:390)
	at app//com.carrotsearch.randomizedtesting.ThreadLeakControl.forkTimeoutingTask(ThreadLeakControl.java:843)
	at app//com.carrotsearch.randomizedtesting.ThreadLeakControl$3.evaluate(ThreadLeakControl.java:490)
	at app//com.carrotsearch.randomizedtesting.RandomizedRunner.runSingleTest(RandomizedRunner.java:955)
	at app//com.carrotsearch.randomizedtesting.RandomizedRunner$5.evaluate(RandomizedRunner.java:840)
	at app//com.carrotsearch.randomizedtesting.RandomizedRunner$6.evaluate(RandomizedRunner.java:891)
	at app//com.carrotsearch.randomizedtesting.RandomizedRunner$7.evaluate(RandomizedRunner.java:902)
	at app//org.apache.lucene.tests.util.AbstractBeforeAfterRule$1.evaluate(AbstractBeforeAfterRule.java:43)
	at app//com.carrotsearch.randomizedtesting.rules.StatementAdapter.evaluate(StatementAdapter.java:36)
	at app//org.apache.lucene.tests.util.TestRuleStoreClassName$1.evaluate(TestRuleStoreClassName.java:38)
	at app//com.carrotsearch.randomizedtesting.rules.NoShadowingOrOverridesOnMethodsRule$1.evaluate(NoShadowingOrOverridesOnMethodsRule.java:40)
	at app//com.carrotsearch.randomizedtesting.rules.NoShadowingOrOverridesOnMethodsRule$1.evaluate(NoShadowingOrOverridesOnMethodsRule.java:40)
	at app//com.carrotsearch.randomizedtesting.rules.StatementAdapter.evaluate(StatementAdapter.java:36)
	at app//com.carrotsearch.randomizedtesting.rules.StatementAdapter.evaluate(StatementAdapter.java:36)
	at app//org.apache.lucene.tests.util.TestRuleAssertionsRequired$1.evaluate(TestRuleAssertionsRequired.java:53)
	at app//org.apache.lucene.tests.util.AbstractBeforeAfterRule$1.evaluate(AbstractBeforeAfterRule.java:43)
	at app//org.apache.lucene.tests.util.TestRuleMarkFailure$1.evaluate(TestRuleMarkFailure.java:44)
	at app//org.apache.lucene.tests.util.TestRuleIgnoreAfterMaxFailures$1.evaluate(TestRuleIgnoreAfterMaxFailures.java:60)
	at app//org.apache.lucene.tests.util.TestRuleIgnoreTestSuites$1.evaluate(TestRuleIgnoreTestSuites.java:47)
	at app//org.junit.rules.RunRules.evaluate(RunRules.java:20)
	at app//com.carrotsearch.randomizedtesting.rules.StatementAdapter.evaluate(StatementAdapter.java:36)
	at app//com.carrotsearch.randomizedtesting.ThreadLeakControl$StatementRunner.run(ThreadLeakControl.java:390)
	at app//com.carrotsearch.randomizedtesting.ThreadLeakControl.lambda$forkTimeoutingTask$0(ThreadLeakControl.java:850)
	at java.base@11.0.20.1/java.lang.Thread.run(Thread.java:839)


FAILED:  org.apache.lucene.index.TestIndexInput.testByteArrayDataInput

Error Message:
java.lang.RuntimeException: Invalid vInt detected (too many bits)

Stack Trace:
java.lang.RuntimeException: Invalid vInt detected (too many bits)
	at __randomizedtesting.SeedInfo.seed([E17DA67C5488D3A3:B4C59A62C954D938]:0)
	at app//org.apache.lucene.store.ByteArrayDataInput.readVInt(ByteArrayDataInput.java:128)
	at app//org.apache.lucene.index.TestIndexInput.checkRandomReads(TestIndexInput.java:259)
	at app//org.apache.lucene.index.TestIndexInput.testByteArrayDataInput(TestIndexInput.java:329)
	at java.base@11.0.20.1/jdk.internal.reflect.NativeMethodAccessorImpl.invoke0(Native Method)
	at java.base@11.0.20.1/jdk.internal.reflect.NativeMethodAccessorImpl.invoke(NativeMethodAccessorImpl.java:62)
	at java.base@11.0.20.1/jdk.internal.reflect.DelegatingMethodAccessorImpl.invoke(DelegatingMethodAccessorImpl.java:43)
	at java.base@11.0.20.1/java.lang.reflect.Method.invoke(Method.java:566)
	at app//com.carrotsearch.randomizedtesting.RandomizedRunner.invoke(RandomizedRunner.java:1758)
	at app//com.carrotsearch.randomizedtesting.RandomizedRunner$8.evaluate(RandomizedRunner.java:946)
	at app//com.carrotsearch.randomizedtesting.RandomizedRunner$9.evaluate(RandomizedRunner.java:982)
	at app//com.carrotsearch.randomizedtesting.RandomizedRunner$10.evaluate(RandomizedRunner.java:996)
	at app//org.apache.lucene.tests.util.TestRuleSetupTeardownChained$1.evaluate(TestRuleSetupTeardownChained.java:48)
	at app//org.apache.lucene.tests.util.AbstractBeforeAfterRule$1.evaluate(AbstractBeforeAfterRule.java:43)
	at app//org.apache.lucene.tests.util.TestRuleThreadAndTestName$1.evaluate(TestRuleThreadAndTestName.java:45)
	at app//org.apache.lucene.tests.util.TestRuleIgnoreAfterMaxFailures$1.evaluate(TestRuleIgnoreAfterMaxFailures.java:60)
	at app//org.apache.lucene.tests.util.TestRuleMarkFailure$1.evaluate(TestRuleMarkFailure.java:44)
	at app//org.junit.rules.RunRules.evaluate(RunRules.java:20)
	at app//com.carrotsearch.randomizedtesting.rules.StatementAdapter.evaluate(StatementAdapter.java:36)
	at app//com.carrotsearch.randomizedtesting.ThreadLeakControl$StatementRunner.run(ThreadLeakControl.java:390)
	at app//com.carrotsearch.randomizedtesting.ThreadLeakControl.forkTimeoutingTask(ThreadLeakControl.java:843)
	at app//com.carrotsearch.randomizedtesting.ThreadLeakControl$3.evaluate(ThreadLeakControl.java:490)
	at app//com.carrotsearch.randomizedtesting.RandomizedRunner.runSingleTest(RandomizedRunner.java:955)
	at app//com.carrotsearch.randomizedtesting.RandomizedRunner$5.evaluate(RandomizedRunner.java:840)
	at app//com.carrotsearch.randomizedtesting.RandomizedRunner$6.evaluate(RandomizedRunner.java:891)
	at app//com.carrotsearch.randomizedtesting.RandomizedRunner$7.evaluate(RandomizedRunner.java:902)
	at app//org.apache.lucene.tests.util.AbstractBeforeAfterRule$1.evaluate(AbstractBeforeAfterRule.java:43)
	at app//com.carrotsearch.randomizedtesting.rules.StatementAdapter.evaluate(StatementAdapter.java:36)
	at app//org.apache.lucene.tests.util.TestRuleStoreClassName$1.evaluate(TestRuleStoreClassName.java:38)
	at app//com.carrotsearch.randomizedtesting.rules.NoShadowingOrOverridesOnMethodsRule$1.evaluate(NoShadowingOrOverridesOnMethodsRule.java:40)
	at app//com.carrotsearch.randomizedtesting.rules.NoShadowingOrOverridesOnMethodsRule$1.evaluate(NoShadowingOrOverridesOnMethodsRule.java:40)
	at app//com.carrotsearch.randomizedtesting.rules.StatementAdapter.evaluate(StatementAdapter.java:36)
	at app//com.carrotsearch.randomizedtesting.rules.StatementAdapter.evaluate(StatementAdapter.java:36)
	at app//org.apache.lucene.tests.util.TestRuleAssertionsRequired$1.evaluate(TestRuleAssertionsRequired.java:53)
	at app//org.apache.lucene.tests.util.AbstractBeforeAfterRule$1.evaluate(AbstractBeforeAfterRule.java:43)
	at app//org.apache.lucene.tests.util.TestRuleMarkFailure$1.evaluate(TestRuleMarkFailure.java:44)
	at app//org.apache.lucene.tests.util.TestRuleIgnoreAfterMaxFailures$1.evaluate(TestRuleIgnoreAfterMaxFailures.java:60)
	at app//org.apache.lucene.tests.util.TestRuleIgnoreTestSuites$1.evaluate(TestRuleIgnoreTestSuites.java:47)
	at app//org.junit.rules.RunRules.evaluate(RunRules.java:20)
	at app//com.carrotsearch.randomizedtesting.rules.StatementAdapter.evaluate(StatementAdapter.java:36)
	at app//com.carrotsearch.randomizedtesting.ThreadLeakControl$StatementRunner.run(ThreadLeakControl.java:390)
	at app//com.carrotsearch.randomizedtesting.ThreadLeakControl.lambda$forkTimeoutingTask$0(ThreadLeakControl.java:850)
	at java.base@11.0.20.1/java.lang.Thread.run(Thread.java:839)


FAILED:  org.apache.lucene.index.TestIndexInput.testRawIndexInputRead

Error Message:
java.io.IOException: Invalid vInt detected (too many bits)

Stack Trace:
java.io.IOException: Invalid vInt detected (too many bits)
	at __randomizedtesting.SeedInfo.seed([E17DA67C5488D3A3:7D4C095183CC1182]:0)
	at app//org.apache.lucene.store.DataInput.readVInt(DataInput.java:164)
	at app//org.apache.lucene.store.ByteBuffersIndexInput.readVInt(ByteBuffersIndexInput.java:115)
	at app//org.apache.lucene.tests.store.MockIndexInputWrapper.readVInt(MockIndexInputWrapper.java:190)
	at app//org.apache.lucene.index.TestIndexInput.checkRandomReads(TestIndexInput.java:259)
	at app//org.apache.lucene.index.TestIndexInput.testRawIndexInputRead(TestIndexInput.java:318)
	at java.base@11.0.20.1/jdk.internal.reflect.NativeMethodAccessorImpl.invoke0(Native Method)
	at java.base@11.0.20.1/jdk.internal.reflect.NativeMethodAccessorImpl.invoke(NativeMethodAccessorImpl.java:62)
	at java.base@11.0.20.1/jdk.internal.reflect.DelegatingMethodAccessorImpl.invoke(DelegatingMethodAccessorImpl.java:43)
	at java.base@11.0.20.1/java.lang.reflect.Method.invoke(Method.java:566)
	at app//com.carrotsearch.randomizedtesting.RandomizedRunner.invoke(RandomizedRunner.java:1758)
	at app//com.carrotsearch.randomizedtesting.RandomizedRunner$8.evaluate(RandomizedRunner.java:946)
	at app//com.carrotsearch.randomizedtesting.RandomizedRunner$9.evaluate(RandomizedRunner.java:982)
	at app//com.carrotsearch.randomizedtesting.RandomizedRunner$10.evaluate(RandomizedRunner.java:996)
	at app//org.apache.lucene.tests.util.TestRuleSetupTeardownChained$1.evaluate(TestRuleSetupTeardownChained.java:48)
	at app//org.apache.lucene.tests.util.AbstractBeforeAfterRule$1.evaluate(AbstractBeforeAfterRule.java:43)
	at app//org.apache.lucene.tests.util.TestRuleThreadAndTestName$1.evaluate(TestRuleThreadAndTestName.java:45)
	at app//org.apache.lucene.tests.util.TestRuleIgnoreAfterMaxFailures$1.evaluate(TestRuleIgnoreAfterMaxFailures.java:60)
	at app//org.apache.lucene.tests.util.TestRuleMarkFailure$1.evaluate(TestRuleMarkFailure.java:44)
	at app//org.junit.rules.RunRules.evaluate(RunRules.java:20)
	at app//com.carrotsearch.randomizedtesting.rules.StatementAdapter.evaluate(StatementAdapter.java:36)
	at app//com.carrotsearch.randomizedtesting.ThreadLeakControl$StatementRunner.run(ThreadLeakControl.java:390)
	at app//com.carrotsearch.randomizedtesting.ThreadLeakControl.forkTimeoutingTask(ThreadLeakControl.java:843)
	at app//com.carrotsearch.randomizedtesting.ThreadLeakControl$3.evaluate(ThreadLeakControl.java:490)
	at app//com.carrotsearch.randomizedtesting.RandomizedRunner.runSingleTest(RandomizedRunner.java:955)
	at app//com.carrotsearch.randomizedtesting.RandomizedRunner$5.evaluate(RandomizedRunner.java:840)
	at app//com.carrotsearch.randomizedtesting.RandomizedRunner$6.evaluate(RandomizedRunner.java:891)
	at app//com.carrotsearch.randomizedtesting.RandomizedRunner$7.evaluate(RandomizedRunner.java:902)
	at app//org.apache.lucene.tests.util.AbstractBeforeAfterRule$1.evaluate(AbstractBeforeAfterRule.java:43)
	at app//com.carrotsearch.randomizedtesting.rules.StatementAdapter.evaluate(StatementAdapter.java:36)
	at app//org.apache.lucene.tests.util.TestRuleStoreClassName$1.evaluate(TestRuleStoreClassName.java:38)
	at app//com.carrotsearch.randomizedtesting.rules.NoShadowingOrOverridesOnMethodsRule$1.evaluate(NoShadowingOrOverridesOnMethodsRule.java:40)
	at app//com.carrotsearch.randomizedtesting.rules.NoShadowingOrOverridesOnMethodsRule$1.evaluate(NoShadowingOrOverridesOnMethodsRule.java:40)
	at app//com.carrotsearch.randomizedtesting.rules.StatementAdapter.evaluate(StatementAdapter.java:36)
	at app//com.carrotsearch.randomizedtesting.rules.StatementAdapter.evaluate(StatementAdapter.java:36)
	at app//org.apache.lucene.tests.util.TestRuleAssertionsRequired$1.evaluate(TestRuleAssertionsRequired.java:53)
	at app//org.apache.lucene.tests.util.AbstractBeforeAfterRule$1.evaluate(AbstractBeforeAfterRule.java:43)
	at app//org.apache.lucene.tests.util.TestRuleMarkFailure$1.evaluate(TestRuleMarkFailure.java:44)
	at app//org.apache.lucene.tests.util.TestRuleIgnoreAfterMaxFailures$1.evaluate(TestRuleIgnoreAfterMaxFailures.java:60)
	at app//org.apache.lucene.tests.util.TestRuleIgnoreTestSuites$1.evaluate(TestRuleIgnoreTestSuites.java:47)
	at app//org.junit.rules.RunRules.evaluate(RunRules.java:20)
	at app//com.carrotsearch.randomizedtesting.rules.StatementAdapter.evaluate(StatementAdapter.java:36)
	at app//com.carrotsearch.randomizedtesting.ThreadLeakControl$StatementRunner.run(ThreadLeakControl.java:390)
	at app//com.carrotsearch.randomizedtesting.ThreadLeakControl.lambda$forkTimeoutingTask$0(ThreadLeakControl.java:850)
	at java.base@11.0.20.1/java.lang.Thread.run(Thread.java:839)